oodt-dev mailing list archives

Site index · List index
Message view « Date » · « Thread »
Top « Date » · « Thread »
From Apache Jenkins Server <jenk...@builds.apache.org>
Subject Build failed in Jenkins: oodt-trunk » Common Utilities #2014
Date Tue, 06 Oct 2015 21:54:42 GMT
See <https://builds.apache.org/job/oodt-trunk/org.apache.oodt$oodt-commons/2014/>

------------------------------------------
[...truncated 6 lines...]
Downloading: http://repo1.maven.org/maven2/org/apache/maven/plugins/maven-resources-plugin/2.6/maven-resources-plugin-2.6.jar
28K downloaded  (maven-resources-plugin-2.6.jar)
Downloading: http://repo1.maven.org/maven2/org/apache/maven/plugins/maven-surefire-plugin/2.4/maven-surefire-plugin-2.4.pom
6K downloaded  (maven-surefire-plugin-2.4.pom)
Downloading: http://repo1.maven.org/maven2/org/apache/maven/surefire/surefire/2.4/surefire-2.4.pom
6K downloaded  (surefire-2.4.pom)
Downloading: http://repo1.maven.org/maven2/org/apache/maven/maven-parent/7/maven-parent-7.pom
20K downloaded  (maven-parent-7.pom)
Downloading: http://repo1.maven.org/maven2/org/apache/maven/plugins/maven-surefire-plugin/2.4/maven-surefire-plugin-2.4.jar
21K downloaded  (maven-surefire-plugin-2.4.jar)
[INFO] [remote-resources:process {execution: default}]
Downloading: http://repo1.maven.org/maven2/commons-collections/commons-collections/2.1/commons-collections-2.1.pom
3K downloaded  (commons-collections-2.1.pom)
Downloading: http://repo1.maven.org/maven2/commons-dbcp/commons-dbcp/1.2.1/commons-dbcp-1.2.1.pom
6K downloaded  (commons-dbcp-1.2.1.pom)
Downloading: http://repo1.maven.org/maven2/commons-pool/commons-pool/1.2/commons-pool-1.2.pom
4K downloaded  (commons-pool-1.2.pom)
Downloading: http://repo1.maven.org/maven2/xml-apis/xml-apis/2.0.2/xml-apis-2.0.2.pom
346b downloaded  (xml-apis-2.0.2.pom)
Downloading: http://repo1.maven.org/maven2/xerces/xerces/2.0.2/xerces-2.0.2.pom
311b downloaded  (xerces-2.0.2.pom)
Downloading: http://repo1.maven.org/maven2/xerces/xercesImpl/2.0.2/xercesImpl-2.0.2.pom
150b downloaded  (xercesImpl-2.0.2.pom)
Downloading: http://repo1.maven.org/maven2/commons-lang/commons-lang/2.3/commons-lang-2.3.pom
10K downloaded  (commons-lang-2.3.pom)
Downloading: http://repo1.maven.org/maven2/org/springframework/spring-core/2.5.4/spring-core-2.5.4.pom
2K downloaded  (spring-core-2.5.4.pom)
Downloading: http://repo1.maven.org/maven2/org/springframework/spring-hibernate3/2.0.8/spring-hibernate3-2.0.8.pom
3K downloaded  (spring-hibernate3-2.0.8.pom)
Downloading: http://repo1.maven.org/maven2/aopalliance/aopalliance/1.0/aopalliance-1.0.pom
363b downloaded  (aopalliance-1.0.pom)
Downloading: http://repo1.maven.org/maven2/org/hibernate/hibernate/3.2.5.ga/hibernate-3.2.5.ga.pom
3K downloaded  (hibernate-3.2.5.ga.pom)
Downloading: http://repo1.maven.org/maven2/net/sf/ehcache/ehcache/1.2.3/ehcache-1.2.3.pom
19K downloaded  (ehcache-1.2.3.pom)
Downloading: http://repo1.maven.org/maven2/asm/asm-attrs/1.5.3/asm-attrs-1.5.3.pom
821b downloaded  (asm-attrs-1.5.3.pom)
Downloading: http://repo1.maven.org/maven2/dom4j/dom4j/1.6.1/dom4j-1.6.1.pom
6K downloaded  (dom4j-1.6.1.pom)
Downloading: http://repo1.maven.org/maven2/antlr/antlr/2.7.6/antlr-2.7.6.pom
230b downloaded  (antlr-2.7.6.pom)
Downloading: http://repo1.maven.org/maven2/cglib/cglib/2.1_3/cglib-2.1_3.pom
373b downloaded  (cglib-2.1_3.pom)
Downloading: http://repo1.maven.org/maven2/asm/asm/1.5.3/asm-1.5.3.pom
809b downloaded  (asm-1.5.3.pom)
Downloading: http://repo1.maven.org/maven2/org/springframework/spring-beans/2.5.4/spring-beans-2.5.4.pom
2K downloaded  (spring-beans-2.5.4.pom)
Downloading: http://repo1.maven.org/maven2/org/springframework/spring-context/2.5.4/spring-context-2.5.4.pom
3K downloaded  (spring-context-2.5.4.pom)
Downloading: http://repo1.maven.org/maven2/org/springframework/spring-dao/2.0.8/spring-dao-2.0.8.pom
2K downloaded  (spring-dao-2.0.8.pom)
Downloading: http://repo1.maven.org/maven2/org/springframework/spring-jdbc/2.0.8/spring-jdbc-2.0.8.pom
2K downloaded  (spring-jdbc-2.0.8.pom)
Downloading: http://repo1.maven.org/maven2/xmlrpc/xmlrpc/2.0.1/xmlrpc-2.0.1.pom
146b downloaded  (xmlrpc-2.0.1.pom)
Downloading: http://repo1.maven.org/maven2/dom4j/dom4j/1.6.1/dom4j-1.6.1.jar
Downloading: http://repo1.maven.org/maven2/commons-dbcp/commons-dbcp/1.2.1/commons-dbcp-1.2.1.jar
Downloading: http://repo1.maven.org/maven2/antlr/antlr/2.7.6/antlr-2.7.6.jar
Downloading: http://repo1.maven.org/maven2/org/springframework/spring-core/2.5.4/spring-core-2.5.4.jar
Downloading: http://repo1.maven.org/maven2/aopalliance/aopalliance/1.0/aopalliance-1.0.jar
4K downloaded  (aopalliance-1.0.jar)
306K downloaded  (dom4j-1.6.1.jar)
Downloading: http://repo1.maven.org/maven2/xmlrpc/xmlrpc/2.0.1/xmlrpc-2.0.1.jar
Downloading: http://repo1.maven.org/maven2/commons-pool/commons-pool/1.2/commons-pool-1.2.jar
41K downloaded  (commons-pool-1.2.jar)
105K downloaded  (commons-dbcp-1.2.1.jar)
Downloading: http://repo1.maven.org/maven2/org/hibernate/hibernate/3.2.5.ga/hibernate-3.2.5.ga.jar
Downloading: http://repo1.maven.org/maven2/commons-lang/commons-lang/2.3/commons-lang-2.3.jar
279K downloaded  (spring-core-2.5.4.jar)
113K downloaded  (xmlrpc-2.0.1.jar)
433K downloaded  (antlr-2.7.6.jar)
Downloading: http://repo1.maven.org/maven2/commons-logging/commons-logging/1.0.3/commons-logging-1.0.3.jar
Downloading: http://repo1.maven.org/maven2/cglib/cglib/2.1_3/cglib-2.1_3.jar
Downloading: http://repo1.maven.org/maven2/net/sf/ehcache/ehcache/1.2.3/ehcache-1.2.3.jar
239K downloaded  (commons-lang-2.3.jar)
30K downloaded  (commons-logging-1.0.3.jar)
203K downloaded  (ehcache-1.2.3.jar)
Downloading: http://repo1.maven.org/maven2/xml-apis/xml-apis/1.0.b2/xml-apis-1.0.b2.jar
Downloading: http://repo1.maven.org/maven2/asm/asm-attrs/1.5.3/asm-attrs-1.5.3.jar
2202K downloaded  (hibernate-3.2.5.ga.jar)
Downloading: http://repo1.maven.org/maven2/commons-collections/commons-collections/2.1/commons-collections-2.1.jar
106K downloaded  (xml-apis-1.0.b2.jar)
275K downloaded  (cglib-2.1_3.jar)
16K downloaded  (asm-attrs-1.5.3.jar)
Downloading: http://repo1.maven.org/maven2/org/springframework/spring-hibernate3/2.0.8/spring-hibernate3-2.0.8.jar
161K downloaded  (commons-collections-2.1.jar)
Downloading: http://repo1.maven.org/maven2/asm/asm/1.5.3/asm-1.5.3.jar
104K downloaded  (spring-hibernate3-2.0.8.jar)
25K downloaded  (asm-1.5.3.jar)
Downloading: http://repo1.maven.org/maven2/org/springframework/spring-beans/2.5.4/spring-beans-2.5.4.jar
472K downloaded  (spring-beans-2.5.4.jar)
Downloading: http://repo1.maven.org/maven2/org/springframework/spring-context/2.5.4/spring-context-2.5.4.jar
458K downloaded  (spring-context-2.5.4.jar)
Downloading: http://repo1.maven.org/maven2/org/springframework/spring-dao/2.0.8/spring-dao-2.0.8.jar
127K downloaded  (spring-dao-2.0.8.jar)
Downloading: http://repo1.maven.org/maven2/org/springframework/spring-jdbc/2.0.8/spring-jdbc-2.0.8.jar
221K downloaded  (spring-jdbc-2.0.8.jar)
Downloading: http://repo1.maven.org/maven2/org/codehaus/plexus/plexus-interpolation/1.13/plexus-interpolation-1.13.pom
890b downloaded  (plexus-interpolation-1.13.pom)
Downloading: http://repo1.maven.org/maven2/org/codehaus/plexus/plexus-utils/2.0.5/plexus-utils-2.0.5.jar
217K downloaded  (plexus-utils-2.0.5.jar)
Downloading: http://repo1.maven.org/maven2/org/codehaus/plexus/plexus-interpolation/1.13/plexus-interpolation-1.13.jar
59K downloaded  (plexus-interpolation-1.13.jar)
[INFO] [resources:resources {execution: default-resources}]
[INFO] Using 'UTF-8' encoding to copy filtered resources.
[INFO] Copying 1 resource to org/apache/oodt/commons
[INFO] Copying 1 resource to org/apache/oodt/commons/util
[INFO] Copying 3 resources
Downloading: http://repo1.maven.org/maven2/junit/junit/4.12/junit-4.12.pom
23K downloaded  (junit-4.12.pom)
Downloading: http://repo1.maven.org/maven2/org/hamcrest/hamcrest-core/1.3/hamcrest-core-1.3.pom
766b downloaded  (hamcrest-core-1.3.pom)
Downloading: http://repo1.maven.org/maven2/org/hamcrest/hamcrest-parent/1.3/hamcrest-parent-1.3.pom
1K downloaded  (hamcrest-parent-1.3.pom)
Downloading: http://repo1.maven.org/maven2/org/apache/maven/maven-plugin-api/2.0.9/maven-plugin-api-2.0.9.pom
1K downloaded  (maven-plugin-api-2.0.9.pom)
Downloading: http://repo1.maven.org/maven2/org/apache/maven/maven/2.0.9/maven-2.0.9.pom
18K downloaded  (maven-2.0.9.pom)
Downloading: http://repo1.maven.org/maven2/org/apache/maven/maven-artifact/2.0.9/maven-artifact-2.0.9.pom
1K downloaded  (maven-artifact-2.0.9.pom)
Downloading: http://repo1.maven.org/maven2/org/codehaus/plexus/plexus-utils/1.5.1/plexus-utils-1.5.1.pom
2K downloaded  (plexus-utils-1.5.1.pom)
Downloading: http://repo1.maven.org/maven2/org/apache/maven/maven-core/2.0.9/maven-core-2.0.9.pom
7K downloaded  (maven-core-2.0.9.pom)
Downloading: http://repo1.maven.org/maven2/org/apache/maven/maven-settings/2.0.9/maven-settings-2.0.9.pom
2K downloaded  (maven-settings-2.0.9.pom)
Downloading: http://repo1.maven.org/maven2/org/apache/maven/maven-model/2.0.9/maven-model-2.0.9.pom
3K downloaded  (maven-model-2.0.9.pom)
Downloading: http://repo1.maven.org/maven2/org/apache/maven/maven-plugin-parameter-documenter/2.0.9/maven-plugin-parameter-documenter-2.0.9.pom
1K downloaded  (maven-plugin-parameter-documenter-2.0.9.pom)
Downloading: http://repo1.maven.org/maven2/org/apache/maven/wagon/wagon-webdav/1.0-beta-2/wagon-webdav-1.0-beta-2.pom
1K downloaded  (wagon-webdav-1.0-beta-2.pom)
Downloading: http://repo1.maven.org/maven2/slide/slide-webdavlib/2.1/slide-webdavlib-2.1.pom
648b downloaded  (slide-webdavlib-2.1.pom)
Downloading: http://repo1.maven.org/maven2/commons-httpclient/commons-httpclient/2.0.2/commons-httpclient-2.0.2.pom
6K downloaded  (commons-httpclient-2.0.2.pom)
Downloading: http://repo1.maven.org/maven2/jdom/jdom/1.0/jdom-1.0.pom
1K downloaded  (jdom-1.0.pom)
Downloading: http://repo1.maven.org/maven2/de/zeigermann/xml/xml-im-exporter/1.1/xml-im-exporter-1.1.pom
248b downloaded  (xml-im-exporter-1.1.pom)
Downloading: http://repo1.maven.org/maven2/org/apache/maven/maven-profile/2.0.9/maven-profile-2.0.9.pom
2K downloaded  (maven-profile-2.0.9.pom)
Downloading: http://repo1.maven.org/maven2/org/apache/maven/maven-repository-metadata/2.0.9/maven-repository-metadata-2.0.9.pom
1K downloaded  (maven-repository-metadata-2.0.9.pom)
Downloading: http://repo1.maven.org/maven2/org/apache/maven/maven-error-diagnostics/2.0.9/maven-error-diagnostics-2.0.9.pom
1K downloaded  (maven-error-diagnostics-2.0.9.pom)
Downloading: http://repo1.maven.org/maven2/org/apache/maven/maven-project/2.0.9/maven-project-2.0.9.pom
2K downloaded  (maven-project-2.0.9.pom)
Downloading: http://repo1.maven.org/maven2/org/apache/maven/maven-artifact-manager/2.0.9/maven-artifact-manager-2.0.9.pom
2K downloaded  (maven-artifact-manager-2.0.9.pom)
Downloading: http://repo1.maven.org/maven2/org/apache/maven/maven-plugin-registry/2.0.9/maven-plugin-registry-2.0.9.pom
1K downloaded  (maven-plugin-registry-2.0.9.pom)
Downloading: http://repo1.maven.org/maven2/org/apache/maven/maven-plugin-descriptor/2.0.9/maven-plugin-descriptor-2.0.9.pom
2K downloaded  (maven-plugin-descriptor-2.0.9.pom)
Downloading: http://repo1.maven.org/maven2/org/apache/maven/maven-monitor/2.0.9/maven-monitor-2.0.9.pom
1K downloaded  (maven-monitor-2.0.9.pom)
Downloading: http://repo1.maven.org/maven2/org/apache/maven/maven-toolchain/1.0/maven-toolchain-1.0.pom
3K downloaded  (maven-toolchain-1.0.pom)
Downloading: http://repo1.maven.org/maven2/org/apache/maven/shared/maven-shared-utils/0.1/maven-shared-utils-0.1.pom
3K downloaded  (maven-shared-utils-0.1.pom)
Downloading: http://repo1.maven.org/maven2/org/apache/maven/shared/maven-shared-incremental/1.1/maven-shared-incremental-1.1.pom
4K downloaded  (maven-shared-incremental-1.1.pom)
Downloading: http://repo1.maven.org/maven2/org/codehaus/plexus/plexus-compiler-api/2.2/plexus-compiler-api-2.2.pom
865b downloaded  (plexus-compiler-api-2.2.pom)
Downloading: http://repo1.maven.org/maven2/org/codehaus/plexus/plexus-compiler/2.2/plexus-compiler-2.2.pom
3K downloaded  (plexus-compiler-2.2.pom)
Downloading: http://repo1.maven.org/maven2/org/codehaus/plexus/plexus-components/1.3.1/plexus-components-1.3.1.pom
2K downloaded  (plexus-components-1.3.1.pom)
Downloading: http://repo1.maven.org/maven2/org/codehaus/plexus/plexus-utils/3.0.8/plexus-utils-3.0.8.pom
3K downloaded  (plexus-utils-3.0.8.pom)
Downloading: http://repo1.maven.org/maven2/org/codehaus/plexus/plexus-compiler-manager/2.2/plexus-compiler-manager-2.2.pom
690b downloaded  (plexus-compiler-manager-2.2.pom)
Downloading: http://repo1.maven.org/maven2/org/codehaus/plexus/plexus-compiler-javac/2.2/plexus-compiler-javac-2.2.pom
769b downloaded  (plexus-compiler-javac-2.2.pom)
Downloading: http://repo1.maven.org/maven2/org/codehaus/plexus/plexus-compilers/2.2/plexus-compilers-2.2.pom
1K downloaded  (plexus-compilers-2.2.pom)
Downloading: http://repo1.maven.org/maven2/org/codehaus/plexus/plexus-utils/1.4.5/plexus-utils-1.4.5.pom
2K downloaded  (plexus-utils-1.4.5.pom)
Downloading: http://repo1.maven.org/maven2/org/codehaus/plexus/plexus-classworlds/2.2.2/plexus-classworlds-2.2.2.pom
3K downloaded  (plexus-classworlds-2.2.2.pom)
Downloading: http://repo1.maven.org/maven2/org/apache/xbean/xbean-reflect/3.4/xbean-reflect-3.4.pom
2K downloaded  (xbean-reflect-3.4.pom)
Downloading: http://repo1.maven.org/maven2/org/apache/xbean/xbean/3.4/xbean-3.4.pom
18K downloaded  (xbean-3.4.pom)
Downloading: http://repo1.maven.org/maven2/log4j/log4j/1.2.12/log4j-1.2.12.pom
145b downloaded  (log4j-1.2.12.pom)
Downloading: http://repo1.maven.org/maven2/commons-logging/commons-logging-api/1.1/commons-logging-api-1.1.pom
5K downloaded  (commons-logging-api-1.1.pom)
Downloading: http://repo1.maven.org/maven2/com/google/collections/google-collections/1.0/google-collections-1.0.pom
2K downloaded  (google-collections-1.0.pom)
Downloading: http://repo1.maven.org/maven2/com/google/google/1/google-1.pom
1K downloaded  (google-1.pom)
Downloading: http://repo1.maven.org/maven2/junit/junit/3.8.2/junit-3.8.2.pom
747b downloaded  (junit-3.8.2.pom)
Downloading: http://repo1.maven.org/maven2/org/apache/maven/shared/maven-shared-utils/0.1/maven-shared-utils-0.1.jar
Downloading: http://repo1.maven.org/maven2/org/codehaus/plexus/plexus-component-annotations/1.5.5/plexus-component-annotations-1.5.5.jar
4K downloaded  (plexus-component-annotations-1.5.5.jar)
Downloading: http://repo1.maven.org/maven2/org/codehaus/plexus/plexus-compiler-api/2.2/plexus-compiler-api-2.2.jar
24K downloaded  (plexus-compiler-api-2.2.jar)
Downloading: http://repo1.maven.org/maven2/org/codehaus/plexus/plexus-compiler-manager/2.2/plexus-compiler-manager-2.2.jar
150K downloaded  (maven-shared-utils-0.1.jar)
4K downloaded  (plexus-compiler-manager-2.2.jar)
Downloading: http://repo1.maven.org/maven2/org/apache/maven/shared/maven-shared-incremental/1.1/maven-shared-incremental-1.1.jar
Downloading: http://repo1.maven.org/maven2/org/codehaus/plexus/plexus-compiler-javac/2.2/plexus-compiler-javac-2.2.jar
13K downloaded  (maven-shared-incremental-1.1.jar)
18K downloaded  (plexus-compiler-javac-2.2.jar)
[INFO] [compiler:compile {execution: default-compile}]
[INFO] Changes detected - recompiling the module!
[INFO] Compiling 86 source files to <https://builds.apache.org/job/oodt-trunk/org.apache.oodt$oodt-commons/ws/target/classes>
[INFO] -------------------------------------------------------------
[WARNING] COMPILATION WARNING : 
[INFO] -------------------------------------------------------------
[WARNING] <https://builds.apache.org/job/oodt-trunk/org.apache.oodt$oodt-commons/ws/src/main/java/org/apache/oodt/commons/Configuration.java>:
Some input files use or override a deprecated API.
[WARNING] <https://builds.apache.org/job/oodt-trunk/org.apache.oodt$oodt-commons/ws/src/main/java/org/apache/oodt/commons/Configuration.java>:
Recompile with -Xlint:deprecation for details.
[WARNING] <https://builds.apache.org/job/oodt-trunk/org.apache.oodt$oodt-commons/ws/src/main/java/org/apache/oodt/commons/activity/StoredActivity.java>:
Some input files use unchecked or unsafe operations.
[WARNING] <https://builds.apache.org/job/oodt-trunk/org.apache.oodt$oodt-commons/ws/src/main/java/org/apache/oodt/commons/activity/StoredActivity.java>:
Recompile with -Xlint:unchecked for details.
[INFO] 4 warnings 
[INFO] -------------------------------------------------------------
[INFO] -------------------------------------------------------------
[ERROR] COMPILATION ERROR : 
[INFO] -------------------------------------------------------------
[ERROR] <https://builds.apache.org/job/oodt-trunk/org.apache.oodt$oodt-commons/ws/src/main/java/org/apache/oodt/commons/ConfiguredTestCase.java>:[21,23]
package junit.framework does not exist
[ERROR] <https://builds.apache.org/job/oodt-trunk/org.apache.oodt$oodt-commons/ws/src/main/java/org/apache/oodt/commons/ConfiguredTestCase.java>:[32,50]
cannot find symbol
  symbol: class TestCase
[ERROR] <https://builds.apache.org/job/oodt-trunk/org.apache.oodt$oodt-commons/ws/src/main/java/org/apache/oodt/commons/ConfiguredTestCase.java>:[48,17]
cannot find symbol
  symbol:   variable super
  location: class org.apache.oodt.commons.ConfiguredTestCase
[INFO] 3 errors 
[INFO] -------------------------------------------------------------
[INFO] ------------------------------------------------------------------------
[ERROR] BUILD FAILURE
[INFO] ------------------------------------------------------------------------
[INFO] Compilation failure

<https://builds.apache.org/job/oodt-trunk/org.apache.oodt$oodt-commons/ws/src/main/java/org/apache/oodt/commons/ConfiguredTestCase.java>:[21,23]
package junit.framework does not exist
<https://builds.apache.org/job/oodt-trunk/org.apache.oodt$oodt-commons/ws/src/main/java/org/apache/oodt/commons/ConfiguredTestCase.java>:[32,50]
cannot find symbol
  symbol: class TestCase
<https://builds.apache.org/job/oodt-trunk/org.apache.oodt$oodt-commons/ws/src/main/java/org/apache/oodt/commons/ConfiguredTestCase.java>:[48,17]
cannot find symbol
  symbol:   variable super
  location: class org.apache.oodt.commons.ConfiguredTestCase

[INFO] ------------------------------------------------------------------------
[INFO] For more information, run Maven with the -e switch
[INFO] ------------------------------------------------------------------------
[INFO] Total time: 1 minute 5 seconds
[INFO] Finished at: Tue Oct 06 21:55:09 UTC 2015
[INFO] Final Memory: 73M/727M
[INFO] ------------------------------------------------------------------------
Waiting for Jenkins to finish collecting data

Mime
View raw message