oodt-dev mailing list archives

Site index · List index
Message view « Date » · « Thread »
Top « Date » · « Thread »
From Apache Jenkins Server <jenk...@builds.apache.org>
Subject Build failed in Jenkins: oodt-coverage #15
Date Sat, 24 Oct 2015 15:44:43 GMT
See <https://builds.apache.org/job/oodt-coverage/15/>

------------------------------------------
[...truncated 2528 lines...]
Downloading: http://repo.maven.apache.org/maven2/org/apache/maven/wagon/wagon-provider-api/1.0-alpha-6/wagon-provider-api-1.0-alpha-6.pom
Downloaded: http://repo.maven.apache.org/maven2/org/apache/maven/wagon/wagon-provider-api/1.0-alpha-6/wagon-provider-api-1.0-alpha-6.pom
(588 B at 8.0 KB/sec)
Downloading: http://repo.maven.apache.org/maven2/org/apache/maven/wagon/wagon/1.0-alpha-6/wagon-1.0-alpha-6.pom
Downloaded: http://repo.maven.apache.org/maven2/org/apache/maven/wagon/wagon/1.0-alpha-6/wagon-1.0-alpha-6.pom
(7 KB at 86.9 KB/sec)
Downloading: http://repo.maven.apache.org/maven2/org/apache/maven/shared/maven-shared-io/1.1/maven-shared-io-1.1.pom
Downloaded: http://repo.maven.apache.org/maven2/org/apache/maven/shared/maven-shared-io/1.1/maven-shared-io-1.1.pom
(4 KB at 55.1 KB/sec)
Downloading: http://repo.maven.apache.org/maven2/org/apache/maven/shared/maven-shared-components/8/maven-shared-components-8.pom
Downloaded: http://repo.maven.apache.org/maven2/org/apache/maven/shared/maven-shared-components/8/maven-shared-components-8.pom
(3 KB at 36.3 KB/sec)
Downloading: http://repo.maven.apache.org/maven2/org/codehaus/plexus/plexus-active-collections/1.0-beta-2/plexus-active-collections-1.0-beta-2.pom
Downloaded: http://repo.maven.apache.org/maven2/org/codehaus/plexus/plexus-active-collections/1.0-beta-2/plexus-active-collections-1.0-beta-2.pom
(3 KB at 37.2 KB/sec)
Downloading: http://repo.maven.apache.org/maven2/org/codehaus/plexus/plexus-components/1.1.6/plexus-components-1.1.6.pom
Downloaded: http://repo.maven.apache.org/maven2/org/codehaus/plexus/plexus-components/1.1.6/plexus-components-1.1.6.pom
(2 KB at 25.6 KB/sec)
Downloading: http://repo.maven.apache.org/maven2/org/codehaus/plexus/plexus-container-default/1.0-alpha-22/plexus-container-default-1.0-alpha-22.pom
Downloaded: http://repo.maven.apache.org/maven2/org/codehaus/plexus/plexus-container-default/1.0-alpha-22/plexus-container-default-1.0-alpha-22.pom
(3 KB at 40.6 KB/sec)
Downloading: http://repo.maven.apache.org/maven2/org/codehaus/plexus/plexus-containers/1.0-alpha-22/plexus-containers-1.0-alpha-22.pom
Downloaded: http://repo.maven.apache.org/maven2/org/codehaus/plexus/plexus-containers/1.0-alpha-22/plexus-containers-1.0-alpha-22.pom
(2 KB at 25.2 KB/sec)
Downloading: http://repo.maven.apache.org/maven2/org/apache/maven/maven-plugin-api/2.0.4/maven-plugin-api-2.0.4.pom
Downloaded: http://repo.maven.apache.org/maven2/org/apache/maven/maven-plugin-api/2.0.4/maven-plugin-api-2.0.4.pom
(643 B at 8.7 KB/sec)
Downloading: http://repo.maven.apache.org/maven2/org/apache/maven/maven/2.0.4/maven-2.0.4.pom
Downloaded: http://repo.maven.apache.org/maven2/org/apache/maven/maven/2.0.4/maven-2.0.4.pom
(12 KB at 157.8 KB/sec)
Downloading: http://repo.maven.apache.org/maven2/org/apache/maven/maven-project/2.0.4/maven-project-2.0.4.pom
Downloaded: http://repo.maven.apache.org/maven2/org/apache/maven/maven-project/2.0.4/maven-project-2.0.4.pom
(2 KB at 24.6 KB/sec)
Downloading: http://repo.maven.apache.org/maven2/org/apache/maven/maven-settings/2.0.4/maven-settings-2.0.4.pom
Downloaded: http://repo.maven.apache.org/maven2/org/apache/maven/maven-settings/2.0.4/maven-settings-2.0.4.pom
(2 KB at 19.8 KB/sec)
Downloading: http://repo.maven.apache.org/maven2/org/apache/maven/maven-model/2.0.4/maven-model-2.0.4.pom
Downloaded: http://repo.maven.apache.org/maven2/org/apache/maven/maven-model/2.0.4/maven-model-2.0.4.pom
(3 KB at 36.8 KB/sec)
Downloading: http://repo.maven.apache.org/maven2/org/apache/maven/maven-profile/2.0.4/maven-profile-2.0.4.pom
Downloaded: http://repo.maven.apache.org/maven2/org/apache/maven/maven-profile/2.0.4/maven-profile-2.0.4.pom
(2 KB at 21.6 KB/sec)
Downloading: http://repo.maven.apache.org/maven2/org/apache/maven/maven-artifact-manager/2.0.4/maven-artifact-manager-2.0.4.pom
Downloaded: http://repo.maven.apache.org/maven2/org/apache/maven/maven-artifact-manager/2.0.4/maven-artifact-manager-2.0.4.pom
(2 KB at 18.4 KB/sec)
Downloading: http://repo.maven.apache.org/maven2/org/apache/maven/maven-repository-metadata/2.0.4/maven-repository-metadata-2.0.4.pom
Downloaded: http://repo.maven.apache.org/maven2/org/apache/maven/maven-repository-metadata/2.0.4/maven-repository-metadata-2.0.4.pom
(2 KB at 20.2 KB/sec)
Downloading: http://repo.maven.apache.org/maven2/org/apache/maven/maven-artifact/2.0.4/maven-artifact-2.0.4.pom
Downloaded: http://repo.maven.apache.org/maven2/org/apache/maven/maven-artifact/2.0.4/maven-artifact-2.0.4.pom
(765 B at 10.4 KB/sec)
Downloading: http://repo.maven.apache.org/maven2/org/apache/maven/maven-archiver/2.2/maven-archiver-2.2.pom
Downloaded: http://repo.maven.apache.org/maven2/org/apache/maven/maven-archiver/2.2/maven-archiver-2.2.pom
(2 KB at 17.6 KB/sec)
Downloading: http://repo.maven.apache.org/maven2/org/apache/maven/shared/maven-shared-components/3/maven-shared-components-3.pom
Downloaded: http://repo.maven.apache.org/maven2/org/apache/maven/shared/maven-shared-components/3/maven-shared-components-3.pom
(2 KB at 26.7 KB/sec)
Downloading: http://repo.maven.apache.org/maven2/org/codehaus/plexus/plexus-archiver/1.0-alpha-7/plexus-archiver-1.0-alpha-7.pom
Downloaded: http://repo.maven.apache.org/maven2/org/codehaus/plexus/plexus-archiver/1.0-alpha-7/plexus-archiver-1.0-alpha-7.pom
(2 KB at 14.1 KB/sec)
Downloading: http://repo.maven.apache.org/maven2/org/apache/maven/shared/maven-repository-builder/1.0-alpha-2/maven-repository-builder-1.0-alpha-2.pom
Downloaded: http://repo.maven.apache.org/maven2/org/apache/maven/shared/maven-repository-builder/1.0-alpha-2/maven-repository-builder-1.0-alpha-2.pom
(4 KB at 43.8 KB/sec)
Downloading: http://repo.maven.apache.org/maven2/org/apache/maven/shared/maven-shared-components/7/maven-shared-components-7.pom
Downloaded: http://repo.maven.apache.org/maven2/org/apache/maven/shared/maven-shared-components/7/maven-shared-components-7.pom
(3 KB at 35.3 KB/sec)
Downloading: http://repo.maven.apache.org/maven2/org/apache/maven/shared/maven-common-artifact-filters/1.0-alpha-1/maven-common-artifact-filters-1.0-alpha-1.pom
Downloaded: http://repo.maven.apache.org/maven2/org/apache/maven/shared/maven-common-artifact-filters/1.0-alpha-1/maven-common-artifact-filters-1.0-alpha-1.pom
(2 KB at 24.8 KB/sec)
Downloading: http://repo.maven.apache.org/maven2/org/apache/maven/shared/maven-shared-components/6/maven-shared-components-6.pom
Downloaded: http://repo.maven.apache.org/maven2/org/apache/maven/shared/maven-shared-components/6/maven-shared-components-6.pom
(4 KB at 42.7 KB/sec)
Downloading: http://repo.maven.apache.org/maven2/org/apache/maven/shared/maven-common-artifact-filters/1.0/maven-common-artifact-filters-1.0.pom
Downloaded: http://repo.maven.apache.org/maven2/org/apache/maven/shared/maven-common-artifact-filters/1.0/maven-common-artifact-filters-1.0.pom
(2 KB at 27.0 KB/sec)
Downloading: http://repo.maven.apache.org/maven2/org/apache/maven/shared/maven-plugin-testing-harness/1.1/maven-plugin-testing-harness-1.1.pom
Downloaded: http://repo.maven.apache.org/maven2/org/apache/maven/shared/maven-plugin-testing-harness/1.1/maven-plugin-testing-harness-1.1.pom
(7 KB at 85.9 KB/sec)
Downloading: http://repo.maven.apache.org/maven2/org/apache/maven/maven-core/2.0/maven-core-2.0.pom
Downloaded: http://repo.maven.apache.org/maven2/org/apache/maven/maven-core/2.0/maven-core-2.0.pom
(6 KB at 75.9 KB/sec)
Downloading: http://repo.maven.apache.org/maven2/org/apache/maven/maven-settings/2.0/maven-settings-2.0.pom
Downloaded: http://repo.maven.apache.org/maven2/org/apache/maven/maven-settings/2.0/maven-settings-2.0.pom
(2 KB at 18.7 KB/sec)
Downloading: http://repo.maven.apache.org/maven2/org/apache/maven/maven-plugin-parameter-documenter/2.0/maven-plugin-parameter-documenter-2.0.pom
Downloaded: http://repo.maven.apache.org/maven2/org/apache/maven/maven-plugin-parameter-documenter/2.0/maven-plugin-parameter-documenter-2.0.pom
(2 KB at 20.7 KB/sec)
Downloading: http://repo.maven.apache.org/maven2/org/apache/maven/reporting/maven-reporting-api/2.0/maven-reporting-api-2.0.pom
Downloaded: http://repo.maven.apache.org/maven2/org/apache/maven/reporting/maven-reporting-api/2.0/maven-reporting-api-2.0.pom
(2 KB at 15.0 KB/sec)
Downloading: http://repo.maven.apache.org/maven2/org/apache/maven/reporting/maven-reporting/2.0/maven-reporting-2.0.pom
Downloaded: http://repo.maven.apache.org/maven2/org/apache/maven/reporting/maven-reporting/2.0/maven-reporting-2.0.pom
(504 B at 6.8 KB/sec)
Downloading: http://repo.maven.apache.org/maven2/doxia/doxia-sink-api/1.0-alpha-4/doxia-sink-api-1.0-alpha-4.pom
Downloaded: http://repo.maven.apache.org/maven2/doxia/doxia-sink-api/1.0-alpha-4/doxia-sink-api-1.0-alpha-4.pom
(2 KB at 15.0 KB/sec)
Downloading: http://repo.maven.apache.org/maven2/org/apache/maven/maven-error-diagnostics/2.0/maven-error-diagnostics-2.0.pom
Downloaded: http://repo.maven.apache.org/maven2/org/apache/maven/maven-error-diagnostics/2.0/maven-error-diagnostics-2.0.pom
(812 B at 11.2 KB/sec)
Downloading: http://repo.maven.apache.org/maven2/org/apache/maven/maven-plugin-registry/2.0/maven-plugin-registry-2.0.pom
Downloaded: http://repo.maven.apache.org/maven2/org/apache/maven/maven-plugin-registry/2.0/maven-plugin-registry-2.0.pom
(2 KB at 16.7 KB/sec)
Downloading: http://repo.maven.apache.org/maven2/org/apache/maven/maven-plugin-descriptor/2.0/maven-plugin-descriptor-2.0.pom
Downloaded: http://repo.maven.apache.org/maven2/org/apache/maven/maven-plugin-descriptor/2.0/maven-plugin-descriptor-2.0.pom
(2 KB at 19.8 KB/sec)
Downloading: http://repo.maven.apache.org/maven2/org/apache/maven/maven-monitor/2.0/maven-monitor-2.0.pom
Downloaded: http://repo.maven.apache.org/maven2/org/apache/maven/maven-monitor/2.0/maven-monitor-2.0.pom
(400 B at 5.4 KB/sec)
Downloading: http://repo.maven.apache.org/maven2/aspectj/aspectjrt/1.5.3/aspectjrt-1.5.3.jar
Downloading: http://repo.maven.apache.org/maven2/org/apache/maven/shared/file-management/1.1/file-management-1.1.jar
Downloading: http://repo.maven.apache.org/maven2/org/codehaus/plexus/plexus-archiver/1.0-alpha-10/plexus-archiver-1.0-alpha-10.jar
Downloading: http://repo.maven.apache.org/maven2/org/apache/maven/shared/maven-shared-io/1.1/maven-shared-io-1.1.jar
Downloading: http://repo.maven.apache.org/maven2/org/codehaus/plexus/plexus-active-collections/1.0-beta-2/plexus-active-collections-1.0-beta-2.jar
Downloaded: http://repo.maven.apache.org/maven2/org/codehaus/plexus/plexus-active-collections/1.0-beta-2/plexus-active-collections-1.0-beta-2.jar
(21 KB at 274.0 KB/sec)
Downloading: http://repo.maven.apache.org/maven2/org/codehaus/plexus/plexus-io/1.0-alpha-2/plexus-io-1.0-alpha-2.jar
Downloaded: http://repo.maven.apache.org/maven2/org/apache/maven/shared/maven-shared-io/1.1/maven-shared-io-1.1.jar
(39 KB at 514.1 KB/sec)
Downloading: http://repo.maven.apache.org/maven2/org/apache/maven/maven-archiver/2.2/maven-archiver-2.2.jar
Downloaded: http://repo.maven.apache.org/maven2/org/apache/maven/shared/file-management/1.1/file-management-1.1.jar
(31 KB at 400.5 KB/sec)
Downloading: http://repo.maven.apache.org/maven2/org/apache/maven/shared/maven-repository-builder/1.0-alpha-2/maven-repository-builder-1.0-alpha-2.jar
Downloaded: http://repo.maven.apache.org/maven2/org/codehaus/plexus/plexus-archiver/1.0-alpha-10/plexus-archiver-1.0-alpha-10.jar
(169 KB at 1514.8 KB/sec)
Downloading: http://repo.maven.apache.org/maven2/org/apache/maven/shared/maven-common-artifact-filters/1.0/maven-common-artifact-filters-1.0.jar
Downloaded: http://repo.maven.apache.org/maven2/aspectj/aspectjrt/1.5.3/aspectjrt-1.5.3.jar
(113 KB at 802.1 KB/sec)
Downloading: http://repo.maven.apache.org/maven2/org/apache/maven/shared/maven-plugin-testing-harness/1.1/maven-plugin-testing-harness-1.1.jar
Downloaded: http://repo.maven.apache.org/maven2/org/apache/maven/maven-archiver/2.2/maven-archiver-2.2.jar
(10 KB at 139.8 KB/sec)
Downloading: http://repo.maven.apache.org/maven2/org/apache/maven/reporting/maven-reporting-api/2.0/maven-reporting-api-2.0.jar
Downloaded: http://repo.maven.apache.org/maven2/org/apache/maven/shared/maven-repository-builder/1.0-alpha-2/maven-repository-builder-1.0-alpha-2.jar
(23 KB at 318.5 KB/sec)
Downloading: http://repo.maven.apache.org/maven2/doxia/doxia-sink-api/1.0-alpha-4/doxia-sink-api-1.0-alpha-4.jar
Downloaded: http://repo.maven.apache.org/maven2/org/codehaus/plexus/plexus-io/1.0-alpha-2/plexus-io-1.0-alpha-2.jar
(31 KB at 421.9 KB/sec)
Downloaded: http://repo.maven.apache.org/maven2/org/apache/maven/shared/maven-common-artifact-filters/1.0/maven-common-artifact-filters-1.0.jar
(27 KB at 374.9 KB/sec)
Downloaded: http://repo.maven.apache.org/maven2/org/apache/maven/shared/maven-plugin-testing-harness/1.1/maven-plugin-testing-harness-1.1.jar
(32 KB at 447.0 KB/sec)
Downloaded: http://repo.maven.apache.org/maven2/org/apache/maven/reporting/maven-reporting-api/2.0/maven-reporting-api-2.0.jar
(7 KB at 90.4 KB/sec)
Downloaded: http://repo.maven.apache.org/maven2/doxia/doxia-sink-api/1.0-alpha-4/doxia-sink-api-1.0-alpha-4.jar
(5 KB at 58.9 KB/sec)
[INFO] Reading assembly descriptor: src/main/assembly/assembly.xml
[INFO] Processing DependencySet (output=lib)
[INFO] Building tar : <https://builds.apache.org/job/oodt-coverage/ws/cli/target/clover/cas-cli-0.11-SNAPSHOT-clover-dist.tar.gz>
[INFO] Processing DependencySet (output=lib)
[INFO] Building zip: <https://builds.apache.org/job/oodt-coverage/ws/cli/target/clover/cas-cli-0.11-SNAPSHOT-clover-dist.zip>
[INFO] 
[INFO] --- maven-install-plugin:2.5.2:install (default-install) @ cas-cli ---
[INFO] Installing <https://builds.apache.org/job/oodt-coverage/ws/cli/target/clover/cas-cli-0.11-SNAPSHOT-clover.jar>
to <https://builds.apache.org/job/oodt-coverage/ws/.repository/org/apache/oodt/cas-cli/0.11-SNAPSHOT/cas-cli-0.11-SNAPSHOT-clover.jar>
[INFO] Installing <https://builds.apache.org/job/oodt-coverage/ws/cli/pom.xml> to <https://builds.apache.org/job/oodt-coverage/ws/.repository/org/apache/oodt/cas-cli/0.11-SNAPSHOT/cas-cli-0.11-SNAPSHOT.pom>
[INFO] Installing <https://builds.apache.org/job/oodt-coverage/ws/cli/target/clover/cas-cli-0.11-SNAPSHOT-clover-dist.tar.gz>
to <https://builds.apache.org/job/oodt-coverage/ws/.repository/org/apache/oodt/cas-cli/0.11-SNAPSHOT/cas-cli-0.11-SNAPSHOT-dist.tar.gz>
[INFO] Installing <https://builds.apache.org/job/oodt-coverage/ws/cli/target/clover/cas-cli-0.11-SNAPSHOT-clover-dist.zip>
to <https://builds.apache.org/job/oodt-coverage/ws/.repository/org/apache/oodt/cas-cli/0.11-SNAPSHOT/cas-cli-0.11-SNAPSHOT-dist.zip>
[INFO] 
[INFO] --- maven-clover2-plugin:4.0.6:instrument (default-cli) @ cas-cli ---
[INFO] 
[INFO] --- maven-clover2-plugin:4.0.6:setup (default-cli) @ cas-cli ---
[INFO] Clover Version 4.0.6, built on September 18 2015 (build-964)
[INFO] Loaded from: <https://builds.apache.org/job/oodt-coverage/ws/.repository/com/atlassian/clover/clover/4.0.6/clover-4.0.6.jar>
[INFO] Clover: Open Source License registered to Apache.
[INFO] Updating existing database at '<https://builds.apache.org/job/oodt-coverage/ws/cli/target/clover/clover.db'.>
[INFO] Processing files at 1.7 source level.
[INFO] Clover all over. Instrumented 56 files (16 packages).
[INFO] Elapsed time = 0.194 secs. (288.66 files/sec, 26,463.918 srclines/sec)
[INFO] Clover Version 4.0.6, built on September 18 2015 (build-964)
[INFO] Loaded from: <https://builds.apache.org/job/oodt-coverage/ws/.repository/com/atlassian/clover/clover/4.0.6/clover-4.0.6.jar>
[INFO] Clover: Open Source License registered to Apache.
[INFO] Updating existing database at '<https://builds.apache.org/job/oodt-coverage/ws/cli/target/clover/clover.db'.>
[INFO] Processing files at 1.7 source level.
[INFO] Clover all over. Instrumented 19 files (9 packages).
[INFO] 61 test methods detected.
[INFO] Elapsed time = 0.094 secs. (202.128 files/sec, 21,297.872 srclines/sec)
[INFO] Generation of Clover Groovy configuration is disabled. No Groovy instrumentation will
occur.
[INFO]                                                                         
[INFO] ------------------------------------------------------------------------
[INFO] Building Process Control System Input Data Package 0.11-SNAPSHOT
[INFO] ------------------------------------------------------------------------
Downloading: http://repository.apache.org/snapshots/org/apache/oodt/oodt-commons/0.11-SNAPSHOT/oodt-commons-0.11-SNAPSHOT.jar
[INFO]                                                                         
[INFO] ------------------------------------------------------------------------
[INFO] Skipping Apache OODT
[INFO] This project has been banned from the build due to previous failures.
[INFO] ------------------------------------------------------------------------
[INFO]                                                                         
[INFO] ------------------------------------------------------------------------
[INFO] Skipping OODT Core
[INFO] This project has been banned from the build due to previous failures.
[INFO] ------------------------------------------------------------------------
[INFO] ------------------------------------------------------------------------
[INFO] Reactor Summary:
[INFO] 
[INFO] OODT Core ......................................... SUCCESS [42.220s]
[INFO] Common Utilities .................................. SUCCESS [45.432s]
[INFO] CAS Command Line Interface ........................ SUCCESS [17.918s]
[INFO] Process Control System Input Data Package ......... FAILURE [0.093s]
[INFO] Catalog and Archive Service Generic Multi-valued Metadata Container  SKIPPED
[INFO] CAS Protocol ...................................... SKIPPED
[INFO] CAS Protocol FTP Implementation ................... SKIPPED
[INFO] CAS Protocol HTTP Implementation .................. SKIPPED
[INFO] CAS Protocol IMAPS Implementation ................. SKIPPED
[INFO] CAS Protocol SFTP Implementation .................. SKIPPED
[INFO] Query Expression .................................. SKIPPED
[INFO] OODT Single Sign On Security Package .............. SKIPPED
[INFO] Catalog and Archive File Management Component ..... SKIPPED
[INFO] OODT CAS Virtual Catalog and Integration Service. . SKIPPED
[INFO] Catalog and Archive Resource Management Component . SKIPPED
[INFO] Catalog and Archive Workflow Management Component . SKIPPED
[INFO] Catalog and Archive Crawling Framework ............ SKIPPED
[INFO] CAS Curation Web Services ......................... SKIPPED
[INFO] Process Control System Core Package ............... SKIPPED
[INFO] OODT Wicket Web Components ........................ SKIPPED
[INFO] CAS Curation Interface ............................ SKIPPED
[INFO] CAS PGE Adaptor Framework ......................... SKIPPED
[INFO] CAS Installer Maven Mojo .......................... SKIPPED
[INFO] OODT :: Archetypes :: OpsUI ....................... SKIPPED
[INFO] OODT :: Archetypes :: RADiX ....................... SKIPPED
[INFO] OODT :: Archetypes ................................ SKIPPED
[INFO] CAS Push-Pull-Framework ........................... SKIPPED
[INFO] Product Service ................................... SKIPPED
[INFO] Profile Service ................................... SKIPPED
[INFO] OODT Web Grid ..................................... SKIPPED
[INFO] XML-configured, DBMS-based Product and Profile Server  SKIPPED
[INFO] Apache OODT Configurable OPeNDAP Profile Server ... SKIPPED
[INFO] CAS File Manager Browser Web App .................. SKIPPED
[INFO] CAS Product Server Web Application ................ SKIPPED
[INFO] CAS Workflow Manager Monitor Web App .............. SKIPPED
[INFO] Catalog and Archive File Management Browser ....... SKIPPED
[INFO] Catalog and Archive Workflow Management GUI Editor  SKIPPED
[INFO] Process Control System Operator Interface Webapp .. SKIPPED
[INFO] OODT Process Control System JAX-RS service layer .. SKIPPED
[INFO] Apache OODT ....................................... SKIPPED
[INFO] ------------------------------------------------------------------------
[INFO] BUILD FAILURE
[INFO] ------------------------------------------------------------------------
[INFO] Total time: 1:49.816s
[INFO] Finished at: Sat Oct 24 15:44:55 UTC 2015
[INFO] Final Memory: 40M/246M
[INFO] ------------------------------------------------------------------------
Waiting for Jenkins to finish collecting data
[ERROR] Failed to execute goal on project pcs-input: Could not resolve dependencies for project
org.apache.oodt:pcs-input:jar:0.11-SNAPSHOT: Could not find artifact org.apache.oodt:oodt-commons:jar:0.11-SNAPSHOT
in Nexus (http://repository.apache.org/snapshots) -> [Help 1]
[ERROR] 
[ERROR] To see the full stack trace of the errors, re-run Maven with the -e switch.
[ERROR] Re-run Maven using the -X switch to enable full debug logging.
[ERROR] 
[ERROR] For more information about the errors and possible solutions, please read the following
articles:
[ERROR] [Help 1] http://cwiki.apache.org/confluence/display/MAVEN/DependencyResolutionException
[ERROR] 
[ERROR] After correcting the problems, you can resume the build with the command
[ERROR]   mvn <goals> -rf :pcs-input
[JENKINS] Archiving <https://builds.apache.org/job/oodt-coverage/ws/app/weditor/pom.xml>
to org.apache.oodt/weditor/0.11-SNAPSHOT/weditor-0.11-SNAPSHOT.pom
[JENKINS] Archiving <https://builds.apache.org/job/oodt-coverage/ws/sso/pom.xml> to
org.apache.oodt/oodt-sso/0.11-SNAPSHOT/oodt-sso-0.11-SNAPSHOT.pom
[JENKINS] Archiving <https://builds.apache.org/job/oodt-coverage/ws/grid/pom.xml> to
org.apache.oodt/web-grid/0.11-SNAPSHOT/web-grid-0.11-SNAPSHOT.pom
[JENKINS] Archiving <https://builds.apache.org/job/oodt-coverage/ws/pcs/opsui/pom.xml>
to org.apache.oodt/pcs-opsui/0.11-SNAPSHOT/pcs-opsui-0.11-SNAPSHOT.pom
[JENKINS] Archiving <https://builds.apache.org/job/oodt-coverage/ws/pcs/core/pom.xml>
to org.apache.oodt/pcs-core/0.11-SNAPSHOT/pcs-core-0.11-SNAPSHOT.pom
[JENKINS] Archiving <https://builds.apache.org/job/oodt-coverage/ws/protocol/ftp/pom.xml>
to org.apache.oodt/cas-protocol-ftp/0.11-SNAPSHOT/cas-protocol-ftp-0.11-SNAPSHOT.pom
[JENKINS] Archiving <https://builds.apache.org/job/oodt-coverage/ws/metadata/pom.xml>
to org.apache.oodt/cas-metadata/0.11-SNAPSHOT/cas-metadata-0.11-SNAPSHOT.pom
[JENKINS] Archiving <https://builds.apache.org/job/oodt-coverage/ws/xmlps/pom.xml> to
org.apache.oodt/oodt-xmlps/0.11-SNAPSHOT/oodt-xmlps-0.11-SNAPSHOT.pom
[JENKINS] Archiving <https://builds.apache.org/job/oodt-coverage/ws/core/pom.xml> to
org.apache.oodt/oodt-core/0.11-SNAPSHOT/oodt-core-0.11-SNAPSHOT.pom
[JENKINS] Archiving <https://builds.apache.org/job/oodt-coverage/ws/protocol/http/pom.xml>
to org.apache.oodt/cas-protocol-http/0.11-SNAPSHOT/cas-protocol-http-0.11-SNAPSHOT.pom
[JENKINS] Archiving <https://builds.apache.org/job/oodt-coverage/ws/curator/services/pom.xml>
to org.apache.oodt/curator-services/0.11-SNAPSHOT/curator-services-0.11-SNAPSHOT.pom
[JENKINS] Archiving <https://builds.apache.org/job/oodt-coverage/ws/crawler/pom.xml>
to org.apache.oodt/cas-crawler/0.11-SNAPSHOT/cas-crawler-0.11-SNAPSHOT.pom
[JENKINS] Archiving <https://builds.apache.org/job/oodt-coverage/ws/webapp/wmonitor/pom.xml>
to org.apache.oodt/wmonitor/0.11-SNAPSHOT/wmonitor-0.11-SNAPSHOT.pom
[JENKINS] Archiving <https://builds.apache.org/job/oodt-coverage/ws/webapp/components/pom.xml>
to org.apache.oodt/oodt-webapp-components/0.11-SNAPSHOT/oodt-webapp-components-0.11-SNAPSHOT.pom
[JENKINS] Archiving <https://builds.apache.org/job/oodt-coverage/ws/protocol/api/pom.xml>
to org.apache.oodt/cas-protocol-api/0.11-SNAPSHOT/cas-protocol-api-0.11-SNAPSHOT.pom
[JENKINS] Archiving <https://builds.apache.org/job/oodt-coverage/ws/webapp/fmbrowser/pom.xml>
to org.apache.oodt/fmbrowser/0.11-SNAPSHOT/fmbrowser-0.11-SNAPSHOT.pom
[JENKINS] Archiving <https://builds.apache.org/job/oodt-coverage/ws/opendapps/pom.xml>
to org.apache.oodt/opendapps/0.11-SNAPSHOT/opendapps-0.11-SNAPSHOT.pom
[JENKINS] Archiving <https://builds.apache.org/job/oodt-coverage/ws/filemgr/pom.xml>
to org.apache.oodt/cas-filemgr/0.11-SNAPSHOT/cas-filemgr-0.11-SNAPSHOT.pom
[JENKINS] Archiving <https://builds.apache.org/job/oodt-coverage/ws/mvn/archetypes/pom.xml>
to org.apache.oodt/archetypes/0.11-SNAPSHOT/archetypes-0.11-SNAPSHOT.pom
[JENKINS] Archiving <https://builds.apache.org/job/oodt-coverage/ws/mvn/plugins/cas-install/pom.xml>
to org.apache.oodt/maven-cas-install-plugin/0.11-SNAPSHOT/maven-cas-install-plugin-0.11-SNAPSHOT.pom
[JENKINS] Archiving <https://builds.apache.org/job/oodt-coverage/ws/product/pom.xml>
to org.apache.oodt/oodt-product/0.11-SNAPSHOT/oodt-product-0.11-SNAPSHOT.pom
[JENKINS] Archiving <https://builds.apache.org/job/oodt-coverage/ws/cli/pom.xml> to
org.apache.oodt/cas-cli/0.11-SNAPSHOT/cas-cli-0.11-SNAPSHOT.pom
[JENKINS] Archiving <https://builds.apache.org/job/oodt-coverage/ws/xmlquery/pom.xml>
to org.apache.oodt/oodt-xmlquery/0.11-SNAPSHOT/oodt-xmlquery-0.11-SNAPSHOT.pom
[JENKINS] Archiving <https://builds.apache.org/job/oodt-coverage/ws/pushpull/pom.xml>
to org.apache.oodt/cas-pushpull/0.11-SNAPSHOT/cas-pushpull-0.11-SNAPSHOT.pom
[JENKINS] Archiving <https://builds.apache.org/job/oodt-coverage/ws/app/fmbrowser/pom.xml>
to org.apache.oodt/cas-fm-browser/0.11-SNAPSHOT/cas-fm-browser-0.11-SNAPSHOT.pom
[JENKINS] Archiving <https://builds.apache.org/job/oodt-coverage/ws/profile/pom.xml>
to org.apache.oodt/oodt-profile/0.11-SNAPSHOT/oodt-profile-0.11-SNAPSHOT.pom
[JENKINS] Archiving <https://builds.apache.org/job/oodt-coverage/ws/curator/webapp/pom.xml>
to org.apache.oodt/cas-curator/0.11-SNAPSHOT/cas-curator-0.11-SNAPSHOT.pom
[JENKINS] Archiving <https://builds.apache.org/job/oodt-coverage/ws/pge/pom.xml> to
org.apache.oodt/cas-pge/0.11-SNAPSHOT/cas-pge-0.11-SNAPSHOT.pom
[JENKINS] Archiving <https://builds.apache.org/job/oodt-coverage/ws/protocol/imaps/pom.xml>
to org.apache.oodt/cas-protocol-imaps/0.11-SNAPSHOT/cas-protocol-imaps-0.11-SNAPSHOT.pom
[JENKINS] Archiving <https://builds.apache.org/job/oodt-coverage/ws/pom.xml> to org.apache.oodt/oodt/0.11-SNAPSHOT/oodt-0.11-SNAPSHOT.pom
[JENKINS] Archiving <https://builds.apache.org/job/oodt-coverage/ws/webapp/fmprod/pom.xml>
to org.apache.oodt/cas-product/0.11-SNAPSHOT/cas-product-0.11-SNAPSHOT.pom
[JENKINS] Archiving <https://builds.apache.org/job/oodt-coverage/ws/commons/pom.xml>
to org.apache.oodt/oodt-commons/0.11-SNAPSHOT/oodt-commons-0.11-SNAPSHOT.pom
[JENKINS] Archiving <https://builds.apache.org/job/oodt-coverage/ws/protocol/sftp/pom.xml>
to org.apache.oodt/cas-protocol-sftp/0.11-SNAPSHOT/cas-protocol-sftp-0.11-SNAPSHOT.pom
[JENKINS] Archiving <https://builds.apache.org/job/oodt-coverage/ws/mvn/archetypes/radix/pom.xml>
to org.apache.oodt/radix-archetype/0.11-SNAPSHOT/radix-archetype-0.11-SNAPSHOT.pom
[JENKINS] Archiving <https://builds.apache.org/job/oodt-coverage/ws/pcs/input/pom.xml>
to org.apache.oodt/pcs-input/0.11-SNAPSHOT/pcs-input-0.11-SNAPSHOT.pom
[JENKINS] Archiving <https://builds.apache.org/job/oodt-coverage/ws/pcs/services/pom.xml>
to org.apache.oodt/pcs-services/0.11-SNAPSHOT/pcs-services-0.11-SNAPSHOT.pom
[JENKINS] Archiving <https://builds.apache.org/job/oodt-coverage/ws/resource/pom.xml>
to org.apache.oodt/cas-resource/0.11-SNAPSHOT/cas-resource-0.11-SNAPSHOT.pom
[JENKINS] Archiving <https://builds.apache.org/job/oodt-coverage/ws/mvn/archetypes/opsui/pom.xml>
to org.apache.oodt/opsui-archetype/0.11-SNAPSHOT/opsui-archetype-0.11-SNAPSHOT.pom
[JENKINS] Archiving <https://builds.apache.org/job/oodt-coverage/ws/catalog/pom.xml>
to org.apache.oodt/cas-catalog/0.11-SNAPSHOT/cas-catalog-0.11-SNAPSHOT.pom
[JENKINS] Archiving <https://builds.apache.org/job/oodt-coverage/ws/workflow/pom.xml>
to org.apache.oodt/cas-workflow/0.11-SNAPSHOT/cas-workflow-0.11-SNAPSHOT.pom
Sending e-mails to: dev@oodt.apache.org
channel stopped
Publishing Clover coverage report...
Publishing Clover HTML report...
Publishing Clover XML report...
Publishing Clover coverage results...

Mime
View raw message