oodt-dev mailing list archives

Site index · List index
Message view « Date » · « Thread »
Top « Date » · « Thread »
From Apache Jenkins Server <jenk...@builds.apache.org>
Subject Build failed in Jenkins: oodt-trunk » Catalog and Archive File Management Component #1846
Date Fri, 22 May 2015 23:10:17 GMT
See <https://builds.apache.org/job/oodt-trunk/org.apache.oodt$cas-filemgr/1846/>

------------------------------------------
[INFO] ------------------------------------------------------------------------
[INFO] Building Catalog and Archive File Management Component
[INFO]    task-segment: [install]
[INFO] ------------------------------------------------------------------------
[INFO] [remote-resources:process {execution: default}]
Downloading: https://oss.sonatype.org/content/groups/public/org/apache/solr/solr-solrj/1.3.0/solr-solrj-1.3.0.pom
[INFO] Unable to find resource 'org.apache.solr:solr-solrj:pom:1.3.0' in repository sonatype-nexus
(https://oss.sonatype.org/content/groups/public)
Downloading: http://repo1.maven.org/maven2/org/apache/solr/solr-solrj/1.3.0/solr-solrj-1.3.0.pom
2K downloaded  (solr-solrj-1.3.0.pom)
Downloading: https://oss.sonatype.org/content/groups/public/org/apache/solr/solr-parent/1.3.0/solr-parent-1.3.0.pom
[INFO] Unable to find resource 'org.apache.solr:solr-parent:pom:1.3.0' in repository sonatype-nexus
(https://oss.sonatype.org/content/groups/public)
Downloading: http://repo1.maven.org/maven2/org/apache/solr/solr-parent/1.3.0/solr-parent-1.3.0.pom
3K downloaded  (solr-parent-1.3.0.pom)
Downloading: https://oss.sonatype.org/content/groups/public/org/apache/solr/solr-common/1.3.0/solr-common-1.3.0.pom
[INFO] Unable to find resource 'org.apache.solr:solr-common:pom:1.3.0' in repository sonatype-nexus
(https://oss.sonatype.org/content/groups/public)
Downloading: http://repo1.maven.org/maven2/org/apache/solr/solr-common/1.3.0/solr-common-1.3.0.pom
1K downloaded  (solr-common-1.3.0.pom)
Downloading: https://oss.sonatype.org/content/groups/public/org/apache/commons/commons-io/1.3.2/commons-io-1.3.2.pom
[INFO] Unable to find resource 'org.apache.commons:commons-io:pom:1.3.2' in repository sonatype-nexus
(https://oss.sonatype.org/content/groups/public)
Downloading: http://repo1.maven.org/maven2/org/apache/commons/commons-io/1.3.2/commons-io-1.3.2.pom
640b downloaded  (commons-io-1.3.2.pom)
Downloading: https://oss.sonatype.org/content/groups/public/commons-io/commons-io/1.3.2/commons-io-1.3.2.pom
[INFO] Unable to find resource 'commons-io:commons-io:pom:1.3.2' in repository sonatype-nexus
(https://oss.sonatype.org/content/groups/public)
Downloading: http://repo1.maven.org/maven2/commons-io/commons-io/1.3.2/commons-io-1.3.2.pom
9K downloaded  (commons-io-1.3.2.pom)
Downloading: https://oss.sonatype.org/content/groups/public/org/apache/commons/commons-parent/3/commons-parent-3.pom
[INFO] Unable to find resource 'org.apache.commons:commons-parent:pom:3' in repository sonatype-nexus
(https://oss.sonatype.org/content/groups/public)
Downloading: http://repo1.maven.org/maven2/org/apache/commons/commons-parent/3/commons-parent-3.pom
11K downloaded  (commons-parent-3.pom)
Downloading: https://oss.sonatype.org/content/groups/public/commons-fileupload/commons-fileupload/1.2/commons-fileupload-1.2.pom
[INFO] Unable to find resource 'commons-fileupload:commons-fileupload:pom:1.2' in repository
sonatype-nexus (https://oss.sonatype.org/content/groups/public)
Downloading: http://repo1.maven.org/maven2/commons-fileupload/commons-fileupload/1.2/commons-fileupload-1.2.pom
10K downloaded  (commons-fileupload-1.2.pom)
Downloading: https://oss.sonatype.org/content/groups/public/org/apache/commons/commons-parent/1/commons-parent-1.pom
[INFO] Unable to find resource 'org.apache.commons:commons-parent:pom:1' in repository sonatype-nexus
(https://oss.sonatype.org/content/groups/public)
Downloading: http://repo1.maven.org/maven2/org/apache/commons/commons-parent/1/commons-parent-1.pom
7K downloaded  (commons-parent-1.pom)
Downloading: https://oss.sonatype.org/content/groups/public/stax/stax/1.2.0/stax-1.2.0.pom
[INFO] Unable to find resource 'stax:stax:pom:1.2.0' in repository sonatype-nexus (https://oss.sonatype.org/content/groups/public)
Downloading: http://repo1.maven.org/maven2/stax/stax/1.2.0/stax-1.2.0.pom
3K downloaded  (stax-1.2.0.pom)
Downloading: https://oss.sonatype.org/content/groups/public/stax/stax-api/1.0.1/stax-api-1.0.1.pom
[INFO] Unable to find resource 'stax:stax-api:pom:1.0.1' in repository sonatype-nexus (https://oss.sonatype.org/content/groups/public)
Downloading: http://repo1.maven.org/maven2/stax/stax-api/1.0.1/stax-api-1.0.1.pom
1K downloaded  (stax-api-1.0.1.pom)
Downloading: https://oss.sonatype.org/content/groups/public/stax-utils/stax-utils/snapshot-20040917/stax-utils-snapshot-20040917.pom
[INFO] Unable to find resource 'stax-utils:stax-utils:pom:snapshot-20040917' in repository
sonatype-nexus (https://oss.sonatype.org/content/groups/public)
Downloading: http://repo1.maven.org/maven2/stax-utils/stax-utils/snapshot-20040917/stax-utils-snapshot-20040917.pom
341b downloaded  (stax-utils-snapshot-20040917.pom)
Downloading: https://oss.sonatype.org/content/groups/public/net/java/dev/stax-utils/stax-utils/20040917/stax-utils-20040917.pom
[INFO] Unable to find resource 'net.java.dev.stax-utils:stax-utils:pom:20040917' in repository
sonatype-nexus (https://oss.sonatype.org/content/groups/public)
Downloading: http://repo1.maven.org/maven2/net/java/dev/stax-utils/stax-utils/20040917/stax-utils-20040917.pom
170b downloaded  (stax-utils-20040917.pom)
Downloading: https://oss.sonatype.org/content/groups/public/org/apache/solr/solr-core/1.3.0/solr-core-1.3.0.pom
[INFO] Unable to find resource 'org.apache.solr:solr-core:pom:1.3.0' in repository sonatype-nexus
(https://oss.sonatype.org/content/groups/public)
Downloading: http://repo1.maven.org/maven2/org/apache/solr/solr-core/1.3.0/solr-core-1.3.0.pom
3K downloaded  (solr-core-1.3.0.pom)
Downloading: https://oss.sonatype.org/content/groups/public/org/apache/solr/solr-lucene-analyzers/1.3.0/solr-lucene-analyzers-1.3.0.pom
[INFO] Unable to find resource 'org.apache.solr:solr-lucene-analyzers:pom:1.3.0' in repository
sonatype-nexus (https://oss.sonatype.org/content/groups/public)
Downloading: http://repo1.maven.org/maven2/org/apache/solr/solr-lucene-analyzers/1.3.0/solr-lucene-analyzers-1.3.0.pom
1K downloaded  (solr-lucene-analyzers-1.3.0.pom)
Downloading: https://oss.sonatype.org/content/groups/public/org/apache/solr/solr-lucene-contrib/1.3.0/solr-lucene-contrib-1.3.0.pom
[INFO] Unable to find resource 'org.apache.solr:solr-lucene-contrib:pom:1.3.0' in repository
sonatype-nexus (https://oss.sonatype.org/content/groups/public)
Downloading: http://repo1.maven.org/maven2/org/apache/solr/solr-lucene-contrib/1.3.0/solr-lucene-contrib-1.3.0.pom
1K downloaded  (solr-lucene-contrib-1.3.0.pom)
Downloading: https://oss.sonatype.org/content/groups/public/org/apache/solr/solr-lucene-highlighter/1.3.0/solr-lucene-highlighter-1.3.0.pom
[INFO] Unable to find resource 'org.apache.solr:solr-lucene-highlighter:pom:1.3.0' in repository
sonatype-nexus (https://oss.sonatype.org/content/groups/public)
Downloading: http://repo1.maven.org/maven2/org/apache/solr/solr-lucene-highlighter/1.3.0/solr-lucene-highlighter-1.3.0.pom
1K downloaded  (solr-lucene-highlighter-1.3.0.pom)
Downloading: https://oss.sonatype.org/content/groups/public/org/apache/solr/solr-lucene-queries/1.3.0/solr-lucene-queries-1.3.0.pom
[INFO] Unable to find resource 'org.apache.solr:solr-lucene-queries:pom:1.3.0' in repository
sonatype-nexus (https://oss.sonatype.org/content/groups/public)
Downloading: http://repo1.maven.org/maven2/org/apache/solr/solr-lucene-queries/1.3.0/solr-lucene-queries-1.3.0.pom
1K downloaded  (solr-lucene-queries-1.3.0.pom)
Downloading: https://oss.sonatype.org/content/groups/public/org/apache/solr/solr-lucene-snowball/1.3.0/solr-lucene-snowball-1.3.0.pom
[INFO] Unable to find resource 'org.apache.solr:solr-lucene-snowball:pom:1.3.0' in repository
sonatype-nexus (https://oss.sonatype.org/content/groups/public)
Downloading: http://repo1.maven.org/maven2/org/apache/solr/solr-lucene-snowball/1.3.0/solr-lucene-snowball-1.3.0.pom
1K downloaded  (solr-lucene-snowball-1.3.0.pom)
Downloading: https://oss.sonatype.org/content/groups/public/org/apache/solr/solr-lucene-spellchecker/1.3.0/solr-lucene-spellchecker-1.3.0.pom
[INFO] Unable to find resource 'org.apache.solr:solr-lucene-spellchecker:pom:1.3.0' in repository
sonatype-nexus (https://oss.sonatype.org/content/groups/public)
Downloading: http://repo1.maven.org/maven2/org/apache/solr/solr-lucene-spellchecker/1.3.0/solr-lucene-spellchecker-1.3.0.pom
1K downloaded  (solr-lucene-spellchecker-1.3.0.pom)
Downloading: https://oss.sonatype.org/content/groups/public/org/apache/solr/solr-commons-csv/1.3.0/solr-commons-csv-1.3.0.pom
[INFO] Unable to find resource 'org.apache.solr:solr-commons-csv:pom:1.3.0' in repository
sonatype-nexus (https://oss.sonatype.org/content/groups/public)
Downloading: http://repo1.maven.org/maven2/org/apache/solr/solr-commons-csv/1.3.0/solr-commons-csv-1.3.0.pom
1K downloaded  (solr-commons-csv-1.3.0.pom)
Downloading: https://oss.sonatype.org/content/groups/public/org/apache/geronimo/specs/geronimo-stax-api_1.0_spec/1.0.1/geronimo-stax-api_1.0_spec-1.0.1.pom
[INFO] Unable to find resource 'org.apache.geronimo.specs:geronimo-stax-api_1.0_spec:pom:1.0.1'
in repository sonatype-nexus (https://oss.sonatype.org/content/groups/public)
Downloading: http://repo1.maven.org/maven2/org/apache/geronimo/specs/geronimo-stax-api_1.0_spec/1.0.1/geronimo-stax-api_1.0_spec-1.0.1.pom
2K downloaded  (geronimo-stax-api_1.0_spec-1.0.1.pom)
Downloading: https://oss.sonatype.org/content/groups/public/org/apache/geronimo/specs/specs/1.3/specs-1.3.pom
[INFO] Unable to find resource 'org.apache.geronimo.specs:specs:pom:1.3' in repository sonatype-nexus
(https://oss.sonatype.org/content/groups/public)
Downloading: http://repo1.maven.org/maven2/org/apache/geronimo/specs/specs/1.3/specs-1.3.pom
6K downloaded  (specs-1.3.pom)
Downloading: https://oss.sonatype.org/content/groups/public/org/apache/geronimo/genesis/config/project-config/1.1/project-config-1.1.pom
[INFO] Unable to find resource 'org.apache.geronimo.genesis.config:project-config:pom:1.1'
in repository sonatype-nexus (https://oss.sonatype.org/content/groups/public)
Downloading: http://repo1.maven.org/maven2/org/apache/geronimo/genesis/config/project-config/1.1/project-config-1.1.pom
14K downloaded  (project-config-1.1.pom)
Downloading: http://people.apache.org/repo/m2-incubating-repository//org/apache/geronimo/genesis/config/config/1.1/config-1.1.pom
[INFO] Unable to find resource 'org.apache.geronimo.genesis.config:config:pom:1.1' in repository
apache-incubator (http://people.apache.org/repo/m2-incubating-repository/)
Downloading: http://repository.codehaus.org/org/apache/geronimo/genesis/config/config/1.1/config-1.1.pom
318b downloaded  (config-1.1.pom)
[WARNING] *** CHECKSUM FAILED - Checksum failed on download: local = '7226cd6d2506216c083eb2a25d71db156ed7e3f3';
remote = '<!DOCTYPE' - RETRYING
Downloading: http://repository.codehaus.org/org/apache/geronimo/genesis/config/config/1.1/config-1.1.pom
318b downloaded  (config-1.1.pom)
[WARNING] *** CHECKSUM FAILED - Checksum failed on download: local = '7226cd6d2506216c083eb2a25d71db156ed7e3f3';
remote = '<!DOCTYPE' - IGNORING
[INFO] ------------------------------------------------------------------------
[ERROR] BUILD ERROR
[INFO] ------------------------------------------------------------------------
[INFO] Failed to resolve dependencies for one or more projects in the reactor. Reason: Unable
to get dependency information: Unable to read the metadata file for artifact 'org.apache.geronimo.specs:geronimo-stax-api_1.0_spec:jar':
Cannot find parent: org.apache.geronimo.genesis.config:config for project: null:project-config:pom:1.1
for project null:project-config:pom:1.1
  org.apache.geronimo.specs:geronimo-stax-api_1.0_spec:jar:1.0.1

from the specified remote repositories:
  apache.snapshots (http://repository.apache.org/snapshots),
  central (http://repo1.maven.org/maven2),
  sonatype-nexus (https://oss.sonatype.org/content/groups/public)

Path to dependency: 
	1) org.apache.oodt:cas-filemgr:jar:0.9-SNAPSHOT
	2) org.apache.solr:solr-core:jar:1.3.0



Not a v4.0.0 POM. for project org.apache.geronimo.genesis.config:config at /home/jenkins/jenkins-slave/workspace/oodt-trunk/.repository/org/apache/geronimo/genesis/config/config/1.1/config-1.1.pom
[INFO] ------------------------------------------------------------------------
[INFO] For more information, run Maven with the -e switch
[INFO] ------------------------------------------------------------------------
[INFO] Total time: 2 minutes 17 seconds
[INFO] Finished at: Fri May 22 23:09:56 UTC 2015
[INFO] Final Memory: 93M/475M
[INFO] ------------------------------------------------------------------------

Mime
View raw message