oodt-dev mailing list archives

Site index · List index
Message view « Date » · « Thread »
Top « Date » · « Thread »
From Apache Jenkins Server <jenk...@builds.apache.org>
Subject Build failed in Jenkins: oodt-trunk #1841
Date Sun, 17 May 2015 23:10:22 GMT
See <https://builds.apache.org/job/oodt-trunk/1841/>

------------------------------------------
[...truncated 6809 lines...]
[INFO] [javadoc:javadoc {execution: attach-javadocs}]
[INFO] [install:install {execution: default-install}]
[INFO] Installing <https://builds.apache.org/job/oodt-trunk/ws/sso/target/oodt-sso-0.9-SNAPSHOT.jar>
to <https://builds.apache.org/job/oodt-trunk/ws/.repository/org/apache/oodt/oodt-sso/0.9-SNAPSHOT/oodt-sso-0.9-SNAPSHOT.jar>
[INFO] ------------------------------------------------------------------------
[INFO] Building Catalog and Archive File Management Component
[INFO]    task-segment: [install]
[INFO] ------------------------------------------------------------------------
[INFO] [remote-resources:process {execution: default}]
Downloading: https://oss.sonatype.org/content/groups/public/org/apache/solr/solr-solrj/1.3.0/solr-solrj-1.3.0.pom
[INFO] Unable to find resource 'org.apache.solr:solr-solrj:pom:1.3.0' in repository sonatype-nexus
(https://oss.sonatype.org/content/groups/public)
Downloading: http://repo1.maven.org/maven2/org/apache/solr/solr-solrj/1.3.0/solr-solrj-1.3.0.pom
2K downloaded  (solr-solrj-1.3.0.pom)
Downloading: https://oss.sonatype.org/content/groups/public/org/apache/solr/solr-parent/1.3.0/solr-parent-1.3.0.pom
[INFO] Unable to find resource 'org.apache.solr:solr-parent:pom:1.3.0' in repository sonatype-nexus
(https://oss.sonatype.org/content/groups/public)
Downloading: http://repo1.maven.org/maven2/org/apache/solr/solr-parent/1.3.0/solr-parent-1.3.0.pom
3K downloaded  (solr-parent-1.3.0.pom)
Downloading: https://oss.sonatype.org/content/groups/public/org/apache/solr/solr-common/1.3.0/solr-common-1.3.0.pom
[INFO] Unable to find resource 'org.apache.solr:solr-common:pom:1.3.0' in repository sonatype-nexus
(https://oss.sonatype.org/content/groups/public)
Downloading: http://repo1.maven.org/maven2/org/apache/solr/solr-common/1.3.0/solr-common-1.3.0.pom
1K downloaded  (solr-common-1.3.0.pom)
Downloading: https://oss.sonatype.org/content/groups/public/org/apache/commons/commons-io/1.3.2/commons-io-1.3.2.pom
[INFO] Unable to find resource 'org.apache.commons:commons-io:pom:1.3.2' in repository sonatype-nexus
(https://oss.sonatype.org/content/groups/public)
Downloading: http://repo1.maven.org/maven2/org/apache/commons/commons-io/1.3.2/commons-io-1.3.2.pom
640b downloaded  (commons-io-1.3.2.pom)
Downloading: https://oss.sonatype.org/content/groups/public/commons-io/commons-io/1.3.2/commons-io-1.3.2.pom
[INFO] Unable to find resource 'commons-io:commons-io:pom:1.3.2' in repository sonatype-nexus
(https://oss.sonatype.org/content/groups/public)
Downloading: http://repo1.maven.org/maven2/commons-io/commons-io/1.3.2/commons-io-1.3.2.pom
9K downloaded  (commons-io-1.3.2.pom)
Downloading: https://oss.sonatype.org/content/groups/public/org/apache/commons/commons-parent/3/commons-parent-3.pom
[INFO] Unable to find resource 'org.apache.commons:commons-parent:pom:3' in repository sonatype-nexus
(https://oss.sonatype.org/content/groups/public)
Downloading: http://repo1.maven.org/maven2/org/apache/commons/commons-parent/3/commons-parent-3.pom
11K downloaded  (commons-parent-3.pom)
Downloading: https://oss.sonatype.org/content/groups/public/commons-fileupload/commons-fileupload/1.2/commons-fileupload-1.2.pom
[INFO] Unable to find resource 'commons-fileupload:commons-fileupload:pom:1.2' in repository
sonatype-nexus (https://oss.sonatype.org/content/groups/public)
Downloading: http://repo1.maven.org/maven2/commons-fileupload/commons-fileupload/1.2/commons-fileupload-1.2.pom
10K downloaded  (commons-fileupload-1.2.pom)
Downloading: https://oss.sonatype.org/content/groups/public/org/apache/commons/commons-parent/1/commons-parent-1.pom
[INFO] Unable to find resource 'org.apache.commons:commons-parent:pom:1' in repository sonatype-nexus
(https://oss.sonatype.org/content/groups/public)
Downloading: http://repo1.maven.org/maven2/org/apache/commons/commons-parent/1/commons-parent-1.pom
7K downloaded  (commons-parent-1.pom)
Downloading: https://oss.sonatype.org/content/groups/public/stax/stax/1.2.0/stax-1.2.0.pom
[INFO] Unable to find resource 'stax:stax:pom:1.2.0' in repository sonatype-nexus (https://oss.sonatype.org/content/groups/public)
Downloading: http://repo1.maven.org/maven2/stax/stax/1.2.0/stax-1.2.0.pom
3K downloaded  (stax-1.2.0.pom)
Downloading: https://oss.sonatype.org/content/groups/public/stax/stax-api/1.0.1/stax-api-1.0.1.pom
[INFO] Unable to find resource 'stax:stax-api:pom:1.0.1' in repository sonatype-nexus (https://oss.sonatype.org/content/groups/public)
Downloading: http://repo1.maven.org/maven2/stax/stax-api/1.0.1/stax-api-1.0.1.pom
1K downloaded  (stax-api-1.0.1.pom)
Downloading: https://oss.sonatype.org/content/groups/public/stax-utils/stax-utils/snapshot-20040917/stax-utils-snapshot-20040917.pom
[INFO] Unable to find resource 'stax-utils:stax-utils:pom:snapshot-20040917' in repository
sonatype-nexus (https://oss.sonatype.org/content/groups/public)
Downloading: http://repo1.maven.org/maven2/stax-utils/stax-utils/snapshot-20040917/stax-utils-snapshot-20040917.pom
341b downloaded  (stax-utils-snapshot-20040917.pom)
Downloading: https://oss.sonatype.org/content/groups/public/net/java/dev/stax-utils/stax-utils/20040917/stax-utils-20040917.pom
[INFO] Unable to find resource 'net.java.dev.stax-utils:stax-utils:pom:20040917' in repository
sonatype-nexus (https://oss.sonatype.org/content/groups/public)
Downloading: http://repo1.maven.org/maven2/net/java/dev/stax-utils/stax-utils/20040917/stax-utils-20040917.pom
170b downloaded  (stax-utils-20040917.pom)
Downloading: https://oss.sonatype.org/content/groups/public/org/apache/solr/solr-core/1.3.0/solr-core-1.3.0.pom
[INFO] Unable to find resource 'org.apache.solr:solr-core:pom:1.3.0' in repository sonatype-nexus
(https://oss.sonatype.org/content/groups/public)
Downloading: http://repo1.maven.org/maven2/org/apache/solr/solr-core/1.3.0/solr-core-1.3.0.pom
3K downloaded  (solr-core-1.3.0.pom)
Downloading: https://oss.sonatype.org/content/groups/public/org/apache/solr/solr-lucene-analyzers/1.3.0/solr-lucene-analyzers-1.3.0.pom
[INFO] Unable to find resource 'org.apache.solr:solr-lucene-analyzers:pom:1.3.0' in repository
sonatype-nexus (https://oss.sonatype.org/content/groups/public)
Downloading: http://repo1.maven.org/maven2/org/apache/solr/solr-lucene-analyzers/1.3.0/solr-lucene-analyzers-1.3.0.pom
1K downloaded  (solr-lucene-analyzers-1.3.0.pom)
Downloading: https://oss.sonatype.org/content/groups/public/org/apache/solr/solr-lucene-contrib/1.3.0/solr-lucene-contrib-1.3.0.pom
[INFO] Unable to find resource 'org.apache.solr:solr-lucene-contrib:pom:1.3.0' in repository
sonatype-nexus (https://oss.sonatype.org/content/groups/public)
Downloading: http://repo1.maven.org/maven2/org/apache/solr/solr-lucene-contrib/1.3.0/solr-lucene-contrib-1.3.0.pom
1K downloaded  (solr-lucene-contrib-1.3.0.pom)
Downloading: https://oss.sonatype.org/content/groups/public/org/apache/solr/solr-lucene-highlighter/1.3.0/solr-lucene-highlighter-1.3.0.pom
[INFO] Unable to find resource 'org.apache.solr:solr-lucene-highlighter:pom:1.3.0' in repository
sonatype-nexus (https://oss.sonatype.org/content/groups/public)
Downloading: http://repo1.maven.org/maven2/org/apache/solr/solr-lucene-highlighter/1.3.0/solr-lucene-highlighter-1.3.0.pom
1K downloaded  (solr-lucene-highlighter-1.3.0.pom)
Downloading: https://oss.sonatype.org/content/groups/public/org/apache/solr/solr-lucene-queries/1.3.0/solr-lucene-queries-1.3.0.pom
[INFO] Unable to find resource 'org.apache.solr:solr-lucene-queries:pom:1.3.0' in repository
sonatype-nexus (https://oss.sonatype.org/content/groups/public)
Downloading: http://repo1.maven.org/maven2/org/apache/solr/solr-lucene-queries/1.3.0/solr-lucene-queries-1.3.0.pom
1K downloaded  (solr-lucene-queries-1.3.0.pom)
Downloading: https://oss.sonatype.org/content/groups/public/org/apache/solr/solr-lucene-snowball/1.3.0/solr-lucene-snowball-1.3.0.pom
[INFO] Unable to find resource 'org.apache.solr:solr-lucene-snowball:pom:1.3.0' in repository
sonatype-nexus (https://oss.sonatype.org/content/groups/public)
Downloading: http://repo1.maven.org/maven2/org/apache/solr/solr-lucene-snowball/1.3.0/solr-lucene-snowball-1.3.0.pom
1K downloaded  (solr-lucene-snowball-1.3.0.pom)
Downloading: https://oss.sonatype.org/content/groups/public/org/apache/solr/solr-lucene-spellchecker/1.3.0/solr-lucene-spellchecker-1.3.0.pom
[INFO] Unable to find resource 'org.apache.solr:solr-lucene-spellchecker:pom:1.3.0' in repository
sonatype-nexus (https://oss.sonatype.org/content/groups/public)
Downloading: http://repo1.maven.org/maven2/org/apache/solr/solr-lucene-spellchecker/1.3.0/solr-lucene-spellchecker-1.3.0.pom
1K downloaded  (solr-lucene-spellchecker-1.3.0.pom)
Downloading: https://oss.sonatype.org/content/groups/public/org/apache/solr/solr-commons-csv/1.3.0/solr-commons-csv-1.3.0.pom
[INFO] Unable to find resource 'org.apache.solr:solr-commons-csv:pom:1.3.0' in repository
sonatype-nexus (https://oss.sonatype.org/content/groups/public)
Downloading: http://repo1.maven.org/maven2/org/apache/solr/solr-commons-csv/1.3.0/solr-commons-csv-1.3.0.pom
1K downloaded  (solr-commons-csv-1.3.0.pom)
Downloading: https://oss.sonatype.org/content/groups/public/org/apache/geronimo/specs/geronimo-stax-api_1.0_spec/1.0.1/geronimo-stax-api_1.0_spec-1.0.1.pom
[INFO] Unable to find resource 'org.apache.geronimo.specs:geronimo-stax-api_1.0_spec:pom:1.0.1'
in repository sonatype-nexus (https://oss.sonatype.org/content/groups/public)
Downloading: http://repo1.maven.org/maven2/org/apache/geronimo/specs/geronimo-stax-api_1.0_spec/1.0.1/geronimo-stax-api_1.0_spec-1.0.1.pom
2K downloaded  (geronimo-stax-api_1.0_spec-1.0.1.pom)
Downloading: https://oss.sonatype.org/content/groups/public/org/apache/geronimo/specs/specs/1.3/specs-1.3.pom
[INFO] Unable to find resource 'org.apache.geronimo.specs:specs:pom:1.3' in repository sonatype-nexus
(https://oss.sonatype.org/content/groups/public)
Downloading: http://repo1.maven.org/maven2/org/apache/geronimo/specs/specs/1.3/specs-1.3.pom
6K downloaded  (specs-1.3.pom)
Downloading: https://oss.sonatype.org/content/groups/public/org/apache/geronimo/genesis/config/project-config/1.1/project-config-1.1.pom
[INFO] Unable to find resource 'org.apache.geronimo.genesis.config:project-config:pom:1.1'
in repository sonatype-nexus (https://oss.sonatype.org/content/groups/public)
Downloading: http://repo1.maven.org/maven2/org/apache/geronimo/genesis/config/project-config/1.1/project-config-1.1.pom
14K downloaded  (project-config-1.1.pom)
Downloading: http://people.apache.org/repo/m2-incubating-repository//org/apache/geronimo/genesis/config/config/1.1/config-1.1.pom
[INFO] Unable to find resource 'org.apache.geronimo.genesis.config:config:pom:1.1' in repository
apache-incubator (http://people.apache.org/repo/m2-incubating-repository/)
Downloading: http://repository.codehaus.org/org/apache/geronimo/genesis/config/config/1.1/config-1.1.pom
318b downloaded  (config-1.1.pom)
[WARNING] *** CHECKSUM FAILED - Checksum failed on download: local = '7dc7cfae9a34beb9130158b39673d2d310154dea';
remote = '<!DOCTYPE' - RETRYING
Downloading: http://repository.codehaus.org/org/apache/geronimo/genesis/config/config/1.1/config-1.1.pom
318b downloaded  (config-1.1.pom)
[WARNING] *** CHECKSUM FAILED - Checksum failed on download: local = '7dc7cfae9a34beb9130158b39673d2d310154dea';
remote = '<!DOCTYPE' - IGNORING
[INFO] ------------------------------------------------------------------------
[ERROR] BUILD ERROR
[INFO] ------------------------------------------------------------------------
[INFO] Failed to resolve dependencies for one or more projects in the reactor. Reason: Unable
to get dependency information: Unable to read the metadata file for artifact 'org.apache.geronimo.specs:geronimo-stax-api_1.0_spec:jar':
Cannot find parent: org.apache.geronimo.genesis.config:config for project: null:project-config:pom:1.1
for project null:project-config:pom:1.1
  org.apache.geronimo.specs:geronimo-stax-api_1.0_spec:jar:1.0.1

from the specified remote repositories:
  apache.snapshots (http://repository.apache.org/snapshots),
  central (http://repo1.maven.org/maven2),
  sonatype-nexus (https://oss.sonatype.org/content/groups/public)

Path to dependency: 
	1) org.apache.oodt:cas-filemgr:jar:0.9-SNAPSHOT
	2) org.apache.solr:solr-core:jar:1.3.0



Not a v4.0.0 POM. for project org.apache.geronimo.genesis.config:config at <https://builds.apache.org/job/oodt-trunk/ws/.repository/org/apache/geronimo/genesis/config/config/1.1/config-1.1.pom>
[INFO] ------------------------------------------------------------------------
[INFO] For more information, run Maven with the -e switch
[INFO] ------------------------------------------------------------------------
[INFO] Total time: 2 minutes 5 seconds
[INFO] Finished at: Sun May 17 23:09:42 UTC 2015
[INFO] Final Memory: 99M/540M
[INFO] ------------------------------------------------------------------------
[JENKINS] Archiving <https://builds.apache.org/job/oodt-trunk/ws/sso/pom.xml> to org.apache.oodt/oodt-sso/0.9-SNAPSHOT/oodt-sso-0.9-SNAPSHOT.pom
[JENKINS] Archiving <https://builds.apache.org/job/oodt-trunk/ws/sso/target/oodt-sso-0.9-SNAPSHOT.jar>
to org.apache.oodt/oodt-sso/0.9-SNAPSHOT/oodt-sso-0.9-SNAPSHOT.jar
Sending artifact delta relative to oodt-trunk ? OODT Single Sign On Security Package #1840
Archived 2 artifacts
Archive block size is 32768
Received 0 blocks and 25572 bytes
Compression is 0.0%
Took 0.13 sec
[JENKINS] Archiving <https://builds.apache.org/job/oodt-trunk/ws/protocol/ftp/pom.xml>
to org.apache.oodt/cas-protocol-ftp/0.9-SNAPSHOT/cas-protocol-ftp-0.9-SNAPSHOT.pom
[JENKINS] Archiving <https://builds.apache.org/job/oodt-trunk/ws/protocol/ftp/target/cas-protocol-ftp-0.9-SNAPSHOT.jar>
to org.apache.oodt/cas-protocol-ftp/0.9-SNAPSHOT/cas-protocol-ftp-0.9-SNAPSHOT.jar
Sending artifact delta relative to oodt-trunk ? CAS Protocol FTP Implementation #1840
Archived 2 artifacts
Archive block size is 32768
Received 0 blocks and 22198 bytes
Compression is 0.0%
Took 0.1 sec
[JENKINS] Archiving <https://builds.apache.org/job/oodt-trunk/ws/metadata/pom.xml> to
org.apache.oodt/cas-metadata/0.9-SNAPSHOT/cas-metadata-0.9-SNAPSHOT.pom
[JENKINS] Archiving <https://builds.apache.org/job/oodt-trunk/ws/metadata/target/cas-metadata-0.9-SNAPSHOT.jar>
to org.apache.oodt/cas-metadata/0.9-SNAPSHOT/cas-metadata-0.9-SNAPSHOT.jar
Sending artifact delta relative to oodt-trunk ? Catalog and Archive Service Generic Multi-valued
Metadata Container #1840
Archived 2 artifacts
Archive block size is 32768
Received 0 blocks and 124185 bytes
Compression is 0.0%
Took 91 ms
[JENKINS] Archiving <https://builds.apache.org/job/oodt-trunk/ws/.repository/org/apache/oodt/oodt-core/0.9-SNAPSHOT/oodt-core-0.9-SNAPSHOT.pom>
to org.apache.oodt/oodt-core/0.9-SNAPSHOT/oodt-core-0.9-SNAPSHOT.pom
[JENKINS] Archiving <https://builds.apache.org/job/oodt-trunk/ws/core/target/oodt-core-0.9-SNAPSHOT-site.xml>
to org.apache.oodt/oodt-core/0.9-SNAPSHOT/oodt-core-0.9-SNAPSHOT-site.xml
/x1/jenkins/jenkins-slave/workspace/oodt-trunk/.repository/org/apache/oodt/oodt-core/0.9-SNAPSHOT/oodt-core-0.9-SNAPSHOT.pom
is not inside /x1/jenkins/jenkins-slave/workspace/oodt-trunk/core/; will archive in a separate
pass
Sending artifact delta relative to oodt-trunk ? OODT Core #1840
Archived 1 artifacts
Archive block size is 32768
Received 0 blocks and 1023 bytes
Compression is 0.0%
Took 41 ms
Sending artifact delta relative to oodt-trunk ? OODT Core #1840
Archived 1 artifacts
Archive block size is 32768
Received 0 blocks and 18941 bytes
Compression is 0.0%
Took 9 ms
[JENKINS] Archiving <https://builds.apache.org/job/oodt-trunk/ws/protocol/http/pom.xml>
to org.apache.oodt/cas-protocol-http/0.9-SNAPSHOT/cas-protocol-http-0.9-SNAPSHOT.pom
[JENKINS] Archiving <https://builds.apache.org/job/oodt-trunk/ws/protocol/http/target/cas-protocol-http-0.9-SNAPSHOT.jar>
to org.apache.oodt/cas-protocol-http/0.9-SNAPSHOT/cas-protocol-http-0.9-SNAPSHOT.jar
Sending artifact delta relative to oodt-trunk ? CAS Protocol HTTP Implementation #1840
Archived 2 artifacts
Archive block size is 32768
Received 0 blocks and 23162 bytes
Compression is 0.0%
Took 54 ms
[JENKINS] Archiving <https://builds.apache.org/job/oodt-trunk/ws/protocol/api/pom.xml>
to org.apache.oodt/cas-protocol-api/0.9-SNAPSHOT/cas-protocol-api-0.9-SNAPSHOT.pom
[JENKINS] Archiving <https://builds.apache.org/job/oodt-trunk/ws/protocol/api/target/cas-protocol-api-0.9-SNAPSHOT.jar>
to org.apache.oodt/cas-protocol-api/0.9-SNAPSHOT/cas-protocol-api-0.9-SNAPSHOT.jar
[JENKINS] Archiving <https://builds.apache.org/job/oodt-trunk/ws/protocol/api/target/cas-protocol-api-0.9-SNAPSHOT-dist.tar.gz>
to org.apache.oodt/cas-protocol-api/0.9-SNAPSHOT/cas-protocol-api-0.9-SNAPSHOT-dist.tar.gz
[JENKINS] Archiving <https://builds.apache.org/job/oodt-trunk/ws/protocol/api/target/cas-protocol-api-0.9-SNAPSHOT-dist.zip>
to org.apache.oodt/cas-protocol-api/0.9-SNAPSHOT/cas-protocol-api-0.9-SNAPSHOT-dist.zip
Sending artifact delta relative to oodt-trunk ? CAS Protocol #1840
Archived 4 artifacts
Archive block size is 32768
Received 239 blocks and 10566766 bytes
Compression is 42.6%
Took 4.7 sec
[JENKINS] Archiving <https://builds.apache.org/job/oodt-trunk/ws/filemgr/pom.xml> to
org.apache.oodt/cas-filemgr/0.9-SNAPSHOT/cas-filemgr-0.9-SNAPSHOT.pom
Sending artifact delta relative to oodt-trunk ? Catalog and Archive File Management Component
#1837
Archived 1 artifacts
Archive block size is 32768
Received 0 blocks and 10657 bytes
Compression is 0.0%
Took 17 sec
[JENKINS] Archiving <https://builds.apache.org/job/oodt-trunk/ws/cli/pom.xml> to org.apache.oodt/cas-cli/0.9-SNAPSHOT/cas-cli-0.9-SNAPSHOT.pom
[JENKINS] Archiving <https://builds.apache.org/job/oodt-trunk/ws/cli/target/cas-cli-0.9-SNAPSHOT.jar>
to org.apache.oodt/cas-cli/0.9-SNAPSHOT/cas-cli-0.9-SNAPSHOT.jar
[JENKINS] Archiving <https://builds.apache.org/job/oodt-trunk/ws/cli/target/cas-cli-0.9-SNAPSHOT-dist.tar.gz>
to org.apache.oodt/cas-cli/0.9-SNAPSHOT/cas-cli-0.9-SNAPSHOT-dist.tar.gz
[JENKINS] Archiving <https://builds.apache.org/job/oodt-trunk/ws/cli/target/cas-cli-0.9-SNAPSHOT-dist.zip>
to org.apache.oodt/cas-cli/0.9-SNAPSHOT/cas-cli-0.9-SNAPSHOT-dist.zip
Sending artifact delta relative to oodt-trunk ? CAS Command Line Interface #1840
Archived 4 artifacts
Archive block size is 32768
Received 174 blocks and 6965938 bytes
Compression is 45.0%
Took 5 sec
[JENKINS] Archiving <https://builds.apache.org/job/oodt-trunk/ws/xmlquery/pom.xml> to
org.apache.oodt/oodt-xmlquery/0.9-SNAPSHOT/oodt-xmlquery-0.9-SNAPSHOT.pom
[JENKINS] Archiving <https://builds.apache.org/job/oodt-trunk/ws/xmlquery/target/oodt-xmlquery-0.9-SNAPSHOT.jar>
to org.apache.oodt/oodt-xmlquery/0.9-SNAPSHOT/oodt-xmlquery-0.9-SNAPSHOT.jar
Sending artifact delta relative to oodt-trunk ? Query Expression #1840
Archived 2 artifacts
Archive block size is 32768
Received 0 blocks and 59382 bytes
Compression is 0.0%
Took 0.15 sec
[JENKINS] Archiving <https://builds.apache.org/job/oodt-trunk/ws/protocol/imaps/pom.xml>
to org.apache.oodt/cas-protocol-imaps/0.9-SNAPSHOT/cas-protocol-imaps-0.9-SNAPSHOT.pom
[JENKINS] Archiving <https://builds.apache.org/job/oodt-trunk/ws/protocol/imaps/target/cas-protocol-imaps-0.9-SNAPSHOT.jar>
to org.apache.oodt/cas-protocol-imaps/0.9-SNAPSHOT/cas-protocol-imaps-0.9-SNAPSHOT.jar
Sending artifact delta relative to oodt-trunk ? CAS Protocol IMAPS Implementation #1840
Archived 2 artifacts
Archive block size is 32768
Received 0 blocks and 22729 bytes
Compression is 0.0%
Took 61 ms
[JENKINS] Archiving <https://builds.apache.org/job/oodt-trunk/ws/commons/pom.xml> to
org.apache.oodt/oodt-commons/0.9-SNAPSHOT/oodt-commons-0.9-SNAPSHOT.pom
[JENKINS] Archiving <https://builds.apache.org/job/oodt-trunk/ws/commons/target/oodt-commons-0.9-SNAPSHOT.jar>
to org.apache.oodt/oodt-commons/0.9-SNAPSHOT/oodt-commons-0.9-SNAPSHOT.jar
Sending artifact delta relative to oodt-trunk ? Common Utilities #1840
Archived 2 artifacts
Archive block size is 32768
Received 0 blocks and 211980 bytes
Compression is 0.0%
Took 0.24 sec
[JENKINS] Archiving <https://builds.apache.org/job/oodt-trunk/ws/protocol/sftp/pom.xml>
to org.apache.oodt/cas-protocol-sftp/0.9-SNAPSHOT/cas-protocol-sftp-0.9-SNAPSHOT.pom
[JENKINS] Archiving <https://builds.apache.org/job/oodt-trunk/ws/protocol/sftp/target/cas-protocol-sftp-0.9-SNAPSHOT.jar>
to org.apache.oodt/cas-protocol-sftp/0.9-SNAPSHOT/cas-protocol-sftp-0.9-SNAPSHOT.jar
Sending artifact delta relative to oodt-trunk ? CAS Protocol SFTP Implementation #1840
Archived 2 artifacts
Archive block size is 32768
Received 0 blocks and 20630 bytes
Compression is 0.0%
Took 0.22 sec
[JENKINS] Archiving <https://builds.apache.org/job/oodt-trunk/ws/pcs/input/pom.xml>
to org.apache.oodt/pcs-input/0.9-SNAPSHOT/pcs-input-0.9-SNAPSHOT.pom
[JENKINS] Archiving <https://builds.apache.org/job/oodt-trunk/ws/pcs/input/target/pcs-input-0.9-SNAPSHOT.jar>
to org.apache.oodt/pcs-input/0.9-SNAPSHOT/pcs-input-0.9-SNAPSHOT.jar
Sending artifact delta relative to oodt-trunk ? Process Control System Input Data Package
#1840
Archived 2 artifacts
Archive block size is 32768
Received 0 blocks and 35380 bytes
Compression is 0.0%
Took 0.14 sec
Sending e-mails to: dev@oodt.apache.org
channel stopped

Mime
View raw message