oodt-dev mailing list archives

Site index · List index
Message view « Date » · « Thread »
Top « Date » · « Thread »
From Apache Jenkins Server <jenk...@builds.apache.org>
Subject Build failed in Jenkins: oodt-trunk #1694
Date Thu, 22 Jan 2015 00:02:17 GMT
See <https://builds.apache.org/job/oodt-trunk/1694/changes>

Changes:

[tpalsulich] Updat iml files.

------------------------------------------
[...truncated 11658 lines...]
Downloading: http://repository.jboss.org/nexus/content/groups/public//org/apache/hadoop/hadoop-yarn-common/2.4.0/hadoop-yarn-common-2.4.0.pom
[INFO] Unable to find resource 'org.apache.hadoop:hadoop-yarn-common:pom:2.4.0' in repository
repository.jboss.org (http://repository.jboss.org/nexus/content/groups/public/)
Downloading: http://repo1.maven.org/maven2/org/apache/hadoop/hadoop-yarn-common/2.4.0/hadoop-yarn-common-2.4.0.pom
8K downloaded  (hadoop-yarn-common-2.4.0.pom)
Downloading: https://repository.apache.org/content/repositories/snapshots/org/apache/hadoop/hadoop-yarn/2.4.0/hadoop-yarn-2.4.0.pom
[INFO] Unable to find resource 'org.apache.hadoop:hadoop-yarn:pom:2.4.0' in repository apache.snapshots.https
(https://repository.apache.org/content/repositories/snapshots)
Downloading: http://repository.jboss.org/nexus/content/groups/public//org/apache/hadoop/hadoop-yarn/2.4.0/hadoop-yarn-2.4.0.pom
[INFO] Unable to find resource 'org.apache.hadoop:hadoop-yarn:pom:2.4.0' in repository repository.jboss.org
(http://repository.jboss.org/nexus/content/groups/public/)
Downloading: http://repo1.maven.org/maven2/org/apache/hadoop/hadoop-yarn/2.4.0/hadoop-yarn-2.4.0.pom
3K downloaded  (hadoop-yarn-2.4.0.pom)
Downloading: https://repository.apache.org/content/repositories/snapshots/org/apache/hadoop/hadoop-yarn-api/2.4.0/hadoop-yarn-api-2.4.0.pom
[INFO] Unable to find resource 'org.apache.hadoop:hadoop-yarn-api:pom:2.4.0' in repository
apache.snapshots.https (https://repository.apache.org/content/repositories/snapshots)
Downloading: http://repository.jboss.org/nexus/content/groups/public//org/apache/hadoop/hadoop-yarn-api/2.4.0/hadoop-yarn-api-2.4.0.pom
[INFO] Unable to find resource 'org.apache.hadoop:hadoop-yarn-api:pom:2.4.0' in repository
repository.jboss.org (http://repository.jboss.org/nexus/content/groups/public/)
Downloading: http://repo1.maven.org/maven2/org/apache/hadoop/hadoop-yarn-api/2.4.0/hadoop-yarn-api-2.4.0.pom
4K downloaded  (hadoop-yarn-api-2.4.0.pom)
Downloading: https://repository.apache.org/content/repositories/snapshots/javax/xml/bind/jaxb-api/2.2.2/jaxb-api-2.2.2.pom
[INFO] Unable to find resource 'javax.xml.bind:jaxb-api:pom:2.2.2' in repository apache.snapshots.https
(https://repository.apache.org/content/repositories/snapshots)
Downloading: http://repository.jboss.org/nexus/content/groups/public//javax/xml/bind/jaxb-api/2.2.2/jaxb-api-2.2.2.pom
[INFO] Unable to find resource 'javax.xml.bind:jaxb-api:pom:2.2.2' in repository repository.jboss.org
(http://repository.jboss.org/nexus/content/groups/public/)
Downloading: http://repo1.maven.org/maven2/javax/xml/bind/jaxb-api/2.2.2/jaxb-api-2.2.2.pom
5K downloaded  (jaxb-api-2.2.2.pom)
Downloading: https://repository.apache.org/content/repositories/snapshots/javax/xml/stream/stax-api/1.0-2/stax-api-1.0-2.pom
[INFO] Unable to find resource 'javax.xml.stream:stax-api:pom:1.0-2' in repository apache.snapshots.https
(https://repository.apache.org/content/repositories/snapshots)
Downloading: http://repository.jboss.org/nexus/content/groups/public//javax/xml/stream/stax-api/1.0-2/stax-api-1.0-2.pom
[INFO] Unable to find resource 'javax.xml.stream:stax-api:pom:1.0-2' in repository repository.jboss.org
(http://repository.jboss.org/nexus/content/groups/public/)
Downloading: http://download.java.net/maven/2/javax/xml/stream/stax-api/1.0-2/stax-api-1.0-2.pom
[INFO] Unable to find resource 'javax.xml.stream:stax-api:pom:1.0-2' in repository m2.dev.java.net
(http://download.java.net/maven/2)
Downloading: http://repo1.maven.org/maven2/javax/xml/stream/stax-api/1.0-2/stax-api-1.0-2.pom
962b downloaded  (stax-api-1.0-2.pom)
Downloading: https://repository.apache.org/content/repositories/snapshots/com/google/inject/guice/3.0/guice-3.0.pom
[INFO] Unable to find resource 'com.google.inject:guice:pom:3.0' in repository apache.snapshots.https
(https://repository.apache.org/content/repositories/snapshots)
Downloading: http://repository.jboss.org/nexus/content/groups/public//com/google/inject/guice/3.0/guice-3.0.pom
[INFO] Unable to find resource 'com.google.inject:guice:pom:3.0' in repository repository.jboss.org
(http://repository.jboss.org/nexus/content/groups/public/)
Downloading: http://repo1.maven.org/maven2/com/google/inject/guice/3.0/guice-3.0.pom
7K downloaded  (guice-3.0.pom)
Downloading: https://repository.apache.org/content/repositories/snapshots/com/google/inject/guice-parent/3.0/guice-parent-3.0.pom
[INFO] Unable to find resource 'com.google.inject:guice-parent:pom:3.0' in repository apache.snapshots.https
(https://repository.apache.org/content/repositories/snapshots)
Downloading: http://repository.jboss.org/nexus/content/groups/public//com/google/inject/guice-parent/3.0/guice-parent-3.0.pom
[INFO] Unable to find resource 'com.google.inject:guice-parent:pom:3.0' in repository repository.jboss.org
(http://repository.jboss.org/nexus/content/groups/public/)
Downloading: http://repo1.maven.org/maven2/com/google/inject/guice-parent/3.0/guice-parent-3.0.pom
12K downloaded  (guice-parent-3.0.pom)
Downloading: https://repository.apache.org/content/repositories/snapshots/com/google/google/5/google-5.pom
[INFO] Unable to find resource 'com.google:google:pom:5' in repository apache.snapshots.https
(https://repository.apache.org/content/repositories/snapshots)
Downloading: http://repository.jboss.org/nexus/content/groups/public//com/google/google/5/google-5.pom
[INFO] Unable to find resource 'com.google:google:pom:5' in repository repository.jboss.org
(http://repository.jboss.org/nexus/content/groups/public/)
Downloading: http://repo1.maven.org/maven2/com/google/google/5/google-5.pom
2K downloaded  (google-5.pom)
Downloading: https://repository.apache.org/content/repositories/snapshots/javax/inject/javax.inject/1/javax.inject-1.pom
[INFO] Unable to find resource 'javax.inject:javax.inject:pom:1' in repository apache.snapshots.https
(https://repository.apache.org/content/repositories/snapshots)
Downloading: http://repository.jboss.org/nexus/content/groups/public//javax/inject/javax.inject/1/javax.inject-1.pom
[INFO] Unable to find resource 'javax.inject:javax.inject:pom:1' in repository repository.jboss.org
(http://repository.jboss.org/nexus/content/groups/public/)
Downloading: http://repo1.maven.org/maven2/javax/inject/javax.inject/1/javax.inject-1.pom
612b downloaded  (javax.inject-1.pom)
Downloading: https://repository.apache.org/content/repositories/snapshots/com/sun/jersey/contribs/jersey-guice/1.9/jersey-guice-1.9.pom
[INFO] Unable to find resource 'com.sun.jersey.contribs:jersey-guice:pom:1.9' in repository
apache.snapshots.https (https://repository.apache.org/content/repositories/snapshots)
Downloading: http://repository.jboss.org/nexus/content/groups/public//com/sun/jersey/contribs/jersey-guice/1.9/jersey-guice-1.9.pom
[INFO] Unable to find resource 'com.sun.jersey.contribs:jersey-guice:pom:1.9' in repository
repository.jboss.org (http://repository.jboss.org/nexus/content/groups/public/)
Downloading: http://repo1.maven.org/maven2/com/sun/jersey/contribs/jersey-guice/1.9/jersey-guice-1.9.pom
7K downloaded  (jersey-guice-1.9.pom)
Downloading: https://repository.apache.org/content/repositories/snapshots/com/sun/jersey/contribs/jersey-contribs/1.9/jersey-contribs-1.9.pom
[INFO] Unable to find resource 'com.sun.jersey.contribs:jersey-contribs:pom:1.9' in repository
apache.snapshots.https (https://repository.apache.org/content/repositories/snapshots)
Downloading: http://repository.jboss.org/nexus/content/groups/public//com/sun/jersey/contribs/jersey-contribs/1.9/jersey-contribs-1.9.pom
[INFO] Unable to find resource 'com.sun.jersey.contribs:jersey-contribs:pom:1.9' in repository
repository.jboss.org (http://repository.jboss.org/nexus/content/groups/public/)
Downloading: http://repo1.maven.org/maven2/com/sun/jersey/contribs/jersey-contribs/1.9/jersey-contribs-1.9.pom
4K downloaded  (jersey-contribs-1.9.pom)
Downloading: https://repository.apache.org/content/repositories/snapshots/com/sun/jersey/jersey-project/1.9/jersey-project-1.9.pom
[INFO] Unable to find resource 'com.sun.jersey:jersey-project:pom:1.9' in repository apache.snapshots.https
(https://repository.apache.org/content/repositories/snapshots)
Downloading: http://repository.jboss.org/nexus/content/groups/public//com/sun/jersey/jersey-project/1.9/jersey-project-1.9.pom
[INFO] Unable to find resource 'com.sun.jersey:jersey-project:pom:1.9' in repository repository.jboss.org
(http://repository.jboss.org/nexus/content/groups/public/)
Downloading: http://repo1.maven.org/maven2/com/sun/jersey/jersey-project/1.9/jersey-project-1.9.pom
17K downloaded  (jersey-project-1.9.pom)
Downloading: http://download.java.net/maven/2/net/java/jvnet-parent/1/jvnet-parent-1.pom
[INFO] Unable to find resource 'net.java:jvnet-parent:pom:1' in repository m2.java.net (http://download.java.net/maven/2)
Downloading: http://repository.jboss.org/nexus/content/groups/public//net/java/jvnet-parent/1/jvnet-parent-1.pom
[INFO] Unable to find resource 'net.java:jvnet-parent:pom:1' in repository repository.jboss.org
(http://repository.jboss.org/nexus/content/groups/public/)
Downloading: http://maven.glassfish.org/content/groups/glassfish/net/java/jvnet-parent/1/jvnet-parent-1.pom
178b downloaded  (jvnet-parent-1.pom)
[WARNING] *** CHECKSUM FAILED - Checksum failed on download: local = '81ffbd1712afe8cdf138b570c0fc9934742c33c1';
remote = '<html>
<head><title>301' - RETRYING
Downloading: http://maven.glassfish.org/content/groups/glassfish/net/java/jvnet-parent/1/jvnet-parent-1.pom
178b downloaded  (jvnet-parent-1.pom)
[WARNING] *** CHECKSUM FAILED - Checksum failed on download: local = '81ffbd1712afe8cdf138b570c0fc9934742c33c1';
remote = '<html>
<head><title>301' - IGNORING
[INFO] ------------------------------------------------------------------------
[ERROR] BUILD ERROR
[INFO] ------------------------------------------------------------------------
[INFO] Failed to resolve dependencies for one or more projects in the reactor. Reason: Unable
to get dependency information: Unable to read the metadata file for artifact 'com.sun.jersey.contribs:jersey-guice:jar':
Cannot find parent: net.java:jvnet-parent for project: com.sun.jersey:jersey-project:pom:1.9
for project com.sun.jersey:jersey-project:pom:1.9
  com.sun.jersey.contribs:jersey-guice:jar:1.9

from the specified remote repositories:
  apache.snapshots.https (https://repository.apache.org/content/repositories/snapshots),
  apache.snapshots (http://repository.apache.org/snapshots),
  central (http://repo1.maven.org/maven2),
  repository.jboss.org (http://repository.jboss.org/nexus/content/groups/public/)

Path to dependency: 
	1) org.apache.oodt:cas-resource:jar:0.9-SNAPSHOT
	2) org.apache.hadoop:hadoop-client:jar:2.4.0
	3) org.apache.hadoop:hadoop-mapreduce-client-app:jar:2.4.0
	4) org.apache.hadoop:hadoop-mapreduce-client-common:jar:2.4.0
	5) org.apache.hadoop:hadoop-yarn-common:jar:2.4.0



Not a v4.0.0 POM. for project net.java:jvnet-parent at <https://builds.apache.org/job/oodt-trunk/ws/.repository/net/java/jvnet-parent/1/jvnet-parent-1.pom>
[INFO] ------------------------------------------------------------------------
[INFO] For more information, run Maven with the -e switch
[INFO] ------------------------------------------------------------------------
[INFO] Total time: 5 minutes 14 seconds
[INFO] Finished at: Thu Jan 22 00:01:53 UTC 2015
[INFO] Final Memory: 222M/664M
[INFO] ------------------------------------------------------------------------
[JENKINS] Archiving <https://builds.apache.org/job/oodt-trunk/ws/sso/pom.xml> to org.apache.oodt/oodt-sso/0.9-SNAPSHOT/oodt-sso-0.9-SNAPSHOT.pom
[JENKINS] Archiving <https://builds.apache.org/job/oodt-trunk/ws/sso/target/oodt-sso-0.9-SNAPSHOT.jar>
to org.apache.oodt/oodt-sso/0.9-SNAPSHOT/oodt-sso-0.9-SNAPSHOT.jar
Sending artifact delta relative to oodt-trunk » OODT Single Sign On Security Package #1693
Archived 2 artifacts
Archive block size is 32768
Received 0 blocks and 25304 bytes
Compression is 0.0%
Took 44 ms
[JENKINS] Archiving <https://builds.apache.org/job/oodt-trunk/ws/protocol/ftp/pom.xml>
to org.apache.oodt/cas-protocol-ftp/0.9-SNAPSHOT/cas-protocol-ftp-0.9-SNAPSHOT.pom
[JENKINS] Archiving <https://builds.apache.org/job/oodt-trunk/ws/protocol/ftp/target/cas-protocol-ftp-0.9-SNAPSHOT.jar>
to org.apache.oodt/cas-protocol-ftp/0.9-SNAPSHOT/cas-protocol-ftp-0.9-SNAPSHOT.jar
Sending artifact delta relative to oodt-trunk » CAS Protocol FTP Implementation #1693
Archived 2 artifacts
Archive block size is 32768
Received 0 blocks and 21945 bytes
Compression is 0.0%
Took 43 ms
[JENKINS] Archiving <https://builds.apache.org/job/oodt-trunk/ws/metadata/pom.xml> to
org.apache.oodt/cas-metadata/0.9-SNAPSHOT/cas-metadata-0.9-SNAPSHOT.pom
[JENKINS] Archiving <https://builds.apache.org/job/oodt-trunk/ws/metadata/target/cas-metadata-0.9-SNAPSHOT.jar>
to org.apache.oodt/cas-metadata/0.9-SNAPSHOT/cas-metadata-0.9-SNAPSHOT.jar
Sending artifact delta relative to oodt-trunk » Catalog and Archive Service Generic Multi-valued
Metadata Container #1693
Archived 2 artifacts
Archive block size is 32768
Received 0 blocks and 118337 bytes
Compression is 0.0%
Took 0.1 sec
[JENKINS] Archiving <https://builds.apache.org/job/oodt-trunk/ws/.repository/org/apache/oodt/oodt-core/0.9-SNAPSHOT/oodt-core-0.9-SNAPSHOT.pom>
to org.apache.oodt/oodt-core/0.9-SNAPSHOT/oodt-core-0.9-SNAPSHOT.pom
[JENKINS] Archiving <https://builds.apache.org/job/oodt-trunk/ws/core/target/oodt-core-0.9-SNAPSHOT-site.xml>
to org.apache.oodt/oodt-core/0.9-SNAPSHOT/oodt-core-0.9-SNAPSHOT-site.xml
<https://builds.apache.org/job/oodt-trunk/ws/.repository/org/apache/oodt/oodt-core/0.9-SNAPSHOT/oodt-core-0.9-SNAPSHOT.pom>
is not inside <https://builds.apache.org/job/oodt-trunk/ws/core/;> will archive in a
separate pass
Sending artifact delta relative to oodt-trunk » OODT Core #1693
Archived 1 artifacts
Archive block size is 32768
Received 0 blocks and 462 bytes
Compression is 0.0%
Took 29 ms
Sending artifact delta relative to oodt-trunk » OODT Core #1693
Archived 1 artifacts
Archive block size is 32768
Received 0 blocks and 18747 bytes
Compression is 0.0%
Took 30 ms
[JENKINS] Archiving <https://builds.apache.org/job/oodt-trunk/ws/protocol/http/pom.xml>
to org.apache.oodt/cas-protocol-http/0.9-SNAPSHOT/cas-protocol-http-0.9-SNAPSHOT.pom
[JENKINS] Archiving <https://builds.apache.org/job/oodt-trunk/ws/protocol/http/target/cas-protocol-http-0.9-SNAPSHOT.jar>
to org.apache.oodt/cas-protocol-http/0.9-SNAPSHOT/cas-protocol-http-0.9-SNAPSHOT.jar
Sending artifact delta relative to oodt-trunk » CAS Protocol HTTP Implementation #1693
Archived 2 artifacts
Archive block size is 32768
Received 0 blocks and 22918 bytes
Compression is 0.0%
Took 40 ms
[JENKINS] Archiving <https://builds.apache.org/job/oodt-trunk/ws/protocol/api/pom.xml>
to org.apache.oodt/cas-protocol-api/0.9-SNAPSHOT/cas-protocol-api-0.9-SNAPSHOT.pom
[JENKINS] Archiving <https://builds.apache.org/job/oodt-trunk/ws/protocol/api/target/cas-protocol-api-0.9-SNAPSHOT.jar>
to org.apache.oodt/cas-protocol-api/0.9-SNAPSHOT/cas-protocol-api-0.9-SNAPSHOT.jar
[JENKINS] Archiving <https://builds.apache.org/job/oodt-trunk/ws/protocol/api/target/cas-protocol-api-0.9-SNAPSHOT-dist.tar.gz>
to org.apache.oodt/cas-protocol-api/0.9-SNAPSHOT/cas-protocol-api-0.9-SNAPSHOT-dist.tar.gz
[JENKINS] Archiving <https://builds.apache.org/job/oodt-trunk/ws/protocol/api/target/cas-protocol-api-0.9-SNAPSHOT-dist.zip>
to org.apache.oodt/cas-protocol-api/0.9-SNAPSHOT/cas-protocol-api-0.9-SNAPSHOT-dist.zip
Sending artifact delta relative to oodt-trunk » CAS Protocol #1693
Archived 4 artifacts
Archive block size is 32768
Received 240 blocks and 10523505 bytes
Compression is 42.8%
Took 3 sec
[JENKINS] Archiving <https://builds.apache.org/job/oodt-trunk/ws/filemgr/pom.xml> to
org.apache.oodt/cas-filemgr/0.9-SNAPSHOT/cas-filemgr-0.9-SNAPSHOT.pom
[JENKINS] Archiving <https://builds.apache.org/job/oodt-trunk/ws/filemgr/target/cas-filemgr-0.9-SNAPSHOT.jar>
to org.apache.oodt/cas-filemgr/0.9-SNAPSHOT/cas-filemgr-0.9-SNAPSHOT.jar
[JENKINS] Archiving <https://builds.apache.org/job/oodt-trunk/ws/filemgr/target/cas-filemgr-0.9-SNAPSHOT-dist.tar.gz>
to org.apache.oodt/cas-filemgr/0.9-SNAPSHOT/cas-filemgr-0.9-SNAPSHOT-dist.tar.gz
[JENKINS] Archiving <https://builds.apache.org/job/oodt-trunk/ws/filemgr/target/cas-filemgr-0.9-SNAPSHOT-dist.zip>
to org.apache.oodt/cas-filemgr/0.9-SNAPSHOT/cas-filemgr-0.9-SNAPSHOT-dist.zip
Sending artifact delta relative to oodt-trunk » Catalog and Archive File Management Component
#1693
Archived 4 artifacts
Archive block size is 32768
Received 740 blocks and 29786867 bytes
Compression is 44.9%
Took 8.6 sec
[JENKINS] Archiving <https://builds.apache.org/job/oodt-trunk/ws/cli/pom.xml> to org.apache.oodt/cas-cli/0.9-SNAPSHOT/cas-cli-0.9-SNAPSHOT.pom
[JENKINS] Archiving <https://builds.apache.org/job/oodt-trunk/ws/cli/target/cas-cli-0.9-SNAPSHOT.jar>
to org.apache.oodt/cas-cli/0.9-SNAPSHOT/cas-cli-0.9-SNAPSHOT.jar
[JENKINS] Archiving <https://builds.apache.org/job/oodt-trunk/ws/cli/target/cas-cli-0.9-SNAPSHOT-dist.tar.gz>
to org.apache.oodt/cas-cli/0.9-SNAPSHOT/cas-cli-0.9-SNAPSHOT-dist.tar.gz
[JENKINS] Archiving <https://builds.apache.org/job/oodt-trunk/ws/cli/target/cas-cli-0.9-SNAPSHOT-dist.zip>
to org.apache.oodt/cas-cli/0.9-SNAPSHOT/cas-cli-0.9-SNAPSHOT-dist.zip
Sending artifact delta relative to oodt-trunk » CAS Command Line Interface #1693
Archived 4 artifacts
Archive block size is 32768
Received 186 blocks and 6570767 bytes
Compression is 48.1%
Took 1.9 sec
[JENKINS] Archiving <https://builds.apache.org/job/oodt-trunk/ws/xmlquery/pom.xml> to
org.apache.oodt/oodt-xmlquery/0.9-SNAPSHOT/oodt-xmlquery-0.9-SNAPSHOT.pom
[JENKINS] Archiving <https://builds.apache.org/job/oodt-trunk/ws/xmlquery/target/oodt-xmlquery-0.9-SNAPSHOT.jar>
to org.apache.oodt/oodt-xmlquery/0.9-SNAPSHOT/oodt-xmlquery-0.9-SNAPSHOT.jar
Sending artifact delta relative to oodt-trunk » Query Expression #1693
Archived 2 artifacts
Archive block size is 32768
Received 0 blocks and 58784 bytes
Compression is 0.0%
Took 41 ms
[JENKINS] Archiving <https://builds.apache.org/job/oodt-trunk/ws/protocol/imaps/pom.xml>
to org.apache.oodt/cas-protocol-imaps/0.9-SNAPSHOT/cas-protocol-imaps-0.9-SNAPSHOT.pom
[JENKINS] Archiving <https://builds.apache.org/job/oodt-trunk/ws/protocol/imaps/target/cas-protocol-imaps-0.9-SNAPSHOT.jar>
to org.apache.oodt/cas-protocol-imaps/0.9-SNAPSHOT/cas-protocol-imaps-0.9-SNAPSHOT.jar
Sending artifact delta relative to oodt-trunk » CAS Protocol IMAPS Implementation #1693
Archived 2 artifacts
Archive block size is 32768
Received 0 blocks and 22523 bytes
Compression is 0.0%
Took 33 ms
[JENKINS] Archiving <https://builds.apache.org/job/oodt-trunk/ws/commons/pom.xml> to
org.apache.oodt/oodt-commons/0.9-SNAPSHOT/oodt-commons-0.9-SNAPSHOT.pom
[JENKINS] Archiving <https://builds.apache.org/job/oodt-trunk/ws/commons/target/oodt-commons-0.9-SNAPSHOT.jar>
to org.apache.oodt/oodt-commons/0.9-SNAPSHOT/oodt-commons-0.9-SNAPSHOT.jar
Sending artifact delta relative to oodt-trunk » Common Utilities #1693
Archived 2 artifacts
Archive block size is 32768
Received 0 blocks and 209770 bytes
Compression is 0.0%
Took 75 ms
[JENKINS] Archiving <https://builds.apache.org/job/oodt-trunk/ws/protocol/sftp/pom.xml>
to org.apache.oodt/cas-protocol-sftp/0.9-SNAPSHOT/cas-protocol-sftp-0.9-SNAPSHOT.pom
[JENKINS] Archiving <https://builds.apache.org/job/oodt-trunk/ws/protocol/sftp/target/cas-protocol-sftp-0.9-SNAPSHOT.jar>
to org.apache.oodt/cas-protocol-sftp/0.9-SNAPSHOT/cas-protocol-sftp-0.9-SNAPSHOT.jar
Sending artifact delta relative to oodt-trunk » CAS Protocol SFTP Implementation #1693
Archived 2 artifacts
Archive block size is 32768
Received 0 blocks and 20023 bytes
Compression is 0.0%
Took 32 ms
[JENKINS] Archiving <https://builds.apache.org/job/oodt-trunk/ws/pcs/input/pom.xml>
to org.apache.oodt/pcs-input/0.9-SNAPSHOT/pcs-input-0.9-SNAPSHOT.pom
[JENKINS] Archiving <https://builds.apache.org/job/oodt-trunk/ws/pcs/input/target/pcs-input-0.9-SNAPSHOT.jar>
to org.apache.oodt/pcs-input/0.9-SNAPSHOT/pcs-input-0.9-SNAPSHOT.jar
Sending artifact delta relative to oodt-trunk » Process Control System Input Data Package
#1693
Archived 2 artifacts
Archive block size is 32768
Received 0 blocks and 34987 bytes
Compression is 0.0%
Took 34 ms
[JENKINS] Archiving <https://builds.apache.org/job/oodt-trunk/ws/resource/pom.xml> to
org.apache.oodt/cas-resource/0.9-SNAPSHOT/cas-resource-0.9-SNAPSHOT.pom
Sending artifact delta relative to oodt-trunk » Catalog and Archive Resource Management Component
#1667
Archived 1 artifacts
Archive block size is 32768
Received 0 blocks and 8394 bytes
Compression is 0.0%
Took 0.31 sec
[JENKINS] Archiving <https://builds.apache.org/job/oodt-trunk/ws/catalog/pom.xml> to
org.apache.oodt/cas-catalog/0.9-SNAPSHOT/cas-catalog-0.9-SNAPSHOT.pom
[JENKINS] Archiving <https://builds.apache.org/job/oodt-trunk/ws/catalog/target/cas-catalog-0.9-SNAPSHOT.jar>
to org.apache.oodt/cas-catalog/0.9-SNAPSHOT/cas-catalog-0.9-SNAPSHOT.jar
[JENKINS] Archiving <https://builds.apache.org/job/oodt-trunk/ws/catalog/target/cas-catalog-0.9-SNAPSHOT-dist.tar.gz>
to org.apache.oodt/cas-catalog/0.9-SNAPSHOT/cas-catalog-0.9-SNAPSHOT-dist.tar.gz
[JENKINS] Archiving <https://builds.apache.org/job/oodt-trunk/ws/catalog/target/cas-catalog-0.9-SNAPSHOT-dist.zip>
to org.apache.oodt/cas-catalog/0.9-SNAPSHOT/cas-catalog-0.9-SNAPSHOT-dist.zip
Sending artifact delta relative to oodt-trunk » OODT CAS Virtual Catalog and Integration
Service. #1693
Archived 4 artifacts
Archive block size is 32768
Received 274 blocks and 12485103 bytes
Compression is 41.8%
Took 3.5 sec
Sending e-mails to: dev@oodt.apache.org
channel stopped

Mime
View raw message