oodt-dev mailing list archives

Site index · List index
Message view « Date » · « Thread »
Top « Date » · « Thread »
From Apache Jenkins Server <jenk...@builds.apache.org>
Subject Build failed in Jenkins: oodt-trunk » Catalog and Archive Resource Management Component #1678
Date Wed, 14 Jan 2015 23:15:56 GMT
See <https://builds.apache.org/job/oodt-trunk/org.apache.oodt$cas-resource/1678/>

------------------------------------------
[...truncated 303 lines...]
Downloading: http://repo1.maven.org/maven2/commons-logging/commons-logging/1.1.3/commons-logging-1.1.3.pom
17K downloaded  (commons-logging-1.1.3.pom)
Downloading: https://repository.apache.org/content/repositories/snapshots/org/apache/commons/commons-parent/28/commons-parent-28.pom
[INFO] Unable to find resource 'org.apache.commons:commons-parent:pom:28' in repository apache.snapshots.https
(https://repository.apache.org/content/repositories/snapshots)
Downloading: http://repository.jboss.org/nexus/content/groups/public//org/apache/commons/commons-parent/28/commons-parent-28.pom
[INFO] Unable to find resource 'org.apache.commons:commons-parent:pom:28' in repository repository.jboss.org
(http://repository.jboss.org/nexus/content/groups/public/)
Downloading: http://repo1.maven.org/maven2/org/apache/commons/commons-parent/28/commons-parent-28.pom
48K downloaded  (commons-parent-28.pom)
Downloading: https://repository.apache.org/content/repositories/snapshots/commons-lang/commons-lang/2.6/commons-lang-2.6.pom
[INFO] Unable to find resource 'commons-lang:commons-lang:pom:2.6' in repository apache.snapshots.https
(https://repository.apache.org/content/repositories/snapshots)
Downloading: http://repository.jboss.org/nexus/content/groups/public//commons-lang/commons-lang/2.6/commons-lang-2.6.pom
[INFO] Unable to find resource 'commons-lang:commons-lang:pom:2.6' in repository repository.jboss.org
(http://repository.jboss.org/nexus/content/groups/public/)
Downloading: http://repo1.maven.org/maven2/commons-lang/commons-lang/2.6/commons-lang-2.6.pom
17K downloaded  (commons-lang-2.6.pom)
Downloading: https://repository.apache.org/content/repositories/snapshots/org/codehaus/jackson/jackson-core-asl/1.8.8/jackson-core-asl-1.8.8.pom
[INFO] Unable to find resource 'org.codehaus.jackson:jackson-core-asl:pom:1.8.8' in repository
apache.snapshots.https (https://repository.apache.org/content/repositories/snapshots)
Downloading: http://repository.jboss.org/nexus/content/groups/public//org/codehaus/jackson/jackson-core-asl/1.8.8/jackson-core-asl-1.8.8.pom
[INFO] Unable to find resource 'org.codehaus.jackson:jackson-core-asl:pom:1.8.8' in repository
repository.jboss.org (http://repository.jboss.org/nexus/content/groups/public/)
Downloading: http://repo1.maven.org/maven2/org/codehaus/jackson/jackson-core-asl/1.8.8/jackson-core-asl-1.8.8.pom
1016b downloaded  (jackson-core-asl-1.8.8.pom)
Downloading: https://repository.apache.org/content/repositories/snapshots/org/codehaus/jackson/jackson-mapper-asl/1.8.8/jackson-mapper-asl-1.8.8.pom
[INFO] Unable to find resource 'org.codehaus.jackson:jackson-mapper-asl:pom:1.8.8' in repository
apache.snapshots.https (https://repository.apache.org/content/repositories/snapshots)
Downloading: http://repository.jboss.org/nexus/content/groups/public//org/codehaus/jackson/jackson-mapper-asl/1.8.8/jackson-mapper-asl-1.8.8.pom
[INFO] Unable to find resource 'org.codehaus.jackson:jackson-mapper-asl:pom:1.8.8' in repository
repository.jboss.org (http://repository.jboss.org/nexus/content/groups/public/)
Downloading: http://repo1.maven.org/maven2/org/codehaus/jackson/jackson-mapper-asl/1.8.8/jackson-mapper-asl-1.8.8.pom
1K downloaded  (jackson-mapper-asl-1.8.8.pom)
Downloading: https://repository.apache.org/content/repositories/snapshots/org/apache/avro/avro/1.7.4/avro-1.7.4.pom
[INFO] Unable to find resource 'org.apache.avro:avro:pom:1.7.4' in repository apache.snapshots.https
(https://repository.apache.org/content/repositories/snapshots)
Downloading: http://repository.jboss.org/nexus/content/groups/public//org/apache/avro/avro/1.7.4/avro-1.7.4.pom
[INFO] Unable to find resource 'org.apache.avro:avro:pom:1.7.4' in repository repository.jboss.org
(http://repository.jboss.org/nexus/content/groups/public/)
Downloading: http://repo1.maven.org/maven2/org/apache/avro/avro/1.7.4/avro-1.7.4.pom
4K downloaded  (avro-1.7.4.pom)
Downloading: https://repository.apache.org/content/repositories/snapshots/org/apache/avro/avro-parent/1.7.4/avro-parent-1.7.4.pom
[INFO] Unable to find resource 'org.apache.avro:avro-parent:pom:1.7.4' in repository apache.snapshots.https
(https://repository.apache.org/content/repositories/snapshots)
Downloading: http://repository.jboss.org/nexus/content/groups/public//org/apache/avro/avro-parent/1.7.4/avro-parent-1.7.4.pom
[INFO] Unable to find resource 'org.apache.avro:avro-parent:pom:1.7.4' in repository repository.jboss.org
(http://repository.jboss.org/nexus/content/groups/public/)
Downloading: http://repo1.maven.org/maven2/org/apache/avro/avro-parent/1.7.4/avro-parent-1.7.4.pom
15K downloaded  (avro-parent-1.7.4.pom)
Downloading: https://repository.apache.org/content/repositories/snapshots/org/apache/avro/avro-toplevel/1.7.4/avro-toplevel-1.7.4.pom
[INFO] Unable to find resource 'org.apache.avro:avro-toplevel:pom:1.7.4' in repository apache.snapshots.https
(https://repository.apache.org/content/repositories/snapshots)
Downloading: http://repository.jboss.org/nexus/content/groups/public//org/apache/avro/avro-toplevel/1.7.4/avro-toplevel-1.7.4.pom
[INFO] Unable to find resource 'org.apache.avro:avro-toplevel:pom:1.7.4' in repository repository.jboss.org
(http://repository.jboss.org/nexus/content/groups/public/)
Downloading: http://repo1.maven.org/maven2/org/apache/avro/avro-toplevel/1.7.4/avro-toplevel-1.7.4.pom
9K downloaded  (avro-toplevel-1.7.4.pom)
Downloading: https://repository.apache.org/content/repositories/snapshots/com/thoughtworks/paranamer/paranamer/2.3/paranamer-2.3.pom
[INFO] Unable to find resource 'com.thoughtworks.paranamer:paranamer:pom:2.3' in repository
apache.snapshots.https (https://repository.apache.org/content/repositories/snapshots)
Downloading: http://repository.jboss.org/nexus/content/groups/public//com/thoughtworks/paranamer/paranamer/2.3/paranamer-2.3.pom
[INFO] Unable to find resource 'com.thoughtworks.paranamer:paranamer:pom:2.3' in repository
repository.jboss.org (http://repository.jboss.org/nexus/content/groups/public/)
Downloading: http://repo1.maven.org/maven2/com/thoughtworks/paranamer/paranamer/2.3/paranamer-2.3.pom
1K downloaded  (paranamer-2.3.pom)
Downloading: https://repository.apache.org/content/repositories/snapshots/com/thoughtworks/paranamer/paranamer-parent/2.3/paranamer-parent-2.3.pom
[INFO] Unable to find resource 'com.thoughtworks.paranamer:paranamer-parent:pom:2.3' in repository
apache.snapshots.https (https://repository.apache.org/content/repositories/snapshots)
Downloading: http://repository.jboss.org/nexus/content/groups/public//com/thoughtworks/paranamer/paranamer-parent/2.3/paranamer-parent-2.3.pom
[INFO] Unable to find resource 'com.thoughtworks.paranamer:paranamer-parent:pom:2.3' in repository
repository.jboss.org (http://repository.jboss.org/nexus/content/groups/public/)
Downloading: http://repo1.maven.org/maven2/com/thoughtworks/paranamer/paranamer-parent/2.3/paranamer-parent-2.3.pom
10K downloaded  (paranamer-parent-2.3.pom)
Downloading: https://repository.apache.org/content/repositories/snapshots/org/codehaus/codehaus-parent/1/codehaus-parent-1.pom
[INFO] Unable to find resource 'org.codehaus:codehaus-parent:pom:1' in repository apache.snapshots.https
(https://repository.apache.org/content/repositories/snapshots)
Downloading: http://repository.jboss.org/nexus/content/groups/public//org/codehaus/codehaus-parent/1/codehaus-parent-1.pom
3K downloaded  (codehaus-parent-1.pom)
Downloading: https://repository.apache.org/content/repositories/snapshots/org/xerial/snappy/snappy-java/1.0.4.1/snappy-java-1.0.4.1.pom
[INFO] Unable to find resource 'org.xerial.snappy:snappy-java:pom:1.0.4.1' in repository apache.snapshots.https
(https://repository.apache.org/content/repositories/snapshots)
Downloading: http://repository.jboss.org/nexus/content/groups/public//org/xerial/snappy/snappy-java/1.0.4.1/snappy-java-1.0.4.1.pom
[INFO] Unable to find resource 'org.xerial.snappy:snappy-java:pom:1.0.4.1' in repository repository.jboss.org
(http://repository.jboss.org/nexus/content/groups/public/)
Downloading: http://repo1.maven.org/maven2/org/xerial/snappy/snappy-java/1.0.4.1/snappy-java-1.0.4.1.pom
9K downloaded  (snappy-java-1.0.4.1.pom)
Downloading: https://repository.apache.org/content/repositories/snapshots/org/apache/commons/commons-compress/1.4.1/commons-compress-1.4.1.pom
[INFO] Unable to find resource 'org.apache.commons:commons-compress:pom:1.4.1' in repository
apache.snapshots.https (https://repository.apache.org/content/repositories/snapshots)
Downloading: http://repository.jboss.org/nexus/content/groups/public//org/apache/commons/commons-compress/1.4.1/commons-compress-1.4.1.pom
[INFO] Unable to find resource 'org.apache.commons:commons-compress:pom:1.4.1' in repository
repository.jboss.org (http://repository.jboss.org/nexus/content/groups/public/)
Downloading: http://repo1.maven.org/maven2/org/apache/commons/commons-compress/1.4.1/commons-compress-1.4.1.pom
10K downloaded  (commons-compress-1.4.1.pom)
Downloading: https://repository.apache.org/content/repositories/snapshots/org/tukaani/xz/1.0/xz-1.0.pom
[INFO] Unable to find resource 'org.tukaani:xz:pom:1.0' in repository apache.snapshots.https
(https://repository.apache.org/content/repositories/snapshots)
Downloading: http://repository.jboss.org/nexus/content/groups/public//org/tukaani/xz/1.0/xz-1.0.pom
[INFO] Unable to find resource 'org.tukaani:xz:pom:1.0' in repository repository.jboss.org
(http://repository.jboss.org/nexus/content/groups/public/)
Downloading: http://repo1.maven.org/maven2/org/tukaani/xz/1.0/xz-1.0.pom
1K downloaded  (xz-1.0.pom)
Downloading: https://repository.apache.org/content/repositories/snapshots/com/google/protobuf/protobuf-java/2.5.0/protobuf-java-2.5.0.pom
[INFO] Unable to find resource 'com.google.protobuf:protobuf-java:pom:2.5.0' in repository
apache.snapshots.https (https://repository.apache.org/content/repositories/snapshots)
Downloading: http://repository.jboss.org/nexus/content/groups/public//com/google/protobuf/protobuf-java/2.5.0/protobuf-java-2.5.0.pom
[INFO] Unable to find resource 'com.google.protobuf:protobuf-java:pom:2.5.0' in repository
repository.jboss.org (http://repository.jboss.org/nexus/content/groups/public/)
Downloading: http://repo1.maven.org/maven2/com/google/protobuf/protobuf-java/2.5.0/protobuf-java-2.5.0.pom
8K downloaded  (protobuf-java-2.5.0.pom)
Downloading: https://repository.apache.org/content/repositories/snapshots/org/apache/hadoop/hadoop-auth/2.4.0/hadoop-auth-2.4.0.pom
[INFO] Unable to find resource 'org.apache.hadoop:hadoop-auth:pom:2.4.0' in repository apache.snapshots.https
(https://repository.apache.org/content/repositories/snapshots)
Downloading: http://repository.jboss.org/nexus/content/groups/public//org/apache/hadoop/hadoop-auth/2.4.0/hadoop-auth-2.4.0.pom
[INFO] Unable to find resource 'org.apache.hadoop:hadoop-auth:pom:2.4.0' in repository repository.jboss.org
(http://repository.jboss.org/nexus/content/groups/public/)
Downloading: http://repo1.maven.org/maven2/org/apache/hadoop/hadoop-auth/2.4.0/hadoop-auth-2.4.0.pom
5K downloaded  (hadoop-auth-2.4.0.pom)
Downloading: https://repository.apache.org/content/repositories/snapshots/org/apache/httpcomponents/httpclient/4.2.5/httpclient-4.2.5.pom
[INFO] Unable to find resource 'org.apache.httpcomponents:httpclient:pom:4.2.5' in repository
apache.snapshots.https (https://repository.apache.org/content/repositories/snapshots)
Downloading: http://repository.jboss.org/nexus/content/groups/public//org/apache/httpcomponents/httpclient/4.2.5/httpclient-4.2.5.pom
[INFO] Unable to find resource 'org.apache.httpcomponents:httpclient:pom:4.2.5' in repository
repository.jboss.org (http://repository.jboss.org/nexus/content/groups/public/)
Downloading: http://repo1.maven.org/maven2/org/apache/httpcomponents/httpclient/4.2.5/httpclient-4.2.5.pom
5K downloaded  (httpclient-4.2.5.pom)
Downloading: https://repository.apache.org/content/repositories/snapshots/org/apache/httpcomponents/httpcomponents-client/4.2.5/httpcomponents-client-4.2.5.pom
[INFO] Unable to find resource 'org.apache.httpcomponents:httpcomponents-client:pom:4.2.5'
in repository apache.snapshots.https (https://repository.apache.org/content/repositories/snapshots)
Downloading: http://repository.jboss.org/nexus/content/groups/public//org/apache/httpcomponents/httpcomponents-client/4.2.5/httpcomponents-client-4.2.5.pom
[INFO] Unable to find resource 'org.apache.httpcomponents:httpcomponents-client:pom:4.2.5'
in repository repository.jboss.org (http://repository.jboss.org/nexus/content/groups/public/)
Downloading: http://repo1.maven.org/maven2/org/apache/httpcomponents/httpcomponents-client/4.2.5/httpcomponents-client-4.2.5.pom
14K downloaded  (httpcomponents-client-4.2.5.pom)
Downloading: https://repository.apache.org/content/repositories/snapshots/org/apache/httpcomponents/httpcore/4.2.4/httpcore-4.2.4.pom
[INFO] Unable to find resource 'org.apache.httpcomponents:httpcore:pom:4.2.4' in repository
apache.snapshots.https (https://repository.apache.org/content/repositories/snapshots)
Downloading: http://repository.jboss.org/nexus/content/groups/public//org/apache/httpcomponents/httpcore/4.2.4/httpcore-4.2.4.pom
[INFO] Unable to find resource 'org.apache.httpcomponents:httpcore:pom:4.2.4' in repository
repository.jboss.org (http://repository.jboss.org/nexus/content/groups/public/)
Downloading: http://files.couchbase.com/maven2//org/apache/httpcomponents/httpcore/4.2.4/httpcore-4.2.4.pom
[INFO] Unable to find resource 'org.apache.httpcomponents:httpcore:pom:4.2.4' in repository
spy (http://files.couchbase.com/maven2/)
Downloading: http://repo1.maven.org/maven2/org/apache/httpcomponents/httpcore/4.2.4/httpcore-4.2.4.pom
5K downloaded  (httpcore-4.2.4.pom)
Downloading: https://repository.apache.org/content/repositories/snapshots/org/apache/httpcomponents/httpcomponents-core/4.2.4/httpcomponents-core-4.2.4.pom
[INFO] Unable to find resource 'org.apache.httpcomponents:httpcomponents-core:pom:4.2.4' in
repository apache.snapshots.https (https://repository.apache.org/content/repositories/snapshots)
Downloading: http://repository.jboss.org/nexus/content/groups/public//org/apache/httpcomponents/httpcomponents-core/4.2.4/httpcomponents-core-4.2.4.pom
[INFO] Unable to find resource 'org.apache.httpcomponents:httpcomponents-core:pom:4.2.4' in
repository repository.jboss.org (http://repository.jboss.org/nexus/content/groups/public/)
Downloading: http://files.couchbase.com/maven2//org/apache/httpcomponents/httpcomponents-core/4.2.4/httpcomponents-core-4.2.4.pom
[INFO] Unable to find resource 'org.apache.httpcomponents:httpcomponents-core:pom:4.2.4' in
repository spy (http://files.couchbase.com/maven2/)
Downloading: http://repo1.maven.org/maven2/org/apache/httpcomponents/httpcomponents-core/4.2.4/httpcomponents-core-4.2.4.pom
11K downloaded  (httpcomponents-core-4.2.4.pom)
Downloading: https://repository.apache.org/content/repositories/snapshots/org/apache/hadoop/hadoop-hdfs/2.4.0/hadoop-hdfs-2.4.0.pom
[INFO] Unable to find resource 'org.apache.hadoop:hadoop-hdfs:pom:2.4.0' in repository apache.snapshots.https
(https://repository.apache.org/content/repositories/snapshots)
Downloading: http://repository.jboss.org/nexus/content/groups/public//org/apache/hadoop/hadoop-hdfs/2.4.0/hadoop-hdfs-2.4.0.pom
[INFO] Unable to find resource 'org.apache.hadoop:hadoop-hdfs:pom:2.4.0' in repository repository.jboss.org
(http://repository.jboss.org/nexus/content/groups/public/)
Downloading: http://repo1.maven.org/maven2/org/apache/hadoop/hadoop-hdfs/2.4.0/hadoop-hdfs-2.4.0.pom
25K downloaded  (hadoop-hdfs-2.4.0.pom)
Downloading: https://repository.apache.org/content/repositories/snapshots/org/mortbay/jetty/jetty-util/6.1.26/jetty-util-6.1.26.pom
[INFO] Unable to find resource 'org.mortbay.jetty:jetty-util:pom:6.1.26' in repository apache.snapshots.https
(https://repository.apache.org/content/repositories/snapshots)
Downloading: http://repository.jboss.org/nexus/content/groups/public//org/mortbay/jetty/jetty-util/6.1.26/jetty-util-6.1.26.pom
[INFO] Unable to find resource 'org.mortbay.jetty:jetty-util:pom:6.1.26' in repository repository.jboss.org
(http://repository.jboss.org/nexus/content/groups/public/)
Downloading: http://repo1.maven.org/maven2/org/mortbay/jetty/jetty-util/6.1.26/jetty-util-6.1.26.pom
3K downloaded  (jetty-util-6.1.26.pom)
Downloading: https://repository.apache.org/content/repositories/snapshots/org/mortbay/jetty/project/6.1.26/project-6.1.26.pom
[INFO] Unable to find resource 'org.mortbay.jetty:project:pom:6.1.26' in repository apache.snapshots.https
(https://repository.apache.org/content/repositories/snapshots)
Downloading: http://repository.jboss.org/nexus/content/groups/public//org/mortbay/jetty/project/6.1.26/project-6.1.26.pom
[INFO] Unable to find resource 'org.mortbay.jetty:project:pom:6.1.26' in repository repository.jboss.org
(http://repository.jboss.org/nexus/content/groups/public/)
Downloading: http://repo1.maven.org/maven2/org/mortbay/jetty/project/6.1.26/project-6.1.26.pom
8K downloaded  (project-6.1.26.pom)
Downloading: https://repository.apache.org/content/repositories/snapshots/org/mortbay/jetty/jetty-parent/10/jetty-parent-10.pom
[INFO] Unable to find resource 'org.mortbay.jetty:jetty-parent:pom:10' in repository apache.snapshots.https
(https://repository.apache.org/content/repositories/snapshots)
Downloading: http://repository.jboss.org/nexus/content/groups/public//org/mortbay/jetty/jetty-parent/10/jetty-parent-10.pom
3K downloaded  (jetty-parent-10.pom)
[WARNING] *** CHECKSUM FAILED - Error retrieving checksum file for org/mortbay/jetty/jetty-parent/10/jetty-parent-10.pom
- IGNORING
Downloading: https://repository.apache.org/content/repositories/snapshots/org/eclipse/jetty/jetty-parent/14/jetty-parent-14.pom
[INFO] Unable to find resource 'org.eclipse.jetty:jetty-parent:pom:14' in repository apache.snapshots.https
(https://repository.apache.org/content/repositories/snapshots)
Downloading: http://repository.jboss.org/nexus/content/groups/public//org/eclipse/jetty/jetty-parent/14/jetty-parent-14.pom

[WARNING] *** CHECKSUM FAILED - Error retrieving checksum file for org/eclipse/jetty/jetty-parent/14/jetty-parent-14.pom
- IGNORING
Downloading: https://repository.apache.org/content/repositories/snapshots/org/apache/hadoop/hadoop-mapreduce-client-app/2.4.0/hadoop-mapreduce-client-app-2.4.0.pom
[INFO] Unable to find resource 'org.apache.hadoop:hadoop-mapreduce-client-app:pom:2.4.0' in
repository apache.snapshots.https (https://repository.apache.org/content/repositories/snapshots)
Downloading: http://repository.jboss.org/nexus/content/groups/public//org/apache/hadoop/hadoop-mapreduce-client-app/2.4.0/hadoop-mapreduce-client-app-2.4.0.pom
[INFO] Unable to find resource 'org.apache.hadoop:hadoop-mapreduce-client-app:pom:2.4.0' in
repository repository.jboss.org (http://repository.jboss.org/nexus/content/groups/public/)
Downloading: http://repo1.maven.org/maven2/org/apache/hadoop/hadoop-mapreduce-client-app/2.4.0/hadoop-mapreduce-client-app-2.4.0.pom
4K downloaded  (hadoop-mapreduce-client-app-2.4.0.pom)
Downloading: https://repository.apache.org/content/repositories/snapshots/org/apache/hadoop/hadoop-mapreduce-client/2.4.0/hadoop-mapreduce-client-2.4.0.pom
[INFO] Unable to find resource 'org.apache.hadoop:hadoop-mapreduce-client:pom:2.4.0' in repository
apache.snapshots.https (https://repository.apache.org/content/repositories/snapshots)
Downloading: http://repository.jboss.org/nexus/content/groups/public//org/apache/hadoop/hadoop-mapreduce-client/2.4.0/hadoop-mapreduce-client-2.4.0.pom
[INFO] Unable to find resource 'org.apache.hadoop:hadoop-mapreduce-client:pom:2.4.0' in repository
repository.jboss.org (http://repository.jboss.org/nexus/content/groups/public/)
Downloading: http://repo1.maven.org/maven2/org/apache/hadoop/hadoop-mapreduce-client/2.4.0/hadoop-mapreduce-client-2.4.0.pom
6K downloaded  (hadoop-mapreduce-client-2.4.0.pom)
Downloading: https://repository.apache.org/content/repositories/snapshots/org/apache/hadoop/hadoop-mapreduce-client-common/2.4.0/hadoop-mapreduce-client-common-2.4.0.pom
[INFO] Unable to find resource 'org.apache.hadoop:hadoop-mapreduce-client-common:pom:2.4.0'
in repository apache.snapshots.https (https://repository.apache.org/content/repositories/snapshots)
Downloading: http://repository.jboss.org/nexus/content/groups/public//org/apache/hadoop/hadoop-mapreduce-client-common/2.4.0/hadoop-mapreduce-client-common-2.4.0.pom
[INFO] Unable to find resource 'org.apache.hadoop:hadoop-mapreduce-client-common:pom:2.4.0'
in repository repository.jboss.org (http://repository.jboss.org/nexus/content/groups/public/)
Downloading: http://repo1.maven.org/maven2/org/apache/hadoop/hadoop-mapreduce-client-common/2.4.0/hadoop-mapreduce-client-common-2.4.0.pom
3K downloaded  (hadoop-mapreduce-client-common-2.4.0.pom)
Downloading: https://repository.apache.org/content/repositories/snapshots/org/apache/hadoop/hadoop-yarn-common/2.4.0/hadoop-yarn-common-2.4.0.pom
[INFO] Unable to find resource 'org.apache.hadoop:hadoop-yarn-common:pom:2.4.0' in repository
apache.snapshots.https (https://repository.apache.org/content/repositories/snapshots)
Downloading: http://repository.jboss.org/nexus/content/groups/public//org/apache/hadoop/hadoop-yarn-common/2.4.0/hadoop-yarn-common-2.4.0.pom
[INFO] Unable to find resource 'org.apache.hadoop:hadoop-yarn-common:pom:2.4.0' in repository
repository.jboss.org (http://repository.jboss.org/nexus/content/groups/public/)
Downloading: http://repo1.maven.org/maven2/org/apache/hadoop/hadoop-yarn-common/2.4.0/hadoop-yarn-common-2.4.0.pom
8K downloaded  (hadoop-yarn-common-2.4.0.pom)
Downloading: https://repository.apache.org/content/repositories/snapshots/org/apache/hadoop/hadoop-yarn/2.4.0/hadoop-yarn-2.4.0.pom
[INFO] Unable to find resource 'org.apache.hadoop:hadoop-yarn:pom:2.4.0' in repository apache.snapshots.https
(https://repository.apache.org/content/repositories/snapshots)
Downloading: http://repository.jboss.org/nexus/content/groups/public//org/apache/hadoop/hadoop-yarn/2.4.0/hadoop-yarn-2.4.0.pom
[INFO] Unable to find resource 'org.apache.hadoop:hadoop-yarn:pom:2.4.0' in repository repository.jboss.org
(http://repository.jboss.org/nexus/content/groups/public/)
Downloading: http://repo1.maven.org/maven2/org/apache/hadoop/hadoop-yarn/2.4.0/hadoop-yarn-2.4.0.pom
3K downloaded  (hadoop-yarn-2.4.0.pom)
Downloading: https://repository.apache.org/content/repositories/snapshots/org/apache/hadoop/hadoop-yarn-api/2.4.0/hadoop-yarn-api-2.4.0.pom
[INFO] Unable to find resource 'org.apache.hadoop:hadoop-yarn-api:pom:2.4.0' in repository
apache.snapshots.https (https://repository.apache.org/content/repositories/snapshots)
Downloading: http://repository.jboss.org/nexus/content/groups/public//org/apache/hadoop/hadoop-yarn-api/2.4.0/hadoop-yarn-api-2.4.0.pom
[INFO] Unable to find resource 'org.apache.hadoop:hadoop-yarn-api:pom:2.4.0' in repository
repository.jboss.org (http://repository.jboss.org/nexus/content/groups/public/)
Downloading: http://repo1.maven.org/maven2/org/apache/hadoop/hadoop-yarn-api/2.4.0/hadoop-yarn-api-2.4.0.pom
4K downloaded  (hadoop-yarn-api-2.4.0.pom)
Downloading: https://repository.apache.org/content/repositories/snapshots/javax/xml/bind/jaxb-api/2.2.2/jaxb-api-2.2.2.pom
[INFO] Unable to find resource 'javax.xml.bind:jaxb-api:pom:2.2.2' in repository apache.snapshots.https
(https://repository.apache.org/content/repositories/snapshots)
Downloading: http://repository.jboss.org/nexus/content/groups/public//javax/xml/bind/jaxb-api/2.2.2/jaxb-api-2.2.2.pom
[INFO] Unable to find resource 'javax.xml.bind:jaxb-api:pom:2.2.2' in repository repository.jboss.org
(http://repository.jboss.org/nexus/content/groups/public/)
Downloading: http://repo1.maven.org/maven2/javax/xml/bind/jaxb-api/2.2.2/jaxb-api-2.2.2.pom
5K downloaded  (jaxb-api-2.2.2.pom)
Downloading: https://repository.apache.org/content/repositories/snapshots/javax/xml/stream/stax-api/1.0-2/stax-api-1.0-2.pom
[INFO] Unable to find resource 'javax.xml.stream:stax-api:pom:1.0-2' in repository apache.snapshots.https
(https://repository.apache.org/content/repositories/snapshots)
Downloading: http://repository.jboss.org/nexus/content/groups/public//javax/xml/stream/stax-api/1.0-2/stax-api-1.0-2.pom
[INFO] Unable to find resource 'javax.xml.stream:stax-api:pom:1.0-2' in repository repository.jboss.org
(http://repository.jboss.org/nexus/content/groups/public/)
Downloading: http://download.java.net/maven/2/javax/xml/stream/stax-api/1.0-2/stax-api-1.0-2.pom
[INFO] Unable to find resource 'javax.xml.stream:stax-api:pom:1.0-2' in repository m2.dev.java.net
(http://download.java.net/maven/2)
Downloading: http://repo1.maven.org/maven2/javax/xml/stream/stax-api/1.0-2/stax-api-1.0-2.pom
962b downloaded  (stax-api-1.0-2.pom)
Downloading: https://repository.apache.org/content/repositories/snapshots/com/sun/jersey/jersey-core/1.9/jersey-core-1.9.pom
[INFO] Unable to find resource 'com.sun.jersey:jersey-core:pom:1.9' in repository apache.snapshots.https
(https://repository.apache.org/content/repositories/snapshots)
Downloading: http://repository.jboss.org/nexus/content/groups/public//com/sun/jersey/jersey-core/1.9/jersey-core-1.9.pom
[INFO] Unable to find resource 'com.sun.jersey:jersey-core:pom:1.9' in repository repository.jboss.org
(http://repository.jboss.org/nexus/content/groups/public/)
Downloading: http://repo1.maven.org/maven2/com/sun/jersey/jersey-core/1.9/jersey-core-1.9.pom
10K downloaded  (jersey-core-1.9.pom)
Downloading: https://repository.apache.org/content/repositories/snapshots/com/sun/jersey/jersey-project/1.9/jersey-project-1.9.pom
[INFO] Unable to find resource 'com.sun.jersey:jersey-project:pom:1.9' in repository apache.snapshots.https
(https://repository.apache.org/content/repositories/snapshots)
Downloading: http://repository.jboss.org/nexus/content/groups/public//com/sun/jersey/jersey-project/1.9/jersey-project-1.9.pom
[INFO] Unable to find resource 'com.sun.jersey:jersey-project:pom:1.9' in repository repository.jboss.org
(http://repository.jboss.org/nexus/content/groups/public/)
Downloading: http://repo1.maven.org/maven2/com/sun/jersey/jersey-project/1.9/jersey-project-1.9.pom
17K downloaded  (jersey-project-1.9.pom)
Downloading: http://download.java.net/maven/2/net/java/jvnet-parent/1/jvnet-parent-1.pom
[INFO] Unable to find resource 'net.java:jvnet-parent:pom:1' in repository m2.java.net (http://download.java.net/maven/2)
Downloading: http://repository.jboss.org/nexus/content/groups/public//net/java/jvnet-parent/1/jvnet-parent-1.pom
[INFO] Unable to find resource 'net.java:jvnet-parent:pom:1' in repository repository.jboss.org
(http://repository.jboss.org/nexus/content/groups/public/)
Downloading: http://maven.glassfish.org/content/groups/glassfish/net/java/jvnet-parent/1/jvnet-parent-1.pom
178b downloaded  (jvnet-parent-1.pom)
[WARNING] *** CHECKSUM FAILED - Checksum failed on download: local = '81ffbd1712afe8cdf138b570c0fc9934742c33c1';
remote = '<html>
<head><title>301' - RETRYING
Downloading: http://maven.glassfish.org/content/groups/glassfish/net/java/jvnet-parent/1/jvnet-parent-1.pom
178b downloaded  (jvnet-parent-1.pom)
[WARNING] *** CHECKSUM FAILED - Checksum failed on download: local = '81ffbd1712afe8cdf138b570c0fc9934742c33c1';
remote = '<html>
<head><title>301' - IGNORING
[INFO] ------------------------------------------------------------------------
[ERROR] BUILD ERROR
[INFO] ------------------------------------------------------------------------
[INFO] Failed to resolve dependencies for one or more projects in the reactor. Reason: Unable
to get dependency information: Unable to read the metadata file for artifact 'com.sun.jersey:jersey-core:jar':
Cannot find parent: net.java:jvnet-parent for project: com.sun.jersey:jersey-project:pom:1.9
for project com.sun.jersey:jersey-project:pom:1.9
  com.sun.jersey:jersey-core:jar:1.9

from the specified remote repositories:
  apache.snapshots.https (https://repository.apache.org/content/repositories/snapshots),
  apache.snapshots (http://repository.apache.org/snapshots),
  central (http://repo1.maven.org/maven2),
  repository.jboss.org (http://repository.jboss.org/nexus/content/groups/public/)

Path to dependency: 
	1) org.apache.oodt:cas-resource:jar:0.9-SNAPSHOT
	2) org.apache.hadoop:hadoop-client:jar:2.4.0
	3) org.apache.hadoop:hadoop-mapreduce-client-app:jar:2.4.0
	4) org.apache.hadoop:hadoop-mapreduce-client-common:jar:2.4.0
	5) org.apache.hadoop:hadoop-yarn-common:jar:2.4.0



Not a v4.0.0 POM. for project net.java:jvnet-parent at /home/jenkins/jenkins-slave/workspace/oodt-trunk/.repository/net/java/jvnet-parent/1/jvnet-parent-1.pom
[INFO] ------------------------------------------------------------------------
[INFO] For more information, run Maven with the -e switch
[INFO] ------------------------------------------------------------------------
[INFO] Total time: 5 minutes 49 seconds
[INFO] Finished at: Wed Jan 14 23:15:25 UTC 2015
[INFO] Final Memory: 222M/636M
[INFO] ------------------------------------------------------------------------

Mime
View raw message