oodt-dev mailing list archives

Site index · List index
Message view « Date » · « Thread »
Top « Date » · « Thread »
From Apache Jenkins Server <jenk...@builds.apache.org>
Subject Build failed in Jenkins: oodt-trunk » CAS Protocol SFTP Implementation #1346
Date Tue, 10 Jun 2014 14:12:55 GMT
See <https://builds.apache.org/job/oodt-trunk/org.apache.oodt$cas-protocol-sftp/1346/>

------------------------------------------
[INFO] ------------------------------------------------------------------------
[INFO] Building CAS Protocol SFTP Implementation
[INFO]    task-segment: [install]
[INFO] ------------------------------------------------------------------------
[INFO] [remote-resources:process {execution: default}]
Downloading: http://repo1.maven.org/maven2/com/jcraft/jsch/0.1.42/jsch-0.1.42.pom
967b downloaded  (jsch-0.1.42.pom)
Downloading: http://repo1.maven.org/maven2/sshtools/j2ssh-core/0.2.9/j2ssh-core-0.2.9.pom
192b downloaded  (j2ssh-core-0.2.9.pom)
Downloading: http://repo1.maven.org/maven2/sshtools/j2ssh-daemon/0.2.9/j2ssh-daemon-0.2.9.pom
194b downloaded  (j2ssh-daemon-0.2.9.pom)
Downloading: http://repo1.maven.org/maven2/org/apache/mina/mina-core/2.0.4/mina-core-2.0.4.pom
1K downloaded  (mina-core-2.0.4.pom)
Downloading: http://repo1.maven.org/maven2/org/apache/mina/mina-parent/2.0.4/mina-parent-2.0.4.pom
26K downloaded  (mina-parent-2.0.4.pom)
Downloading: http://repo1.maven.org/maven2/org/slf4j/slf4j-api/1.6.1/slf4j-api-1.6.1.pom
2K downloaded  (slf4j-api-1.6.1.pom)
Downloading: http://repo1.maven.org/maven2/org/slf4j/slf4j-parent/1.6.1/slf4j-parent-1.6.1.pom
9K downloaded  (slf4j-parent-1.6.1.pom)
Downloading: http://repo1.maven.org/maven2/com/jcraft/jsch/0.1.42/jsch-0.1.42.jar
Downloading: http://repo1.maven.org/maven2/org/slf4j/slf4j-api/1.6.1/slf4j-api-1.6.1.jar
Downloading: http://repo1.maven.org/maven2/org/apache/mina/mina-core/2.0.4/mina-core-2.0.4.jar
Downloading: http://repo1.maven.org/maven2/sshtools/j2ssh-core/0.2.9/j2ssh-core-0.2.9.jar
24K downloaded  (slf4j-api-1.6.1.jar)
181K downloaded  (jsch-0.1.42.jar)
346K downloaded  (j2ssh-core-0.2.9.jar)
Downloading: http://repo1.maven.org/maven2/sshtools/j2ssh-daemon/0.2.9/j2ssh-daemon-0.2.9.jar
629K downloaded  (mina-core-2.0.4.jar)
107K downloaded  (j2ssh-daemon-0.2.9.jar)
[INFO] [resources:resources {execution: default-resources}]
[INFO] Using 'UTF-8' encoding to copy filtered resources.
[INFO] Copying 1 resource
[INFO] Copying 3 resources
[INFO] [compiler:compile {execution: default-compile}]
[INFO] Compiling 3 source files to <https://builds.apache.org/job/oodt-trunk/org.apache.oodt$cas-protocol-sftp/ws/target/classes>
[INFO] [resources:testResources {execution: default-testResources}]
[INFO] Using 'UTF-8' encoding to copy filtered resources.
[INFO] skip non existing resourceDirectory <https://builds.apache.org/job/oodt-trunk/org.apache.oodt$cas-protocol-sftp/ws/src/test/resources>
[INFO] Copying 3 resources
[INFO] [compiler:testCompile {execution: default-testCompile}]
[INFO] Compiling 4 source files to <https://builds.apache.org/job/oodt-trunk/org.apache.oodt$cas-protocol-sftp/ws/target/test-classes>
[INFO] -------------------------------------------------------------
[ERROR] COMPILATION ERROR : 
[INFO] -------------------------------------------------------------
[ERROR] <https://builds.apache.org/job/oodt-trunk/org.apache.oodt$cas-protocol-sftp/ws/src/test/org/apache/oodt/cas/protocol/sftp/TestJschSftpProtocol.java>:[129,14]
';' expected
[INFO] 1 error
[INFO] -------------------------------------------------------------
[INFO] ------------------------------------------------------------------------
[ERROR] BUILD FAILURE
[INFO] ------------------------------------------------------------------------
[INFO] Compilation failure
<https://builds.apache.org/job/oodt-trunk/org.apache.oodt$cas-protocol-sftp/ws/src/test/org/apache/oodt/cas/protocol/sftp/TestJschSftpProtocol.java>:[129,14]
';' expected

[INFO] ------------------------------------------------------------------------
[INFO] For more information, run Maven with the -e switch
[INFO] ------------------------------------------------------------------------
[INFO] Total time: 2 minutes 20 seconds
[INFO] Finished at: Tue Jun 10 14:12:31 UTC 2014
[INFO] Final Memory: 133M/438M
[INFO] ------------------------------------------------------------------------

Mime
View raw message