oodt-dev mailing list archives

Site index · List index
Message view « Date » · « Thread »
Top « Date » · « Thread »
From Apache Jenkins Server <jenk...@builds.apache.org>
Subject Build failed in Jenkins: oodt-trunk #1343
Date Mon, 09 Jun 2014 07:31:40 GMT
See <https://builds.apache.org/job/oodt-trunk/1343/changes>

Changes:

[thomas] OODT-703 DataUtil.createProductZipFile throws exception when creating a zipfile of
a hierarchical product

------------------------------------------
[...truncated 6113 lines...]
{parent = 'null', path = '/repos/asf/oodt/trunk/protocol/http/src/test/org/apache/oodt/cas/protocol/http',
isDir = 'true'}
{parent = 'null', path = '/repos/asf/oodt/trunk/protocol/http/src/test/org/apache/oodt/cas/protocol/http',
isDir = 'true'}
Tests run: 4, Failures: 0, Errors: 0, Skipped: 0, Time elapsed: 1.387 sec
Running org.apache.oodt.cas.protocol.http.TestHttpFile
Tests run: 2, Failures: 0, Errors: 0, Skipped: 0, Time elapsed: 0.001 sec

Results :

Tests run: 13, Failures: 0, Errors: 0, Skipped: 0

[JENKINS] Recording test results
[INFO] [jar:jar {execution: default-jar}]
[INFO] Building jar: <https://builds.apache.org/job/oodt-trunk/ws/protocol/http/target/cas-protocol-http-0.7-SNAPSHOT.jar>
[INFO] Preparing javadoc:javadoc
[WARNING] Removing: javadoc from forked lifecycle, to prevent recursive invocation.
[INFO] No goals needed for project - skipping
[WARNING] DEPRECATED [aggregate]: since 2.5. Use the goals <code>javadoc:aggregate</code>
and <code>javadoc:test-aggregate</code> instead.
[INFO] [javadoc:javadoc {execution: attach-javadocs}]
[INFO] [install:install {execution: default-install}]
[INFO] Installing <https://builds.apache.org/job/oodt-trunk/ws/protocol/http/target/cas-protocol-http-0.7-SNAPSHOT.jar>
to <https://builds.apache.org/job/oodt-trunk/ws/.repository/org/apache/oodt/cas-protocol-http/0.7-SNAPSHOT/cas-protocol-http-0.7-SNAPSHOT.jar>
[INFO] ------------------------------------------------------------------------
[INFO] Building CAS Protocol IMAPS Implementation
[INFO]    task-segment: [install]
[INFO] ------------------------------------------------------------------------
[INFO] [remote-resources:process {execution: default}]
Downloading: http://repo1.maven.org/maven2/org/apache/geronimo/javamail/geronimo-javamail_1.4_mail/1.8.1/geronimo-javamail_1.4_mail-1.8.1.pom
4K downloaded  (geronimo-javamail_1.4_mail-1.8.1.pom)
Downloading: http://repo1.maven.org/maven2/org/apache/geronimo/javamail/geronimo-javamail_1.4/1.8.1/geronimo-javamail_1.4-1.8.1.pom
5K downloaded  (geronimo-javamail_1.4-1.8.1.pom)
Downloading: http://repo1.maven.org/maven2/org/apache/geronimo/genesis/genesis-java1.4-flava/2.0/genesis-java1.4-flava-2.0.pom
5K downloaded  (genesis-java1.4-flava-2.0.pom)
Downloading: http://repo1.maven.org/maven2/org/apache/geronimo/genesis/genesis-default-flava/2.0/genesis-default-flava-2.0.pom
17K downloaded  (genesis-default-flava-2.0.pom)
Downloading: http://repo1.maven.org/maven2/org/apache/geronimo/genesis/genesis/2.0/genesis-2.0.pom
17K downloaded  (genesis-2.0.pom)
Downloading: http://repo1.maven.org/maven2/org/apache/geronimo/specs/geronimo-activation_1.1_spec/1.1/geronimo-activation_1.1_spec-1.1.pom
4K downloaded  (geronimo-activation_1.1_spec-1.1.pom)
Downloading: http://repo1.maven.org/maven2/org/apache/geronimo/genesis/genesis-java5-flava/2.0/genesis-java5-flava-2.0.pom
5K downloaded  (genesis-java5-flava-2.0.pom)
Downloading: http://repo1.maven.org/maven2/com/icegreen/greenmail/1.3.1b/greenmail-1.3.1b.pom
8K downloaded  (greenmail-1.3.1b.pom)
Downloading: http://repo1.maven.org/maven2/javax/mail/mail/1.4/mail-1.4.pom
993b downloaded  (mail-1.4.pom)
Downloading: http://repo1.maven.org/maven2/javax/activation/activation/1.1/activation-1.1.pom
1K downloaded  (activation-1.1.pom)
Downloading: http://repo1.maven.org/maven2/org/slf4j/slf4j-api/1.3.1/slf4j-api-1.3.1.pom
2K downloaded  (slf4j-api-1.3.1.pom)
Downloading: http://repo1.maven.org/maven2/org/slf4j/slf4j-parent/1.3.1/slf4j-parent-1.3.1.pom
6K downloaded  (slf4j-parent-1.3.1.pom)
Downloading: http://repo1.maven.org/maven2/org/apache/geronimo/javamail/geronimo-javamail_1.4_mail/1.8.1/geronimo-javamail_1.4_mail-1.8.1.jar
Downloading: http://repo1.maven.org/maven2/org/slf4j/slf4j-api/1.3.1/slf4j-api-1.3.1.jar
Downloading: http://repo1.maven.org/maven2/javax/activation/activation/1.1/activation-1.1.jar
Downloading: http://repo1.maven.org/maven2/com/icegreen/greenmail/1.3.1b/greenmail-1.3.1b.jar
Downloading: http://repo1.maven.org/maven2/org/apache/geronimo/specs/geronimo-activation_1.1_spec/1.1/geronimo-activation_1.1_spec-1.1.jar
11K downloaded  (slf4j-api-1.3.1.jar)
Downloading: http://repo1.maven.org/maven2/javax/mail/mail/1.4/mail-1.4.jar
46K downloaded  (geronimo-activation_1.1_spec-1.1.jar)
61K downloaded  (activation-1.1.jar)
194K downloaded  (greenmail-1.3.1b.jar)
379K downloaded  (mail-1.4.jar)
454K downloaded  (geronimo-javamail_1.4_mail-1.8.1.jar)
[INFO] [resources:resources {execution: default-resources}]
[INFO] Using 'UTF-8' encoding to copy filtered resources.
[INFO] Copying 1 resource to org/apache/oodt/cas/protocol/imaps
[INFO] Copying 3 resources
[INFO] [compiler:compile {execution: default-compile}]
[INFO] Compiling 2 source files to <https://builds.apache.org/job/oodt-trunk/ws/protocol/imaps/target/classes>
[INFO] [resources:testResources {execution: default-testResources}]
[INFO] Using 'UTF-8' encoding to copy filtered resources.
[INFO] skip non existing resourceDirectory <https://builds.apache.org/job/oodt-trunk/ws/protocol/imaps/src/test/resources>
[INFO] Copying 3 resources
[INFO] [compiler:testCompile {execution: default-testCompile}]
[INFO] Compiling 1 source file to <https://builds.apache.org/job/oodt-trunk/ws/protocol/imaps/target/test-classes>
[INFO] [surefire:test {execution: default-test}]
[INFO] Surefire report directory: <https://builds.apache.org/job/oodt-trunk/ws/protocol/imaps/target/surefire-reports>

-------------------------------------------------------
 T E S T S
-------------------------------------------------------
Running org.apache.oodt.cas.protocol.imaps.TestImapsProtocol
Tests run: 3, Failures: 0, Errors: 0, Skipped: 0, Time elapsed: 5.09 sec

Results :

Tests run: 3, Failures: 0, Errors: 0, Skipped: 0

[JENKINS] Recording test results
[INFO] [jar:jar {execution: default-jar}]
[INFO] Building jar: <https://builds.apache.org/job/oodt-trunk/ws/protocol/imaps/target/cas-protocol-imaps-0.7-SNAPSHOT.jar>
[INFO] Preparing javadoc:javadoc
[WARNING] Removing: javadoc from forked lifecycle, to prevent recursive invocation.
[INFO] No goals needed for project - skipping
[WARNING] DEPRECATED [aggregate]: since 2.5. Use the goals <code>javadoc:aggregate</code>
and <code>javadoc:test-aggregate</code> instead.
[INFO] [javadoc:javadoc {execution: attach-javadocs}]
[INFO] [install:install {execution: default-install}]
[INFO] Installing <https://builds.apache.org/job/oodt-trunk/ws/protocol/imaps/target/cas-protocol-imaps-0.7-SNAPSHOT.jar>
to <https://builds.apache.org/job/oodt-trunk/ws/.repository/org/apache/oodt/cas-protocol-imaps/0.7-SNAPSHOT/cas-protocol-imaps-0.7-SNAPSHOT.jar>
[INFO] ------------------------------------------------------------------------
[INFO] Building CAS Protocol SFTP Implementation
[INFO]    task-segment: [install]
[INFO] ------------------------------------------------------------------------
[INFO] [remote-resources:process {execution: default}]
Downloading: http://repo1.maven.org/maven2/com/jcraft/jsch/0.1.42/jsch-0.1.42.pom
967b downloaded  (jsch-0.1.42.pom)
Downloading: http://repo1.maven.org/maven2/sshtools/j2ssh-core/0.2.9/j2ssh-core-0.2.9.pom
192b downloaded  (j2ssh-core-0.2.9.pom)
Downloading: http://repo1.maven.org/maven2/sshtools/j2ssh-daemon/0.2.9/j2ssh-daemon-0.2.9.pom
194b downloaded  (j2ssh-daemon-0.2.9.pom)
Downloading: http://repo1.maven.org/maven2/org/apache/mina/mina-core/2.0.4/mina-core-2.0.4.pom
1K downloaded  (mina-core-2.0.4.pom)
Downloading: http://repo1.maven.org/maven2/org/apache/mina/mina-parent/2.0.4/mina-parent-2.0.4.pom
26K downloaded  (mina-parent-2.0.4.pom)
Downloading: http://repo1.maven.org/maven2/org/slf4j/slf4j-api/1.6.1/slf4j-api-1.6.1.pom
2K downloaded  (slf4j-api-1.6.1.pom)
Downloading: http://repo1.maven.org/maven2/org/slf4j/slf4j-parent/1.6.1/slf4j-parent-1.6.1.pom
9K downloaded  (slf4j-parent-1.6.1.pom)
Downloading: http://repo1.maven.org/maven2/org/slf4j/slf4j-api/1.6.1/slf4j-api-1.6.1.jar
Downloading: http://repo1.maven.org/maven2/com/jcraft/jsch/0.1.42/jsch-0.1.42.jar
Downloading: http://repo1.maven.org/maven2/org/apache/mina/mina-core/2.0.4/mina-core-2.0.4.jar
Downloading: http://repo1.maven.org/maven2/sshtools/j2ssh-core/0.2.9/j2ssh-core-0.2.9.jar
24K downloaded  (slf4j-api-1.6.1.jar)
181K downloaded  (jsch-0.1.42.jar)
629K downloaded  (mina-core-2.0.4.jar)
346K downloaded  (j2ssh-core-0.2.9.jar)
Downloading: http://repo1.maven.org/maven2/sshtools/j2ssh-daemon/0.2.9/j2ssh-daemon-0.2.9.jar
107K downloaded  (j2ssh-daemon-0.2.9.jar)
[INFO] [resources:resources {execution: default-resources}]
[INFO] Using 'UTF-8' encoding to copy filtered resources.
[INFO] Copying 1 resource
[INFO] Copying 3 resources
[INFO] [compiler:compile {execution: default-compile}]
[INFO] Compiling 3 source files to <https://builds.apache.org/job/oodt-trunk/ws/protocol/sftp/target/classes>
[INFO] [resources:testResources {execution: default-testResources}]
[INFO] Using 'UTF-8' encoding to copy filtered resources.
[INFO] skip non existing resourceDirectory <https://builds.apache.org/job/oodt-trunk/ws/protocol/sftp/src/test/resources>
[INFO] Copying 3 resources
[INFO] [compiler:testCompile {execution: default-testCompile}]
[INFO] Compiling 4 source files to <https://builds.apache.org/job/oodt-trunk/ws/protocol/sftp/target/test-classes>
[INFO] -------------------------------------------------------------
[ERROR] COMPILATION ERROR : 
[INFO] -------------------------------------------------------------
[ERROR] <https://builds.apache.org/job/oodt-trunk/ws/protocol/sftp/src/test/org/apache/oodt/cas/protocol/sftp/TestJschSftpProtocol.java>:[129,14]
';' expected
[INFO] 1 error
[INFO] -------------------------------------------------------------
[INFO] ------------------------------------------------------------------------
[ERROR] BUILD FAILURE
[INFO] ------------------------------------------------------------------------
[INFO] Compilation failure
<https://builds.apache.org/job/oodt-trunk/ws/protocol/sftp/src/test/org/apache/oodt/cas/protocol/sftp/TestJschSftpProtocol.java>:[129,14]
';' expected

[INFO] ------------------------------------------------------------------------
[INFO] For more information, run Maven with the -e switch
[INFO] ------------------------------------------------------------------------
[INFO] Total time: 3 minutes 9 seconds
[INFO] Finished at: Mon Jun 09 07:29:37 UTC 2014
[INFO] Final Memory: 134M/454M
[INFO] ------------------------------------------------------------------------
Waiting for Jenkins to finish collecting data
[JENKINS] Archiving <https://builds.apache.org/job/oodt-trunk/ws/protocol/ftp/pom.xml>
to org.apache.oodt/cas-protocol-ftp/0.7-SNAPSHOT/cas-protocol-ftp-0.7-SNAPSHOT.pom
[JENKINS] Archiving <https://builds.apache.org/job/oodt-trunk/ws/protocol/ftp/target/cas-protocol-ftp-0.7-SNAPSHOT.jar>
to org.apache.oodt/cas-protocol-ftp/0.7-SNAPSHOT/cas-protocol-ftp-0.7-SNAPSHOT.jar
Sending artifact delta relative to oodt-trunk ? CAS Protocol FTP Implementation #1342
Archived 2 artifacts
Archive block size is 32768
Received 0 blocks and 21431 bytes
Compression is 0.0%
Took 2.2 sec
[JENKINS] Archiving <https://builds.apache.org/job/oodt-trunk/ws/metadata/pom.xml> to
org.apache.oodt/cas-metadata/0.7-SNAPSHOT/cas-metadata-0.7-SNAPSHOT.pom
[JENKINS] Archiving <https://builds.apache.org/job/oodt-trunk/ws/metadata/target/cas-metadata-0.7-SNAPSHOT.jar>
to org.apache.oodt/cas-metadata/0.7-SNAPSHOT/cas-metadata-0.7-SNAPSHOT.jar
Sending artifact delta relative to oodt-trunk ? Catalog and Archive Service Generic Multi-valued
Metadata Container #1342
Archived 2 artifacts
Archive block size is 32768
Received 0 blocks and 85018 bytes
Compression is 0.0%
Took 0.2 sec
[JENKINS] Archiving <https://builds.apache.org/job/oodt-trunk/ws/.repository/org/apache/oodt/oodt-core/0.7-SNAPSHOT/oodt-core-0.7-SNAPSHOT.pom>
to org.apache.oodt/oodt-core/0.7-SNAPSHOT/oodt-core-0.7-SNAPSHOT.pom
[JENKINS] Archiving <https://builds.apache.org/job/oodt-trunk/ws/core/target/oodt-core-0.7-SNAPSHOT-site.xml>
to org.apache.oodt/oodt-core/0.7-SNAPSHOT/oodt-core-0.7-SNAPSHOT-site.xml
<https://builds.apache.org/job/oodt-trunk/ws/.repository/org/apache/oodt/oodt-core/0.7-SNAPSHOT/oodt-core-0.7-SNAPSHOT.pom>
is not inside <https://builds.apache.org/job/oodt-trunk/ws/core/;> will archive in a
separate pass
Sending artifact delta relative to oodt-trunk ? OODT Core #1342
Archived 1 artifacts
Archive block size is 32768
Received 0 blocks and 462 bytes
Compression is 0.0%
Took 0.1 sec
Sending artifact delta relative to oodt-trunk ? OODT Core #1342
Archived 1 artifacts
Archive block size is 32768
Received 0 blocks and 16854 bytes
Compression is 0.0%
Took 1.9 sec
[JENKINS] Archiving <https://builds.apache.org/job/oodt-trunk/ws/protocol/http/pom.xml>
to org.apache.oodt/cas-protocol-http/0.7-SNAPSHOT/cas-protocol-http-0.7-SNAPSHOT.pom
[JENKINS] Archiving <https://builds.apache.org/job/oodt-trunk/ws/protocol/http/target/cas-protocol-http-0.7-SNAPSHOT.jar>
to org.apache.oodt/cas-protocol-http/0.7-SNAPSHOT/cas-protocol-http-0.7-SNAPSHOT.jar
Sending artifact delta relative to oodt-trunk ? CAS Protocol HTTP Implementation #1342
Archived 2 artifacts
Archive block size is 32768
Received 0 blocks and 22472 bytes
Compression is 0.0%
Took 0.35 sec
[JENKINS] Archiving <https://builds.apache.org/job/oodt-trunk/ws/protocol/api/pom.xml>
to org.apache.oodt/cas-protocol-api/0.7-SNAPSHOT/cas-protocol-api-0.7-SNAPSHOT.pom
[JENKINS] Archiving <https://builds.apache.org/job/oodt-trunk/ws/protocol/api/target/cas-protocol-api-0.7-SNAPSHOT.jar>
to org.apache.oodt/cas-protocol-api/0.7-SNAPSHOT/cas-protocol-api-0.7-SNAPSHOT.jar
[JENKINS] Archiving <https://builds.apache.org/job/oodt-trunk/ws/protocol/api/target/cas-protocol-api-0.7-SNAPSHOT-dist.tar.gz>
to org.apache.oodt/cas-protocol-api/0.7-SNAPSHOT/cas-protocol-api-0.7-SNAPSHOT-dist.tar.gz
[JENKINS] Archiving <https://builds.apache.org/job/oodt-trunk/ws/protocol/api/target/cas-protocol-api-0.7-SNAPSHOT-dist.zip>
to org.apache.oodt/cas-protocol-api/0.7-SNAPSHOT/cas-protocol-api-0.7-SNAPSHOT-dist.zip
Sending artifact delta relative to oodt-trunk ? CAS Protocol #1342
Archived 4 artifacts
Archive block size is 32768
Received 232 blocks and 10287187 bytes
Compression is 42.5%
Took 14 sec
[JENKINS] Archiving <https://builds.apache.org/job/oodt-trunk/ws/cli/pom.xml> to org.apache.oodt/cas-cli/0.7-SNAPSHOT/cas-cli-0.7-SNAPSHOT.pom
[JENKINS] Archiving <https://builds.apache.org/job/oodt-trunk/ws/cli/target/cas-cli-0.7-SNAPSHOT.jar>
to org.apache.oodt/cas-cli/0.7-SNAPSHOT/cas-cli-0.7-SNAPSHOT.jar
[JENKINS] Archiving <https://builds.apache.org/job/oodt-trunk/ws/cli/target/cas-cli-0.7-SNAPSHOT-dist.tar.gz>
to org.apache.oodt/cas-cli/0.7-SNAPSHOT/cas-cli-0.7-SNAPSHOT-dist.tar.gz
[JENKINS] Archiving <https://builds.apache.org/job/oodt-trunk/ws/cli/target/cas-cli-0.7-SNAPSHOT-dist.zip>
to org.apache.oodt/cas-cli/0.7-SNAPSHOT/cas-cli-0.7-SNAPSHOT-dist.zip
Sending artifact delta relative to oodt-trunk ? CAS Command Line Interface #1342
Archived 4 artifacts
Archive block size is 32768
Received 186 blocks and 6570616 bytes
Compression is 48.1%
Took 5.5 sec
[JENKINS] Archiving <https://builds.apache.org/job/oodt-trunk/ws/protocol/imaps/pom.xml>
to org.apache.oodt/cas-protocol-imaps/0.7-SNAPSHOT/cas-protocol-imaps-0.7-SNAPSHOT.pom
[JENKINS] Archiving <https://builds.apache.org/job/oodt-trunk/ws/protocol/imaps/target/cas-protocol-imaps-0.7-SNAPSHOT.jar>
to org.apache.oodt/cas-protocol-imaps/0.7-SNAPSHOT/cas-protocol-imaps-0.7-SNAPSHOT.jar
Sending artifact delta relative to oodt-trunk ? CAS Protocol IMAPS Implementation #1342
Archived 2 artifacts
Archive block size is 32768
Received 0 blocks and 21836 bytes
Compression is 0.0%
Took 0.17 sec
[JENKINS] Archiving <https://builds.apache.org/job/oodt-trunk/ws/commons/pom.xml> to
org.apache.oodt/oodt-commons/0.7-SNAPSHOT/oodt-commons-0.7-SNAPSHOT.pom
[JENKINS] Archiving <https://builds.apache.org/job/oodt-trunk/ws/commons/target/oodt-commons-0.7-SNAPSHOT.jar>
to org.apache.oodt/oodt-commons/0.7-SNAPSHOT/oodt-commons-0.7-SNAPSHOT.jar
Sending artifact delta relative to oodt-trunk ? Common Utilities #1342
Archived 2 artifacts
Archive block size is 32768
Received 0 blocks and 210347 bytes
Compression is 0.0%
Took 1.8 sec
[JENKINS] Archiving <https://builds.apache.org/job/oodt-trunk/ws/protocol/sftp/pom.xml>
to org.apache.oodt/cas-protocol-sftp/0.7-SNAPSHOT/cas-protocol-sftp-0.7-SNAPSHOT.pom
Sending artifact delta relative to oodt-trunk ? CAS Protocol SFTP Implementation #1340
Archived 1 artifacts
Archive block size is 32768
Received 0 blocks and 3756 bytes
Compression is 0.0%
Took 0.29 sec
[JENKINS] Archiving <https://builds.apache.org/job/oodt-trunk/ws/pcs/input/pom.xml>
to org.apache.oodt/pcs-input/0.7-SNAPSHOT/pcs-input-0.7-SNAPSHOT.pom
[JENKINS] Archiving <https://builds.apache.org/job/oodt-trunk/ws/pcs/input/target/pcs-input-0.7-SNAPSHOT.jar>
to org.apache.oodt/pcs-input/0.7-SNAPSHOT/pcs-input-0.7-SNAPSHOT.jar
Sending artifact delta relative to oodt-trunk ? Process Control System Input Data Package
#1342
Archived 2 artifacts
Archive block size is 32768
Received 0 blocks and 34954 bytes
Compression is 0.0%
Took 0.19 sec
Sending e-mails to: dev@oodt.apache.org
channel stopped

Mime
View raw message