oodt-dev mailing list archives

Site index · List index
Message view « Date » · « Thread »
Top « Date » · « Thread »
From Apache Jenkins Server <jenk...@builds.apache.org>
Subject Build failed in Jenkins: oodt-trunk #840
Date Tue, 19 Feb 2013 06:39:22 GMT
See <https://builds.apache.org/job/oodt-trunk/840/changes>

Changes:

[luca] Updated CHANGES.txt for OODT-558

[luca] Allowing web-grid servlet to be configured via external XML file (OODT-558)

------------------------------------------
[...truncated 3812 lines...]
845b downloaded  (wagon-http-shared-1.0-beta-2.pom)
Downloading: http://repo1.maven.org/maven2/jtidy/jtidy/4aug2000r7-dev/jtidy-4aug2000r7-dev.pom
1K downloaded  (jtidy-4aug2000r7-dev.pom)
Downloading: http://repo1.maven.org/maven2/xml-apis/xml-apis/1.0.b2/xml-apis-1.0.b2.pom
2K downloaded  (xml-apis-1.0.b2.pom)
Downloading: http://repo1.maven.org/maven2/org/apache/maven/reporting/maven-reporting-api/2.0.6/maven-reporting-api-2.0.6.pom
1K downloaded  (maven-reporting-api-2.0.6.pom)
Downloading: http://repo1.maven.org/maven2/org/apache/maven/reporting/maven-reporting/2.0.6/maven-reporting-2.0.6.pom
1K downloaded  (maven-reporting-2.0.6.pom)
Downloading: http://repo1.maven.org/maven2/org/apache/maven/doxia/doxia-sink-api/1.0-alpha-7/doxia-sink-api-1.0-alpha-7.pom
424b downloaded  (doxia-sink-api-1.0-alpha-7.pom)
Downloading: http://repo1.maven.org/maven2/org/apache/maven/doxia/doxia/1.0-alpha-7/doxia-1.0-alpha-7.pom
3K downloaded  (doxia-1.0-alpha-7.pom)
Downloading: http://repo1.maven.org/maven2/org/apache/maven/maven-error-diagnostics/2.0.6/maven-error-diagnostics-2.0.6.pom
1K downloaded  (maven-error-diagnostics-2.0.6.pom)
Downloading: http://repo1.maven.org/maven2/commons-cli/commons-cli/1.0/commons-cli-1.0.pom
2K downloaded  (commons-cli-1.0.pom)
Downloading: http://repo1.maven.org/maven2/org/apache/maven/maven-plugin-api/2.0.6/maven-plugin-api-2.0.6.pom
1K downloaded  (maven-plugin-api-2.0.6.pom)
Downloading: http://repo1.maven.org/maven2/org/apache/maven/wagon/wagon-ssh-external/1.0-beta-2/wagon-ssh-external-1.0-beta-2.pom
1K downloaded  (wagon-ssh-external-1.0-beta-2.pom)
Downloading: http://repo1.maven.org/maven2/org/apache/maven/wagon/wagon-ssh-common/1.0-beta-2/wagon-ssh-common-1.0-beta-2.pom
851b downloaded  (wagon-ssh-common-1.0-beta-2.pom)
Downloading: http://repo1.maven.org/maven2/org/codehaus/plexus/plexus-interactivity-api/1.0-alpha-4/plexus-interactivity-api-1.0-alpha-4.pom
6K downloaded  (plexus-interactivity-api-1.0-alpha-4.pom)
Downloading: http://repo1.maven.org/maven2/org/codehaus/plexus/plexus-container-default/1.0-alpha-7/plexus-container-default-1.0-alpha-7.pom
1K downloaded  (plexus-container-default-1.0-alpha-7.pom)
Downloading: http://repo1.maven.org/maven2/plexus/plexus-containers/1.0.2/plexus-containers-1.0.2.pom
471b downloaded  (plexus-containers-1.0.2.pom)
Downloading: http://repo1.maven.org/maven2/plexus/plexus-root/1.0.3/plexus-root-1.0.3.pom
5K downloaded  (plexus-root-1.0.3.pom)
Downloading: http://repo1.maven.org/maven2/plexus/plexus-utils/1.0.2/plexus-utils-1.0.2.pom
740b downloaded  (plexus-utils-1.0.2.pom)
Downloading: http://repo1.maven.org/maven2/org/apache/maven/maven-plugin-descriptor/2.0.6/maven-plugin-descriptor-2.0.6.pom
1K downloaded  (maven-plugin-descriptor-2.0.6.pom)
Downloading: http://repo1.maven.org/maven2/org/apache/maven/maven-monitor/2.0.6/maven-monitor-2.0.6.pom
1K downloaded  (maven-monitor-2.0.6.pom)
Downloading: http://repo1.maven.org/maven2/org/apache/maven/wagon/wagon-ssh/1.0-beta-2/wagon-ssh-1.0-beta-2.pom
1K downloaded  (wagon-ssh-1.0-beta-2.pom)
Downloading: http://repo1.maven.org/maven2/com/jcraft/jsch/0.1.27/jsch-0.1.27.pom
965b downloaded  (jsch-0.1.27.pom)
Downloading: http://repo1.maven.org/maven2/classworlds/classworlds/1.1/classworlds-1.1.pom
3K downloaded  (classworlds-1.1.pom)
Downloading: http://repo1.maven.org/maven2/org/codehaus/plexus/plexus-utils/1.5.15/plexus-utils-1.5.15.pom
6K downloaded  (plexus-utils-1.5.15.pom)
Downloading: http://repo1.maven.org/maven2/org/codehaus/plexus/plexus/2.0.2/plexus-2.0.2.pom
11K downloaded  (plexus-2.0.2.pom)
Downloading: http://repo1.maven.org/maven2/org/codehaus/plexus/plexus-interpolation/1.12/plexus-interpolation-1.12.pom
889b downloaded  (plexus-interpolation-1.12.pom)
Downloading: http://repo1.maven.org/maven2/org/codehaus/plexus/plexus-components/1.1.14/plexus-components-1.1.14.pom
5K downloaded  (plexus-components-1.1.14.pom)
Downloading: http://repo1.maven.org/maven2/org/sonatype/plexus/plexus-build-api/0.0.4/plexus-build-api-0.0.4.pom
2K downloaded  (plexus-build-api-0.0.4.pom)
Downloading: http://repo1.maven.org/maven2/org/sonatype/spice/spice-parent/10/spice-parent-10.pom
2K downloaded  (spice-parent-10.pom)
Downloading: http://repo1.maven.org/maven2/org/sonatype/forge/forge-parent/3/forge-parent-3.pom
4K downloaded  (forge-parent-3.pom)
Downloading: http://repo1.maven.org/maven2/org/codehaus/plexus/plexus-utils/1.5.8/plexus-utils-1.5.8.pom
7K downloaded  (plexus-utils-1.5.8.pom)
Downloading: http://repo1.maven.org/maven2/org/apache/maven/maven-project/2.0.5/maven-project-2.0.5.pom
1K downloaded  (maven-project-2.0.5.pom)
Downloading: http://repo1.maven.org/maven2/org/apache/maven/maven/2.0.5/maven-2.0.5.pom
5K downloaded  (maven-2.0.5.pom)
Downloading: http://repo1.maven.org/maven2/org/apache/maven/maven-settings/2.0.5/maven-settings-2.0.5.pom
1K downloaded  (maven-settings-2.0.5.pom)
Downloading: http://repo1.maven.org/maven2/org/apache/maven/maven-profile/2.0.5/maven-profile-2.0.5.pom
1K downloaded  (maven-profile-2.0.5.pom)
Downloading: http://repo1.maven.org/maven2/org/apache/maven/maven-model/2.0.5/maven-model-2.0.5.pom
2K downloaded  (maven-model-2.0.5.pom)
Downloading: http://repo1.maven.org/maven2/org/codehaus/plexus/plexus-utils/1.1/plexus-utils-1.1.pom
767b downloaded  (plexus-utils-1.1.pom)
Downloading: http://repo1.maven.org/maven2/org/codehaus/plexus/plexus-container-default/1.0-alpha-9/plexus-container-default-1.0-alpha-9.pom
1K downloaded  (plexus-container-default-1.0-alpha-9.pom)
Downloading: http://repo1.maven.org/maven2/org/apache/maven/maven-artifact-manager/2.0.5/maven-artifact-manager-2.0.5.pom
1K downloaded  (maven-artifact-manager-2.0.5.pom)
Downloading: http://repo1.maven.org/maven2/org/apache/maven/maven-repository-metadata/2.0.5/maven-repository-metadata-2.0.5.pom
1K downloaded  (maven-repository-metadata-2.0.5.pom)
Downloading: http://repo1.maven.org/maven2/org/apache/maven/maven-artifact/2.0.5/maven-artifact-2.0.5.pom
727b downloaded  (maven-artifact-2.0.5.pom)
Downloading: http://repo1.maven.org/maven2/org/apache/maven/maven-core/2.0.5/maven-core-2.0.5.pom
5K downloaded  (maven-core-2.0.5.pom)
Downloading: http://repo1.maven.org/maven2/org/apache/maven/maven-plugin-parameter-documenter/2.0.5/maven-plugin-parameter-documenter-2.0.5.pom
1K downloaded  (maven-plugin-parameter-documenter-2.0.5.pom)
Downloading: http://repo1.maven.org/maven2/org/apache/maven/reporting/maven-reporting-api/2.0.5/maven-reporting-api-2.0.5.pom
902b downloaded  (maven-reporting-api-2.0.5.pom)
Downloading: http://repo1.maven.org/maven2/org/apache/maven/reporting/maven-reporting/2.0.5/maven-reporting-2.0.5.pom
589b downloaded  (maven-reporting-2.0.5.pom)
Downloading: http://repo1.maven.org/maven2/org/apache/maven/maven-error-diagnostics/2.0.5/maven-error-diagnostics-2.0.5.pom
854b downloaded  (maven-error-diagnostics-2.0.5.pom)
Downloading: http://repo1.maven.org/maven2/org/apache/maven/maven-plugin-registry/2.0.5/maven-plugin-registry-2.0.5.pom
1K downloaded  (maven-plugin-registry-2.0.5.pom)
Downloading: http://repo1.maven.org/maven2/org/apache/maven/maven-plugin-api/2.0.5/maven-plugin-api-2.0.5.pom
605b downloaded  (maven-plugin-api-2.0.5.pom)
Downloading: http://repo1.maven.org/maven2/org/apache/maven/maven-plugin-descriptor/2.0.5/maven-plugin-descriptor-2.0.5.pom
1K downloaded  (maven-plugin-descriptor-2.0.5.pom)
Downloading: http://repo1.maven.org/maven2/org/apache/maven/maven-monitor/2.0.5/maven-monitor-2.0.5.pom
404b downloaded  (maven-monitor-2.0.5.pom)
Downloading: http://repo1.maven.org/maven2/velocity/velocity-dep/1.4/velocity-dep-1.4.pom
1K downloaded  (velocity-dep-1.4.pom)
Downloading: http://repo1.maven.org/maven2/org/apache/maven/shared/maven-common-artifact-filters/1.0/maven-common-artifact-filters-1.0.pom
1K downloaded  (maven-common-artifact-filters-1.0.pom)
Downloading: http://repo1.maven.org/maven2/org/apache/maven/shared/maven-shared-components/8/maven-shared-components-8.pom
2K downloaded  (maven-shared-components-8.pom)
Downloading: http://repo1.maven.org/maven2/org/apache/maven/maven-parent/7/maven-parent-7.pom
20K downloaded  (maven-parent-7.pom)
Downloading: http://repo1.maven.org/maven2/org/apache/apache/4/apache-4.pom
4K downloaded  (apache-4.pom)
Downloading: http://repo1.maven.org/maven2/org/apache/maven/maven-artifact/2.0.8/maven-artifact-2.0.8.pom
1K downloaded  (maven-artifact-2.0.8.pom)
Downloading: http://repo1.maven.org/maven2/org/apache/maven/maven/2.0.8/maven-2.0.8.pom
11K downloaded  (maven-2.0.8.pom)
Downloading: http://repo1.maven.org/maven2/org/apache/maven/maven-parent/6/maven-parent-6.pom
19K downloaded  (maven-parent-6.pom)
Downloading: http://repo1.maven.org/maven2/org/apache/maven/shared/maven-plugin-testing-harness/1.1/maven-plugin-testing-harness-1.1.pom
6K downloaded  (maven-plugin-testing-harness-1.1.pom)
Downloading: http://repo1.maven.org/maven2/org/apache/maven/shared/maven-shared-components/7/maven-shared-components-7.pom
2K downloaded  (maven-shared-components-7.pom)
Downloading: http://repo1.maven.org/maven2/org/apache/maven/maven-project/2.0/maven-project-2.0.pom
1K downloaded  (maven-project-2.0.pom)
Downloading: http://repo1.maven.org/maven2/org/apache/maven/maven/2.0/maven-2.0.pom
8K downloaded  (maven-2.0.pom)
Downloading: http://repo1.maven.org/maven2/org/apache/maven/maven-core/2.0/maven-core-2.0.pom
5K downloaded  (maven-core-2.0.pom)
Downloading: http://repo1.maven.org/maven2/org/codehaus/plexus/plexus-utils/1.4.2/plexus-utils-1.4.2.pom
1K downloaded  (plexus-utils-1.4.2.pom)
Downloading: http://repo1.maven.org/maven2/org/codehaus/plexus/plexus-archiver/1.0-alpha-7/plexus-archiver-1.0-alpha-7.pom
1K downloaded  (plexus-archiver-1.0-alpha-7.pom)
Downloading: http://repo1.maven.org/maven2/org/codehaus/plexus/plexus-components/1.1.6/plexus-components-1.1.6.pom
1K downloaded  (plexus-components-1.1.6.pom)
Downloading: http://repo1.maven.org/maven2/org/codehaus/plexus/plexus/1.0.8/plexus-1.0.8.pom
7K downloaded  (plexus-1.0.8.pom)
Downloading: http://repo1.maven.org/maven2/org/codehaus/plexus/plexus-utils/1.2/plexus-utils-1.2.pom
767b downloaded  (plexus-utils-1.2.pom)
Downloading: http://repo1.maven.org/maven2/org/codehaus/plexus/plexus/1.0.5/plexus-1.0.5.pom
5K downloaded  (plexus-1.0.5.pom)
Downloading: http://repo1.maven.org/maven2/org/codehaus/plexus/plexus-container-default/1.0-alpha-8/plexus-container-default-1.0-alpha-8.pom
7K downloaded  (plexus-container-default-1.0-alpha-8.pom)
Downloading: http://repo1.maven.org/maven2/org/apache/maven/shared/maven-downloader/1.1/maven-downloader-1.1.pom
1K downloaded  (maven-downloader-1.1.pom)
Downloading: http://repo1.maven.org/maven2/org/apache/maven/shared/maven-shared-components/4/maven-shared-components-4.pom
2K downloaded  (maven-shared-components-4.pom)
Downloading: http://repo1.maven.org/maven2/org/apache/maven/maven-artifact-manager/2.0/maven-artifact-manager-2.0.pom
1K downloaded  (maven-artifact-manager-2.0.pom)
Downloading: http://repo1.maven.org/maven2/org/apache/maven/maven-artifact/2.0/maven-artifact-2.0.pom
723b downloaded  (maven-artifact-2.0.pom)
Downloading: http://repo1.maven.org/maven2/org/codehaus/plexus/plexus-utils/1.5.12/plexus-utils-1.5.12.pom
5K downloaded  (plexus-utils-1.5.12.pom)
Downloading: http://repo1.maven.org/maven2/org/codehaus/plexus/plexus-velocity/1.1.3/plexus-velocity-1.1.3.pom
976b downloaded  (plexus-velocity-1.1.3.pom)
Downloading: http://repo1.maven.org/maven2/org/codehaus/plexus/plexus-components/1.1.5/plexus-components-1.1.5.pom
2K downloaded  (plexus-components-1.1.5.pom)
Downloading: http://repo1.maven.org/maven2/commons-collections/commons-collections/2.0/commons-collections-2.0.pom
171b downloaded  (commons-collections-2.0.pom)
Downloading: http://repo1.maven.org/maven2/velocity/velocity/1.4/velocity-1.4.pom
2K downloaded  (velocity-1.4.pom)
Downloading: http://repo1.maven.org/maven2/org/codehaus/plexus/plexus-resources/1.0-alpha-5/plexus-resources-1.0-alpha-5.pom
1K downloaded  (plexus-resources-1.0-alpha-5.pom)
Downloading: http://repo1.maven.org/maven2/org/codehaus/plexus/plexus-utils/1.5.5/plexus-utils-1.5.5.pom
5K downloaded  (plexus-utils-1.5.5.pom)
Downloading: http://repo1.maven.org/maven2/org/sonatype/plexus/plexus-build-api/0.0.4/plexus-build-api-0.0.4.jar
Downloading: http://repo1.maven.org/maven2/org/codehaus/plexus/plexus-utils/1.5.12/plexus-utils-1.5.12.jar
Downloading: http://repo1.maven.org/maven2/velocity/velocity-dep/1.4/velocity-dep-1.4.jar
Downloading: http://repo1.maven.org/maven2/org/apache/maven/shared/maven-artifact-resolver/1.0/maven-artifact-resolver-1.0.jar
Downloading: http://repo1.maven.org/maven2/commons-collections/commons-collections/2.0/commons-collections-2.0.jar
6K downloaded  (plexus-build-api-0.0.4.jar)
275K downloaded  (plexus-utils-1.5.12.jar)
505K downloaded  (velocity-dep-1.4.jar)
88K downloaded  (commons-collections-2.0.jar)
13K downloaded  (maven-artifact-resolver-1.0.jar)
Downloading: http://repo1.maven.org/maven2/org/codehaus/plexus/plexus-interpolation/1.12/plexus-interpolation-1.12.jar
Downloading: http://repo1.maven.org/maven2/velocity/velocity/1.4/velocity-1.4.jar
Downloading: http://repo1.maven.org/maven2/org/apache/maven/shared/maven-filtering/1.0-beta-3/maven-filtering-1.0-beta-3.jar
59K downloaded  (plexus-interpolation-1.12.jar)
33K downloaded  (maven-filtering-1.0-beta-3.jar)
Downloading: http://repo1.maven.org/maven2/org/apache/maven/shared/maven-common-artifact-filters/1.0/maven-common-artifact-filters-1.0.jar
26K downloaded  (maven-common-artifact-filters-1.0.jar)
Downloading: http://repo1.maven.org/maven2/org/codehaus/plexus/plexus-archiver/1.0-alpha-7/plexus-archiver-1.0-alpha-7.jar
Downloading: http://repo1.maven.org/maven2/org/apache/maven/shared/maven-plugin-testing-harness/1.1/maven-plugin-testing-harness-1.1.jar
352K downloaded  (velocity-1.4.jar)
31K downloaded  (maven-plugin-testing-harness-1.1.jar)
138K downloaded  (plexus-archiver-1.0-alpha-7.jar)
Downloading: http://repo1.maven.org/maven2/org/apache/maven/shared/maven-downloader/1.1/maven-downloader-1.1.jar
Downloading: http://repo1.maven.org/maven2/org/codehaus/plexus/plexus-velocity/1.1.3/plexus-velocity-1.1.3.jar
6K downloaded  (maven-downloader-1.1.jar)
7K downloaded  (plexus-velocity-1.1.3.jar)
Downloading: http://repo1.maven.org/maven2/org/codehaus/plexus/plexus-resources/1.0-alpha-5/plexus-resources-1.0-alpha-5.jar
21K downloaded  (plexus-resources-1.0-alpha-5.jar)
[INFO] Setting property: classpath.resource.loader.class => 'org.codehaus.plexus.velocity.ContextClassLoaderResourceLoader'.
[INFO] Setting property: velocimacro.messages.on => 'false'.
[INFO] Setting property: resource.loader => 'classpath'.
[INFO] Setting property: resource.manager.logwhenfound => 'false'.
Executing Maven:  -B -f <https://builds.apache.org/job/oodt-trunk/ws/pom.xml> -Dmaven.repo.local=<https://builds.apache.org/job/oodt-trunk/ws/.repository>
install
[INFO] [remote-resources:process {execution: default}]
Downloading: http://repo1.maven.org/maven2/org/apache/apache-jar-resource-bundle/1.4/apache-jar-resource-bundle-1.4.jar
12K downloaded  (apache-jar-resource-bundle-1.4.jar)
ERROR: Failed to parse POMs
hudson.remoting.ChannelClosedException: channel is already closed
	at hudson.remoting.Channel.send(Channel.java:494)
	at hudson.remoting.Request.call(Request.java:129)
	at hudson.remoting.Channel.call(Channel.java:672)
	at hudson.remoting.RemoteInvocationHandler.invoke(RemoteInvocationHandler.java:158)
	at sun.proxy.$Proxy37.isAlive(Unknown Source)
	at hudson.Launcher$RemoteLauncher$ProcImpl.isAlive(Launcher.java:920)
	at hudson.maven.ProcessCache$MavenProcess.call(ProcessCache.java:161)
	at hudson.maven.MavenModuleSetBuild$MavenModuleSetBuildExecution.doRun(MavenModuleSetBuild.java:755)
	at hudson.model.AbstractBuild$AbstractBuildExecution.run(AbstractBuild.java:592)
	at hudson.model.Run.execute(Run.java:1568)
	at hudson.maven.MavenModuleSetBuild.run(MavenModuleSetBuild.java:477)
	at hudson.model.ResourceController.execute(ResourceController.java:88)
	at hudson.model.Executor.run(Executor.java:236)
Caused by: hudson.remoting.Channel$OrderlyShutdown: java.util.concurrent.TimeoutException:
Ping started on 1361252798629 hasn't completed at 1361253038630
	at hudson.remoting.Channel$CloseCommand.execute(Channel.java:850)
	at hudson.remoting.Channel$2.handle(Channel.java:435)
	at hudson.remoting.SynchronousCommandTransport$ReaderThread.run(SynchronousCommandTransport.java:60)
Caused by: Command close created at
	at hudson.remoting.Command.<init>(Command.java:56)
	at hudson.remoting.Channel$CloseCommand.<init>(Channel.java:844)
	at hudson.remoting.Channel$CloseCommand.<init>(Channel.java:842)
	at hudson.remoting.Channel.close(Channel.java:909)
	at hudson.slaves.ChannelPinger$1.onDead(ChannelPinger.java:110)
	at hudson.remoting.PingThread.ping(PingThread.java:120)
	at hudson.remoting.PingThread.run(PingThread.java:81)
Caused by: java.util.concurrent.TimeoutException: Ping started on 1361252798629 hasn't completed
at 1361253038630
	... 2 more
FATAL: channel is already closed
hudson.remoting.ChannelClosedException: channel is already closed
	at hudson.remoting.Channel.send(Channel.java:494)
	at hudson.remoting.Request.call(Request.java:129)
	at hudson.remoting.Channel.call(Channel.java:672)
	at hudson.Launcher$RemoteLauncher.kill(Launcher.java:877)
	at hudson.model.AbstractBuild$AbstractBuildExecution.run(AbstractBuild.java:615)
	at hudson.model.Run.execute(Run.java:1568)
	at hudson.maven.MavenModuleSetBuild.run(MavenModuleSetBuild.java:477)
	at hudson.model.ResourceController.execute(ResourceController.java:88)
	at hudson.model.Executor.run(Executor.java:236)
Caused by: hudson.remoting.Channel$OrderlyShutdown: java.util.concurrent.TimeoutException:
Ping started on 1361252798629 hasn't completed at 1361253038630
	at hudson.remoting.Channel$CloseCommand.execute(Channel.java:850)
	at hudson.remoting.Channel$2.handle(Channel.java:435)
	at hudson.remoting.SynchronousCommandTransport$ReaderThread.run(SynchronousCommandTransport.java:60)
Caused by: Command close created at
	at hudson.remoting.Command.<init>(Command.java:56)
	at hudson.remoting.Channel$CloseCommand.<init>(Channel.java:844)
	at hudson.remoting.Channel$CloseCommand.<init>(Channel.java:842)
	at hudson.remoting.Channel.close(Channel.java:909)
	at hudson.slaves.ChannelPinger$1.onDead(ChannelPinger.java:110)
	at hudson.remoting.PingThread.ping(PingThread.java:120)
	at hudson.remoting.PingThread.run(PingThread.java:81)
Caused by: java.util.concurrent.TimeoutException: Ping started on 1361252798629 hasn't completed
at 1361253038630
	... 2 more

Mime
View raw message