oodt-dev mailing list archives

Site index · List index
Message view « Date » · « Thread »
Top « Date » · « Thread »
From Apache Jenkins Server <jenk...@builds.apache.org>
Subject Build failed in Jenkins: oodt-trunk #663
Date Mon, 01 Oct 2012 00:46:13 GMT
See <https://builds.apache.org/job/oodt-trunk/663/>

------------------------------------------
[...truncated 6864 lines...]
[INFO] Building CAS PGE Adaptor Framework
[INFO]    task-segment: [install]
[INFO] ------------------------------------------------------------------------
[INFO] [remote-resources:process {execution: default}]
Downloading: http://repo1.maven.org/maven2/net/sf/saxon/saxon-dom/8.7/saxon-dom-8.7.pom
752b downloaded  (saxon-dom-8.7.pom)
Downloading: http://repo1.maven.org/maven2/net/sf/saxon/saxon/8.7/saxon-8.7.pom
564b downloaded  (saxon-8.7.pom)
Downloading: http://repo1.maven.org/maven2/net/sf/saxon/saxon-dom/8.7/saxon-dom-8.7.jar
43K downloaded  (saxon-dom-8.7.jar)
Downloading: http://repo1.maven.org/maven2/net/sf/saxon/saxon/8.7/saxon-8.7.jar
3191K downloaded  (saxon-8.7.jar)
[INFO] [resources:resources {execution: default-resources}]
[INFO] Using 'UTF-8' encoding to copy filtered resources.
[INFO] Copying 14 resources
[INFO] Copying 3 resources
[INFO] [compiler:compile {execution: default-compile}]
[INFO] Compiling 24 source files to <https://builds.apache.org/job/oodt-trunk/ws/pge/target/classes>
[INFO] [resources:testResources {execution: default-testResources}]
[INFO] Using 'UTF-8' encoding to copy filtered resources.
[INFO] skip non existing resourceDirectory <https://builds.apache.org/job/oodt-trunk/ws/pge/src/test/resources>
[INFO] Copying 3 resources
[INFO] [compiler:testCompile {execution: default-testCompile}]
[INFO] Compiling 10 source files to <https://builds.apache.org/job/oodt-trunk/ws/pge/target/test-classes>
[INFO] [surefire:test {execution: default-test}]
[INFO] Surefire report directory: <https://builds.apache.org/job/oodt-trunk/ws/pge/target/surefire-reports>

-------------------------------------------------------
 T E S T S
-------------------------------------------------------
Running org.apache.oodt.cas.pge.metadata.TestPgeMetadata
Tests run: 3, Failures: 0, Errors: 0, Skipped: 0, Time elapsed: 0.065 sec
Running org.apache.oodt.cas.pge.metadata.TestPgeTaskMetKeys
Tests run: 2, Failures: 0, Errors: 0, Skipped: 0, Time elapsed: 0.002 sec
Running org.apache.oodt.cas.pge.TestPGETaskInstance
Oct 1, 2012 12:44:44 AM org.apache.oodt.cas.pge.PGETaskInstance runPropertyAdders
INFO: Loading/Running property adders...
Oct 1, 2012 12:44:44 AM org.apache.oodt.cas.pge.PGETaskInstance runPropertyAdder
INFO: Running property adder: org.apache.oodt.cas.pge.MockConfigFilePropertyAdder
Oct 1, 2012 12:44:44 AM org.apache.oodt.cas.pge.PGETaskInstance runPropertyAdders
INFO: Loading/Running property adders...
Oct 1, 2012 12:44:44 AM org.apache.oodt.cas.pge.PGETaskInstance runPropertyAdder
INFO: Running property adder: org.apache.oodt.cas.pge.MockConfigFilePropertyAdder
Oct 1, 2012 12:44:44 AM org.apache.oodt.cas.pge.PGETaskInstance runPropertyAdder
INFO: Running property adder: org.apache.oodt.cas.pge.MockConfigFilePropertyAdder
Oct 1, 2012 12:44:44 AM org.apache.oodt.cas.pge.PGETaskInstance runPropertyAdders
INFO: Loading/Running property adders...
Oct 1, 2012 12:44:44 AM org.apache.oodt.cas.pge.PGETaskInstance runPropertyAdder
INFO: Running property adder: org.apache.oodt.cas.pge.MockConfigFilePropertyAdder
Oct 1, 2012 12:44:44 AM org.apache.oodt.cas.pge.PGETaskInstance createPgeMetadata
INFO: Converting workflow configuration to static metadata...
Oct 1, 2012 12:44:44 AM org.apache.oodt.cas.pge.PGETaskInstance createPgeMetadata
INFO: Loading workflow context metadata...
Oct 1, 2012 12:44:44 AM org.apache.oodt.cas.pge.PGETaskInstance createPgeMetadata
INFO: Converting workflow configuration to static metadata...
Oct 1, 2012 12:44:44 AM org.apache.oodt.cas.pge.PGETaskInstance createPgeMetadata
INFO: Loading workflow context metadata...
Oct 1, 2012 12:44:44 AM org.apache.oodt.cas.pge.TestPGETaskInstance testLogger
INFO: pge1 message1
Oct 1, 2012 12:44:44 AM org.apache.oodt.cas.pge.TestPGETaskInstance testLogger
INFO: pge1 message2
Oct 1, 2012 12:44:44 AM org.apache.oodt.cas.pge.TestPGETaskInstance testLogger
SEVERE: pge2 message1
Oct 1, 2012 12:44:44 AM org.apache.oodt.cas.pge.TestPGETaskInstance testLogger
INFO: pge1 message3
Oct 1, 2012 12:44:44 AM org.apache.oodt.cas.pge.PGETaskInstance updateStatus
INFO: Updating status to workflow as [PGETask_Crawling]
Oct 1, 2012 12:44:44 AM org.apache.oodt.cas.pge.PGETaskInstance createPgeConfig
INFO: Create PgeConfig...
Oct 1, 2012 12:44:44 AM org.apache.oodt.cas.pge.PGETaskInstance createPgeConfig
INFO: Using default PgeConfigBuilder: org.apache.oodt.cas.pge.config.XmlFilePgeConfigBuilder
Oct 1, 2012 12:44:44 AM org.apache.oodt.cas.pge.PGETaskInstance createPgeConfig
INFO: Create PgeConfig...
Oct 1, 2012 12:44:44 AM org.apache.oodt.cas.pge.PGETaskInstance createPgeConfig
INFO: Using PgeConfigBuilder: org.apache.oodt.cas.pge.config.MockPgeConfigBuilder
Oct 1, 2012 12:44:44 AM org.apache.oodt.cas.pge.PGETaskInstance createWorkflowManagerClient
INFO: Creating WorkflowManager client for url [http://localhost:8888]
Oct 1, 2012 12:44:44 AM org.apache.oodt.cas.pge.PGETaskInstance getWorkflowInstanceId
INFO: Workflow instanceId is [12345]
Oct 1, 2012 12:44:44 AM org.apache.oodt.cas.pge.PGETaskInstance createExeDir
INFO: Creating PGE execution working directory: [/tmp/6105d379-def6-47fb-a8fc-e4823f1c2813/d3e82544-a254-4e3e-a6b2-8f04d9c43fad]
Oct 1, 2012 12:44:44 AM org.apache.oodt.cas.pge.PGETaskInstance createOuputDirsIfRequested
INFO: Creating PGE file ouput directory: [/tmp/e75363cf-6474-4989-87a7-939c9f467deb]
Oct 1, 2012 12:44:44 AM org.apache.oodt.cas.pge.PGETaskInstance createOuputDirsIfRequested
INFO: Creating PGE file ouput directory: [/tmp/a35ca5ef-c716-44bc-bccd-b9765657d8fc]
Oct 1, 2012 12:44:44 AM org.apache.oodt.cas.pge.PGETaskInstance createDynamicConfigFile
INFO: Writing dynamic config file [/tmp/e36ce10e-ae27-41d2-b332-d0bf83f2e78d/DynamicConfig.xml]...
Oct 1, 2012 12:44:44 AM org.apache.oodt.cas.pge.PGETaskInstance createProductCrawler
INFO: Configuring ProductCrawler...
Oct 1, 2012 12:44:45 AM org.springframework.context.support.AbstractApplicationContext prepareRefresh
INFO: Refreshing org.springframework.context.support.FileSystemXmlApplicationContext@1b1fbf4:
display name [org.springframework.context.support.FileSystemXmlApplicationContext@1b1fbf4];
startup date [Mon Oct 01 00:44:45 UTC 2012]; root of context hierarchy
Oct 1, 2012 12:44:45 AM org.springframework.beans.factory.xml.XmlBeanDefinitionReader loadBeanDefinitions
INFO: Loading XML bean definitions from file [<https://builds.apache.org/job/oodt-trunk/ws/pge/src/main/resources/examples/Crawler/crawler-config.xml]>
Oct 1, 2012 12:44:45 AM org.springframework.beans.factory.xml.XmlBeanDefinitionReader loadBeanDefinitions
INFO: Loading XML bean definitions from file [<https://builds.apache.org/job/oodt-trunk/ws/pge/src/main/resources/examples/Crawler/action-beans.xml]>
Oct 1, 2012 12:44:45 AM org.springframework.beans.factory.xml.XmlBeanDefinitionReader loadBeanDefinitions
INFO: Loading XML bean definitions from file [<https://builds.apache.org/job/oodt-trunk/ws/pge/src/main/resources/examples/Crawler/precondition-beans.xml]>
Oct 1, 2012 12:44:45 AM org.springframework.beans.factory.xml.XmlBeanDefinitionReader loadBeanDefinitions
INFO: Loading XML bean definitions from file [<https://builds.apache.org/job/oodt-trunk/ws/pge/src/main/resources/examples/Crawler/naming-beans.xml]>
Oct 1, 2012 12:44:45 AM org.springframework.context.support.AbstractApplicationContext obtainFreshBeanFactory
INFO: Bean factory for application context [org.springframework.context.support.FileSystemXmlApplicationContext@1b1fbf4]:
org.springframework.beans.factory.support.DefaultListableBeanFactory@c01e99
Oct 1, 2012 12:44:45 AM org.springframework.core.io.support.PropertiesLoaderSupport loadProperties
INFO: Loading properties file from file [<https://builds.apache.org/job/oodt-trunk/ws/pge/src/main/resources/examples/Crawler/action-beans.properties]>
Oct 1, 2012 12:44:45 AM org.springframework.beans.factory.support.DefaultListableBeanFactory
preInstantiateSingletons
INFO: Pre-instantiating singletons in org.springframework.beans.factory.support.DefaultListableBeanFactory@c01e99:
defining beans [org.apache.oodt.cas.crawl.util.CasPropertyOverrideConfigurer#0,org.apache.oodt.commons.spring.postprocessor.SetIdBeanPostProcessor#0,org.apache.oodt.cas.crawl.util.CasPropertyPlaceholderConfigurer#0,DeleteDataFile,DeleteMetadataFile,MoveDataFileToFailureDir,MoveMetadataFileToFailureDir,MoveMetadataFileToBackupDir,TriggerPostIngestWorkflow,Unique,org.apache.oodt.commons.spring.postprocessor.SetIdBeanPostProcessor#1,CheckThatDataFileSizeIsGreaterThanZero,AprioriUniquessCheckWithFilemgr,PDFNamingConv];
root of factory hierarchy
Oct 1, 2012 12:44:45 AM org.apache.oodt.cas.pge.PGETaskInstance updateStatus
INFO: Updating status to workflow as [PGETask_Crawling]
Oct 1, 2012 12:44:45 AM org.apache.oodt.cas.pge.PGETaskInstance runIngestCrawler
INFO: Crawling for products in [/tmp/dir1]
Oct 1, 2012 12:44:45 AM org.apache.oodt.cas.pge.PGETaskInstance runIngestCrawler
INFO: Crawling for products in [/tmp/dir2]
Oct 1, 2012 12:44:45 AM org.apache.oodt.cas.pge.PGETaskInstance verifyIngests
INFO: Verifying ingests successful...
Oct 1, 2012 12:44:45 AM org.apache.oodt.cas.pge.PGETaskInstance verifyIngests
INFO: Ingests were successful
Oct 1, 2012 12:44:45 AM org.apache.oodt.cas.pge.PGETaskInstance updateStatus
INFO: Updating status to workflow as [PGETask_Crawling]
Oct 1, 2012 12:44:45 AM org.apache.oodt.cas.pge.PGETaskInstance updateStatus
INFO: Updating status to workflow as [PGETask_Crawling]
Oct 1, 2012 12:44:45 AM org.apache.oodt.cas.pge.PGETaskInstance runIngestCrawler
INFO: Crawling for products in [/tmp/dir1]
Oct 1, 2012 12:44:45 AM org.apache.oodt.cas.pge.PGETaskInstance runIngestCrawler
INFO: Crawling for products in [/tmp/dir2]
Oct 1, 2012 12:44:45 AM org.apache.oodt.cas.pge.PGETaskInstance verifyIngests
INFO: Verifying ingests successful...
Oct 1, 2012 12:44:45 AM org.apache.oodt.cas.pge.PGETaskInstance verifyIngests
INFO: Verifying ingests successful...
Tests run: 15, Failures: 0, Errors: 0, Skipped: 0, Time elapsed: 1.74 sec
Running org.apache.oodt.cas.pge.config.TestXmlFilePgeConfigBuilder
Tests run: 1, Failures: 0, Errors: 0, Skipped: 0, Time elapsed: 0.129 sec
Running org.apache.oodt.cas.pge.util.TestXmlHelper
Tests run: 3, Failures: 0, Errors: 0, Skipped: 0, Time elapsed: 0.019 sec
Running org.apache.oodt.cas.pge.util.UtilsTest
Tests run: 1, Failures: 0, Errors: 0, Skipped: 0, Time elapsed: 0.007 sec
Running org.apache.oodt.cas.pge.staging.TestFileStager
java.lang.ClassNotFoundException: 
	at java.lang.Class.forName0(Native Method)
	at java.lang.Class.forName(Class.java:169)
	at org.apache.oodt.cas.filemgr.util.GenericFileManagerObjectFactory.getCatalogServiceFromFactory(GenericFileManagerObjectFactory.java:159)
	at org.apache.oodt.cas.filemgr.system.XmlRpcFileManager.loadConfiguration(XmlRpcFileManager.java:1343)
	at org.apache.oodt.cas.filemgr.system.XmlRpcFileManager.<init>(XmlRpcFileManager.java:131)
	at org.apache.oodt.cas.pge.staging.TestFileStager.testCreateFileManagerClient(TestFileStager.java:76)
	at sun.reflect.NativeMethodAccessorImpl.invoke0(Native Method)
	at sun.reflect.NativeMethodAccessorImpl.invoke(NativeMethodAccessorImpl.java:39)
	at sun.reflect.DelegatingMethodAccessorImpl.invoke(DelegatingMethodAccessorImpl.java:25)
	at java.lang.reflect.Method.invoke(Method.java:597)
	at junit.framework.TestCase.runTest(TestCase.java:164)
	at junit.framework.TestCase.runBare(TestCase.java:130)
	at junit.framework.TestResult$1.protect(TestResult.java:106)
	at junit.framework.TestResult.runProtected(TestResult.java:124)
	at junit.framework.TestResult.run(TestResult.java:109)
	at junit.framework.TestCase.run(TestCase.java:120)
	at junit.framework.TestSuite.runTest(TestSuite.java:230)
	at junit.framework.TestSuite.run(TestSuite.java:225)
	at sun.reflect.NativeMethodAccessorImpl.invoke0(Native Method)
	at sun.reflect.NativeMethodAccessorImpl.invoke(NativeMethodAccessorImpl.java:39)
	at sun.reflect.DelegatingMethodAccessorImpl.invoke(DelegatingMethodAccessorImpl.java:25)
	at java.lang.reflect.Method.invoke(Method.java:597)
	at org.apache.maven.surefire.junit.JUnitTestSet.execute(JUnitTestSet.java:98)
	at org.apache.maven.surefire.junit.JUnit3Provider.executeTestSet(JUnit3Provider.java:107)
	at org.apache.maven.surefire.junit.JUnit3Provider.invoke(JUnit3Provider.java:84)
	at sun.reflect.NativeMethodAccessorImpl.invoke0(Native Method)
	at sun.reflect.NativeMethodAccessorImpl.invoke(NativeMethodAccessorImpl.java:39)
	at sun.reflect.DelegatingMethodAccessorImpl.invoke(DelegatingMethodAccessorImpl.java:25)
	at java.lang.reflect.Method.invoke(Method.java:597)
	at org.apache.maven.surefire.booter.ProviderFactory$ClassLoaderProxy.invoke(ProviderFactory.java:103)
	at $Proxy0.invoke(Unknown Source)
	at org.apache.maven.surefire.booter.SurefireStarter.invokeProvider(SurefireStarter.java:150)
	at org.apache.maven.surefire.booter.SurefireStarter.runSuitesInProcess(SurefireStarter.java:91)
	at org.apache.maven.surefire.booter.ForkedBooter.main(ForkedBooter.java:69)
Oct 1, 2012 12:44:46 AM org.apache.oodt.cas.filemgr.util.GenericFileManagerObjectFactory getCatalogServiceFromFactory
WARNING: ClassNotFoundException when loading metadata store factory class  Message: 
java.lang.ClassNotFoundException: 
	at java.lang.Class.forName0(Native Method)
	at java.lang.Class.forName(Class.java:169)
	at org.apache.oodt.cas.filemgr.util.GenericFileManagerObjectFactory.getRepositoryManagerServiceFromFactory(GenericFileManagerObjectFactory.java:120)
	at org.apache.oodt.cas.filemgr.system.XmlRpcFileManager.loadConfiguration(XmlRpcFileManager.java:1345)
	at org.apache.oodt.cas.filemgr.system.XmlRpcFileManager.<init>(XmlRpcFileManager.java:131)
	at org.apache.oodt.cas.pge.staging.TestFileStager.testCreateFileManagerClient(TestFileStager.java:76)
	at sun.reflect.NativeMethodAccessorImpl.invoke0(Native Method)
	at sun.reflect.NativeMethodAccessorImpl.invoke(NativeMethodAccessorImpl.java:39)
	at sun.reflect.DelegatingMethodAccessorImpl.invoke(DelegatingMethodAccessorImpl.java:25)
	at java.lang.reflect.Method.invoke(Method.java:597)
	at junit.framework.TestCase.runTest(TestCase.java:164)
	at junit.framework.TestCase.runBare(TestCase.java:130)
	at junit.framework.TestResult$1.protect(TestResult.java:106)
	at junit.framework.TestResult.runProtected(TestResult.java:124)
	at junit.framework.TestResult.run(TestResult.java:109)
	at junit.framework.TestCase.run(TestCase.java:120)
	at junit.framework.TestSuite.runTest(TestSuite.java:230)
	at junit.framework.TestSuite.run(TestSuite.java:225)
	at sun.reflect.NativeMethodAccessorImpl.invoke0(Native Method)
	at sun.reflect.NativeMethodAccessorImpl.invoke(NativeMethodAccessorImpl.java:39)
	at sun.reflect.DelegatingMethodAccessorImpl.invoke(DelegatingMethodAccessorImpl.java:25)
	at java.lang.reflect.Method.invoke(Method.java:597)
	at org.apache.maven.surefire.junit.JUnitTestSet.execute(JUnitTestSet.java:98)
	at org.apache.maven.surefire.junit.JUnit3Provider.executeTestSet(JUnit3Provider.java:107)
	at org.apache.maven.surefire.junit.JUnit3Provider.invoke(JUnit3Provider.java:84)
	at sun.reflect.NativeMethodAccessorImpl.invoke0(Native Method)
	at sun.reflect.NativeMethodAccessorImpl.invoke(NativeMethodAccessorImpl.java:39)
	at sun.reflect.DelegatingMethodAccessorImpl.invoke(DelegatingMethodAccessorImpl.java:25)
	at java.lang.reflect.Method.invoke(Method.java:597)
	at org.apache.maven.surefire.booter.ProviderFactory$ClassLoaderProxy.invoke(ProviderFactory.java:103)
	at $Proxy0.invoke(Unknown Source)
	at org.apache.maven.surefire.booter.SurefireStarter.invokeProvider(SurefireStarter.java:150)
	at org.apache.maven.surefire.booter.SurefireStarter.runSuitesInProcess(SurefireStarter.java:91)
	at org.apache.maven.surefire.booter.ForkedBooter.main(ForkedBooter.java:69)
Oct 1, 2012 12:44:46 AM org.apache.oodt.cas.filemgr.util.GenericFileManagerObjectFactory getRepositoryManagerServiceFromFactory
WARNING: ClassNotFoundException when loading data store factory class  Message: 
Oct 1, 2012 12:44:46 AM org.apache.oodt.cas.filemgr.datatransfer.LocalDataTransferer setFileManagerUrl
INFO: Local Data Transfer to: [http://localhost:9876] enabled
Oct 1, 2012 12:44:46 AM org.apache.oodt.cas.filemgr.system.XmlRpcFileManager <init>
INFO: File Manager started by hudson
Tests run: 3, Failures: 0, Errors: 0, Skipped: 0, Time elapsed: 0.567 sec

Results :

Tests run: 28, Failures: 0, Errors: 0, Skipped: 0

[JENKINS] Recording test results
[INFO] [jar:jar {execution: default-jar}]
[INFO] Building jar: <https://builds.apache.org/job/oodt-trunk/ws/pge/target/cas-pge-0.5-SNAPSHOT.jar>
[INFO] Preparing javadoc:javadoc
[WARNING] Removing: javadoc from forked lifecycle, to prevent recursive invocation.
[INFO] No goals needed for project - skipping
[WARNING] DEPRECATED [aggregate]: since 2.5. Use the goals <code>javadoc:aggregate</code>
and <code>javadoc:test-aggregate</code> instead.
[INFO] [javadoc:javadoc {execution: attach-javadocs}]
[INFO] [assembly:single {execution: default}]
[INFO] Reading assembly descriptor: src/main/assembly/assembly.xml
[INFO] Processing DependencySet (output=lib)
[INFO] Building tar : <https://builds.apache.org/job/oodt-trunk/ws/pge/target/cas-pge-0.5-SNAPSHOT-dist.tar.gz>
[INFO] Processing DependencySet (output=lib)
[JENKINS] Archiving <https://builds.apache.org/job/oodt-trunk/ws/pge/pom.xml> to /home/hudson/hudson/jobs/oodt-trunk/modules/org.apache.oodt$cas-pge/builds/2012-10-01_00-22-41/archive/org.apache.oodt/cas-pge/0.5-SNAPSHOT/cas-pge-0.5-SNAPSHOT.pom
[JENKINS] Archiving <https://builds.apache.org/job/oodt-trunk/ws/pge/target/cas-pge-0.5-SNAPSHOT.jar>
to /home/hudson/hudson/jobs/oodt-trunk/modules/org.apache.oodt$cas-pge/builds/2012-10-01_00-22-41/archive/org.apache.oodt/cas-pge/0.5-SNAPSHOT/cas-pge-0.5-SNAPSHOT.jar
[JENKINS] Archiving <https://builds.apache.org/job/oodt-trunk/ws/pge/target/cas-pge-0.5-SNAPSHOT-dist.tar.gz>
to /home/hudson/hudson/jobs/oodt-trunk/modules/org.apache.oodt$cas-pge/builds/2012-10-01_00-22-41/archive/org.apache.oodt/cas-pge/0.5-SNAPSHOT/cas-pge-0.5-SNAPSHOT-dist.tar.gz
[INFO] ------------------------------------------------------------------------
[ERROR] BUILD ERROR
[INFO] ------------------------------------------------------------------------
[INFO] Failed to create assembly: Failed to retrieve OS environment variables. Reason: Cannot
run program "env": java.io.IOException: error=24, Too many open files

[INFO] ------------------------------------------------------------------------
[INFO] For more information, run Maven with the -e switch
[INFO] ------------------------------------------------------------------------
[INFO] Total time: 22 minutes 55 seconds
[INFO] Finished at: Mon Oct 01 00:46:07 UTC 2012
[INFO] Final Memory: 119M/395M
[INFO] ------------------------------------------------------------------------
Sending e-mails to: dev@oodt.apache.org
channel stopped

Mime
View raw message