oodt-dev mailing list archives

Site index · List index
Message view « Date » · « Thread »
Top « Date » · « Thread »
From Apache Jenkins Server <jenk...@builds.apache.org>
Subject Build failed in Jenkins: oodt-trunk #698
Date Sat, 27 Oct 2012 00:50:33 GMT
See <https://builds.apache.org/job/oodt-trunk/698/>

------------------------------------------
[...truncated 6496 lines...]
 T E S T S
-------------------------------------------------------
Running org.apache.oodt.cas.workflow.instrepo.TestLuceneWorkflowInstanceRepository
Tests run: 2, Failures: 0, Errors: 0, Skipped: 0, Time elapsed: 0.202 sec
Running org.apache.oodt.cas.workflow.cli.TestWorkflowCli
Tests run: 20, Failures: 0, Errors: 0, Skipped: 0, Time elapsed: 4.689 sec
Running org.apache.oodt.cas.workflow.structs.TestHighestFIFOPrioritySorter
Tests run: 1, Failures: 0, Errors: 0, Skipped: 0, Time elapsed: 0.194 sec
Running org.apache.oodt.cas.workflow.system.TestXmlRpcWorkflowManager
Tests run: 1, Failures: 0, Errors: 0, Skipped: 0, Time elapsed: 0.595 sec
Running org.apache.oodt.cas.workflow.system.TestXmlRpcWorkflowManagerClient
Tests run: 1, Failures: 0, Errors: 0, Skipped: 0, Time elapsed: 0.154 sec
Running org.apache.oodt.cas.workflow.engine.TestAsynchronousLocalEngineRunner
Tests run: 1, Failures: 0, Errors: 0, Skipped: 0, Time elapsed: 0.23 sec
Running org.apache.oodt.cas.workflow.repository.TestWorkflowDataSourceRepository
Tests run: 2, Failures: 0, Errors: 0, Skipped: 0, Time elapsed: 0.428 sec
Running org.apache.oodt.cas.workflow.repository.TestPackagedWorkflowRepository
Tests run: 5, Failures: 0, Errors: 0, Skipped: 0, Time elapsed: 1.926 sec
Running org.apache.oodt.cas.workflow.structs.TestFILOPrioritySorter
Tests run: 1, Failures: 0, Errors: 0, Skipped: 0, Time elapsed: 0.199 sec
Running org.apache.oodt.cas.workflow.tools.TestInstanceRepoCleaner
Tests run: 1, Failures: 0, Errors: 0, Skipped: 0, Time elapsed: 0.39 sec
Running org.apache.oodt.cas.workflow.engine.SimpleTester
Tests run: 0, Failures: 0, Errors: 0, Skipped: 0, Time elapsed: 0.015 sec
Running org.apache.oodt.cas.workflow.engine.TestTaskRunner
Tests run: 1, Failures: 0, Errors: 0, Skipped: 0, Time elapsed: 0.248 sec
Running org.apache.oodt.cas.workflow.structs.TestHighestPrioritySorter
Tests run: 1, Failures: 0, Errors: 0, Skipped: 0, Time elapsed: 0.194 sec
Running org.apache.oodt.cas.workflow.examples.TestExternScriptTaskInstance
Tests run: 1, Failures: 0, Errors: 0, Skipped: 0, Time elapsed: 0.042 sec
Running org.apache.oodt.cas.workflow.util.TestGenericWorkflowObjectFactory
Tests run: 2, Failures: 0, Errors: 0, Skipped: 0, Time elapsed: 0.027 sec
Running org.apache.oodt.cas.workflow.engine.TestThreadPoolWorkflowEngine
Tests run: 1, Failures: 0, Errors: 0, Skipped: 0, Time elapsed: 0.064 sec
Running org.apache.oodt.cas.workflow.engine.TestTaskQuerier
Tests run: 2, Failures: 0, Errors: 0, Skipped: 0, Time elapsed: 1.278 sec
Running org.apache.oodt.cas.workflow.repository.TestWorkflowRepository
Tests run: 15, Failures: 0, Errors: 0, Skipped: 0, Time elapsed: 13.823 sec
Running org.apache.oodt.cas.workflow.lifecycle.TestWorkflowLifecycleManager
Tests run: 5, Failures: 0, Errors: 0, Skipped: 0, Time elapsed: 0.214 sec
Running org.apache.oodt.cas.workflow.structs.TestWorkflowInstance
Tests run: 1, Failures: 0, Errors: 0, Skipped: 0, Time elapsed: 0.033 sec

Results :

Tests run: 64, Failures: 0, Errors: 0, Skipped: 0

[JENKINS] Recording test results
[INFO] [jar:jar {execution: default-jar}]
[INFO] Building jar: <https://builds.apache.org/job/oodt-trunk/ws/workflow/target/cas-workflow-0.5-SNAPSHOT.jar>
[INFO] Preparing javadoc:javadoc
[WARNING] Removing: javadoc from forked lifecycle, to prevent recursive invocation.
[INFO] No goals needed for project - skipping
[WARNING] DEPRECATED [aggregate]: since 2.5. Use the goals <code>javadoc:aggregate</code>
and <code>javadoc:test-aggregate</code> instead.
[INFO] [javadoc:javadoc {execution: attach-javadocs}]
[INFO] [assembly:single {execution: default}]
[INFO] Reading assembly descriptor: src/main/assembly/assembly.xml
[INFO] Processing DependencySet (output=lib)
[INFO] Building tar : <https://builds.apache.org/job/oodt-trunk/ws/workflow/target/cas-workflow-0.5-SNAPSHOT-dist.tar.gz>
[INFO] Processing DependencySet (output=lib)
[INFO] Building zip: <https://builds.apache.org/job/oodt-trunk/ws/workflow/target/cas-workflow-0.5-SNAPSHOT-dist.zip>
[INFO] [install:install {execution: default-install}]
[INFO] Installing <https://builds.apache.org/job/oodt-trunk/ws/workflow/target/cas-workflow-0.5-SNAPSHOT.jar>
to <https://builds.apache.org/job/oodt-trunk/ws/.repository/org/apache/oodt/cas-workflow/0.5-SNAPSHOT/cas-workflow-0.5-SNAPSHOT.jar>
[INFO] Installing <https://builds.apache.org/job/oodt-trunk/ws/workflow/target/cas-workflow-0.5-SNAPSHOT-dist.tar.gz>
to <https://builds.apache.org/job/oodt-trunk/ws/.repository/org/apache/oodt/cas-workflow/0.5-SNAPSHOT/cas-workflow-0.5-SNAPSHOT-dist.tar.gz>
[INFO] Installing <https://builds.apache.org/job/oodt-trunk/ws/workflow/target/cas-workflow-0.5-SNAPSHOT-dist.zip>
to <https://builds.apache.org/job/oodt-trunk/ws/.repository/org/apache/oodt/cas-workflow/0.5-SNAPSHOT/cas-workflow-0.5-SNAPSHOT-dist.zip>
[JENKINS] Archiving <https://builds.apache.org/job/oodt-trunk/ws/workflow/pom.xml> to
/home/hudson/hudson/jobs/oodt-trunk/modules/org.apache.oodt$cas-workflow/builds/2012-10-27_00-30-30/archive/org.apache.oodt/cas-workflow/0.5-SNAPSHOT/cas-workflow-0.5-SNAPSHOT.pom
[JENKINS] Archiving <https://builds.apache.org/job/oodt-trunk/ws/workflow/target/cas-workflow-0.5-SNAPSHOT.jar>
to /home/hudson/hudson/jobs/oodt-trunk/modules/org.apache.oodt$cas-workflow/builds/2012-10-27_00-30-30/archive/org.apache.oodt/cas-workflow/0.5-SNAPSHOT/cas-workflow-0.5-SNAPSHOT.jar
[JENKINS] Archiving <https://builds.apache.org/job/oodt-trunk/ws/workflow/target/cas-workflow-0.5-SNAPSHOT-dist.tar.gz>
to /home/hudson/hudson/jobs/oodt-trunk/modules/org.apache.oodt$cas-workflow/builds/2012-10-27_00-30-30/archive/org.apache.oodt/cas-workflow/0.5-SNAPSHOT/cas-workflow-0.5-SNAPSHOT-dist.tar.gz
[JENKINS] Archiving <https://builds.apache.org/job/oodt-trunk/ws/workflow/target/cas-workflow-0.5-SNAPSHOT-dist.zip>
to /home/hudson/hudson/jobs/oodt-trunk/modules/org.apache.oodt$cas-workflow/builds/2012-10-27_00-30-30/archive/org.apache.oodt/cas-workflow/0.5-SNAPSHOT/cas-workflow-0.5-SNAPSHOT-dist.zip
[INFO] ------------------------------------------------------------------------
[INFO] Building Catalog and Archive Crawling Framework
[INFO]    task-segment: [install]
[INFO] ------------------------------------------------------------------------
[INFO] [remote-resources:process {execution: default}]
Downloading: http://repo1.maven.org/maven2/org/springframework/spring-beans/2.5.4/spring-beans-2.5.4.pom
2K downloaded  (spring-beans-2.5.4.pom)
Downloading: http://repo1.maven.org/maven2/org/springframework/spring-context/2.5.4/spring-context-2.5.4.pom
3K downloaded  (spring-context-2.5.4.pom)
Downloading: http://repo1.maven.org/maven2/commons-io/commons-io/1.1/commons-io-1.1.pom
5K downloaded  (commons-io-1.1.pom)
Downloading: http://repo1.maven.org/maven2/org/easymock/easymock/3.1/easymock-3.1.pom
5K downloaded  (easymock-3.1.pom)
Downloading: http://repo1.maven.org/maven2/org/easymock/easymock-parent/3.1/easymock-parent-3.1.pom
12K downloaded  (easymock-parent-3.1.pom)
Downloading: http://repo1.maven.org/maven2/cglib/cglib-nodep/2.2.2/cglib-nodep-2.2.2.pom
1K downloaded  (cglib-nodep-2.2.2.pom)
Downloading: http://repo1.maven.org/maven2/org/objenesis/objenesis/1.2/objenesis-1.2.pom
2K downloaded  (objenesis-1.2.pom)
Downloading: http://repo1.maven.org/maven2/org/objenesis/objenesis-parent/1.2/objenesis-parent-1.2.pom
10K downloaded  (objenesis-parent-1.2.pom)
Downloading: http://repo1.maven.org/maven2/org/easymock/easymock/3.1/easymock-3.1.jar
Downloading: http://repo1.maven.org/maven2/org/springframework/spring-beans/2.5.4/spring-beans-2.5.4.jar
Downloading: http://repo1.maven.org/maven2/cglib/cglib-nodep/2.2.2/cglib-nodep-2.2.2.jar
Downloading: http://repo1.maven.org/maven2/org/objenesis/objenesis/1.2/objenesis-1.2.jar
Downloading: http://repo1.maven.org/maven2/commons-io/commons-io/1.1/commons-io-1.1.jar
60K downloaded  (commons-io-1.1.jar)
109K downloaded  (easymock-3.1.jar)
319K downloaded  (cglib-nodep-2.2.2.jar)
35K downloaded  (objenesis-1.2.jar)
472K downloaded  (spring-beans-2.5.4.jar)
Downloading: http://repo1.maven.org/maven2/org/springframework/spring-context/2.5.4/spring-context-2.5.4.jar
458K downloaded  (spring-context-2.5.4.jar)
[INFO] [resources:resources {execution: default-resources}]
[INFO] Using 'UTF-8' encoding to copy filtered resources.
[INFO] Copying 4 resources to org/apache/oodt/cas/crawl
[INFO] Copying 3 resources
[INFO] [compiler:compile {execution: default-compile}]
[INFO] Compiling 41 source files to <https://builds.apache.org/job/oodt-trunk/ws/crawler/target/classes>
[INFO] [resources:testResources {execution: default-testResources}]
[INFO] Using 'UTF-8' encoding to copy filtered resources.
[INFO] skip non existing resourceDirectory <https://builds.apache.org/job/oodt-trunk/ws/crawler/src/test/resources>
[INFO] Copying 3 resources
[INFO] [compiler:testCompile {execution: default-testCompile}]
[INFO] Compiling 5 source files to <https://builds.apache.org/job/oodt-trunk/ws/crawler/target/test-classes>
[INFO] [surefire:test {execution: default-test}]
[INFO] Surefire report directory: <https://builds.apache.org/job/oodt-trunk/ws/crawler/target/surefire-reports>

-------------------------------------------------------
 T E S T S
-------------------------------------------------------
Running org.apache.oodt.cas.crawl.cli.option.handler.TestCrawlerBeansPropHandler
Tests run: 1, Failures: 0, Errors: 0, Skipped: 0, Time elapsed: 0.041 sec
Running org.apache.oodt.cas.crawl.option.TestBooleanOptions
Tests run: 1, Failures: 0, Errors: 0, Skipped: 0, Time elapsed: 0.046 sec
Running org.apache.oodt.cas.crawl.typedetection.TestMimeExtractorConfigReader
Tests run: 2, Failures: 0, Errors: 0, Skipped: 0, Time elapsed: 0.242 sec
Running org.apache.oodt.cas.crawl.TestProductCrawler
Tests run: 19, Failures: 0, Errors: 0, Skipped: 0, Time elapsed: 2.22 sec

Results :

Tests run: 23, Failures: 0, Errors: 0, Skipped: 0

[JENKINS] Recording test results
[INFO] [jar:jar {execution: default-jar}]
[INFO] Building jar: <https://builds.apache.org/job/oodt-trunk/ws/crawler/target/cas-crawler-0.5-SNAPSHOT.jar>
[INFO] Preparing javadoc:javadoc
[WARNING] Removing: javadoc from forked lifecycle, to prevent recursive invocation.
[INFO] No goals needed for project - skipping
[WARNING] DEPRECATED [aggregate]: since 2.5. Use the goals <code>javadoc:aggregate</code>
and <code>javadoc:test-aggregate</code> instead.
[INFO] [javadoc:javadoc {execution: attach-javadocs}]
[INFO] [assembly:single {execution: default}]
[INFO] Reading assembly descriptor: src/main/assembly/assembly.xml
[INFO] Processing DependencySet (output=lib)
[INFO] Building tar : <https://builds.apache.org/job/oodt-trunk/ws/crawler/target/cas-crawler-0.5-SNAPSHOT-dist.tar.gz>
[INFO] Processing DependencySet (output=lib)
[INFO] Building zip: <https://builds.apache.org/job/oodt-trunk/ws/crawler/target/cas-crawler-0.5-SNAPSHOT-dist.zip>
[INFO] [install:install {execution: default-install}]
[INFO] Installing <https://builds.apache.org/job/oodt-trunk/ws/crawler/target/cas-crawler-0.5-SNAPSHOT.jar>
to <https://builds.apache.org/job/oodt-trunk/ws/.repository/org/apache/oodt/cas-crawler/0.5-SNAPSHOT/cas-crawler-0.5-SNAPSHOT.jar>
[INFO] Installing <https://builds.apache.org/job/oodt-trunk/ws/crawler/target/cas-crawler-0.5-SNAPSHOT-dist.tar.gz>
to <https://builds.apache.org/job/oodt-trunk/ws/.repository/org/apache/oodt/cas-crawler/0.5-SNAPSHOT/cas-crawler-0.5-SNAPSHOT-dist.tar.gz>
[INFO] Installing <https://builds.apache.org/job/oodt-trunk/ws/crawler/target/cas-crawler-0.5-SNAPSHOT-dist.zip>
to <https://builds.apache.org/job/oodt-trunk/ws/.repository/org/apache/oodt/cas-crawler/0.5-SNAPSHOT/cas-crawler-0.5-SNAPSHOT-dist.zip>
[JENKINS] Archiving <https://builds.apache.org/job/oodt-trunk/ws/crawler/pom.xml> to
/home/hudson/hudson/jobs/oodt-trunk/modules/org.apache.oodt$cas-crawler/builds/2012-10-27_00-30-30/archive/org.apache.oodt/cas-crawler/0.5-SNAPSHOT/cas-crawler-0.5-SNAPSHOT.pom
[JENKINS] Archiving <https://builds.apache.org/job/oodt-trunk/ws/crawler/target/cas-crawler-0.5-SNAPSHOT.jar>
to /home/hudson/hudson/jobs/oodt-trunk/modules/org.apache.oodt$cas-crawler/builds/2012-10-27_00-30-30/archive/org.apache.oodt/cas-crawler/0.5-SNAPSHOT/cas-crawler-0.5-SNAPSHOT.jar
[JENKINS] Archiving <https://builds.apache.org/job/oodt-trunk/ws/crawler/target/cas-crawler-0.5-SNAPSHOT-dist.tar.gz>
to /home/hudson/hudson/jobs/oodt-trunk/modules/org.apache.oodt$cas-crawler/builds/2012-10-27_00-30-30/archive/org.apache.oodt/cas-crawler/0.5-SNAPSHOT/cas-crawler-0.5-SNAPSHOT-dist.tar.gz
[JENKINS] Archiving <https://builds.apache.org/job/oodt-trunk/ws/crawler/target/cas-crawler-0.5-SNAPSHOT-dist.zip>
to /home/hudson/hudson/jobs/oodt-trunk/modules/org.apache.oodt$cas-crawler/builds/2012-10-27_00-30-30/archive/org.apache.oodt/cas-crawler/0.5-SNAPSHOT/cas-crawler-0.5-SNAPSHOT-dist.zip
[INFO] ------------------------------------------------------------------------
[INFO] Building CAS Curation Interface
[INFO]    task-segment: [install]
[INFO] ------------------------------------------------------------------------
Downloading: http://repo1.maven.org/maven2/org/apache/maven/plugins/maven-war-plugin/2.1-alpha-2/maven-war-plugin-2.1-alpha-2.pom
7K downloaded  (maven-war-plugin-2.1-alpha-2.pom)
Downloading: http://repo1.maven.org/maven2/org/apache/maven/plugins/maven-plugins/11/maven-plugins-11.pom
10K downloaded  (maven-plugins-11.pom)
Downloading: http://repo1.maven.org/maven2/org/apache/maven/plugins/maven-war-plugin/2.1-alpha-2/maven-war-plugin-2.1-alpha-2.jar
72K downloaded  (maven-war-plugin-2.1-alpha-2.jar)
[INFO] [remote-resources:process {execution: default}]
Downloading: http://mirrors.ibiblio.org/pub/mirrors/maven2/commons-fileupload/commons-fileupload/1.2.1/commons-fileupload-1.2.1.pom
7K downloaded  (commons-fileupload-1.2.1.pom)
Downloading: http://mirrors.ibiblio.org/pub/mirrors/maven2/commons-collections/commons-collections/3.2.1/commons-collections-3.2.1.pom
12K downloaded  (commons-collections-3.2.1.pom)
Downloading: http://mirrors.ibiblio.org/pub/mirrors/maven2/net/sf/json-lib/json-lib/2.3/json-lib-2.3.pom
13K downloaded  (json-lib-2.3.pom)
[WARNING] *** CHECKSUM FAILED - Error retrieving checksum file for net/sf/json-lib/json-lib/2.3/json-lib-2.3.pom
- IGNORING
Downloading: http://mirrors.ibiblio.org/pub/mirrors/maven2/commons-beanutils/commons-beanutils/1.8.0/commons-beanutils-1.8.0.pom
10K downloaded  (commons-beanutils-1.8.0.pom)
[WARNING] *** CHECKSUM FAILED - Invalid checksum file - RETRYING
Downloading: http://mirrors.ibiblio.org/pub/mirrors/maven2/commons-beanutils/commons-beanutils/1.8.0/commons-beanutils-1.8.0.pom
10K downloaded  (commons-beanutils-1.8.0.pom)
[WARNING] *** CHECKSUM FAILED - Invalid checksum file - IGNORING
Downloading: http://mirrors.ibiblio.org/pub/mirrors/maven2/net/sf/ezmorph/ezmorph/1.0.6/ezmorph-1.0.6.pom
6K downloaded  (ezmorph-1.0.6.pom)
[WARNING] *** CHECKSUM FAILED - Invalid checksum file - RETRYING
Downloading: http://mirrors.ibiblio.org/pub/mirrors/maven2/net/sf/ezmorph/ezmorph/1.0.6/ezmorph-1.0.6.pom
6K downloaded  (ezmorph-1.0.6.pom)
[WARNING] *** CHECKSUM FAILED - Invalid checksum file - IGNORING
Downloading: http://mirrors.ibiblio.org/pub/mirrors/maven2/org/apache/cxf/cxf-rt-frontend-jaxrs/2.3.1/cxf-rt-frontend-jaxrs-2.3.1.pom
6K downloaded  (cxf-rt-frontend-jaxrs-2.3.1.pom)
[WARNING] *** CHECKSUM FAILED - Invalid checksum file - RETRYING
Downloading: http://mirrors.ibiblio.org/pub/mirrors/maven2/org/apache/cxf/cxf-rt-frontend-jaxrs/2.3.1/cxf-rt-frontend-jaxrs-2.3.1.pom
6K downloaded  (cxf-rt-frontend-jaxrs-2.3.1.pom)
[WARNING] *** CHECKSUM FAILED - Invalid checksum file - IGNORING
Downloading: http://mirrors.ibiblio.org/pub/mirrors/maven2/org/apache/cxf/cxf-parent/2.3.1/cxf-parent-2.3.1.pom
65K downloaded  (cxf-parent-2.3.1.pom)
[WARNING] Unable to get resource 'org.apache.cxf:cxf-parent:pom:2.3.1' from repository ibiblio
(http://mirrors.ibiblio.org/pub/mirrors/maven2): Authorization failed: Access denied to: http://mirrors.ibiblio.org/pub/mirrors/maven2/org/apache/cxf/cxf-parent/2.3.1/cxf-parent-2.3.1.pom.sha1
Downloading: http://download.java.net/maven/2//org/apache/cxf/cxf-parent/2.3.1/cxf-parent-2.3.1.pom
[INFO] Unable to find resource 'org.apache.cxf:cxf-parent:pom:2.3.1' in repository maven2-repository.dev.java.net
(http://download.java.net/maven/2/)
Downloading: http://repo1.maven.org/maven2/org/apache/cxf/cxf-parent/2.3.1/cxf-parent-2.3.1.pom
[WARNING] Unable to get resource 'org.apache.cxf:cxf-parent:pom:2.3.1' from repository central
(http://repo1.maven.org/maven2): GET request of: org/apache/cxf/cxf-parent/2.3.1/cxf-parent-2.3.1.pom
from central failed
Oct 27, 2012 12:50:29 AM hudson.maven.ExecutedMojo <init>
WARNING: Failed to calculate digest for org.apache.maven.plugin.resources.remote.ProcessRemoteResourcesMojo
java.io.FileNotFoundException: <https://builds.apache.org/job/oodt-trunk/ws/.repository/org/apache/maven/plugins/maven-remote-resources-plugin/1.1/maven-remote-resources-plugin-1.1.jar>
(Too many open files)
	at java.io.FileInputStream.open(Native Method)
	at java.io.FileInputStream.<init>(FileInputStream.java:120)
	at hudson.maven.ExecutedMojo.<init>(ExecutedMojo.java:104)
	at hudson.maven.Maven2Builder.postExecute(Maven2Builder.java:151)
	at hudson.maven.MavenBuilder$Adapter.postExecute(MavenBuilder.java:310)
	at hudson.maven.agent.PluginManagerInterceptor$1MojoIntercepterImpl.callPost(PluginManagerInterceptor.java:170)
	at hudson.maven.agent.PluginManagerInterceptor.executeMojo(PluginManagerInterceptor.java:185)
	at org.apache.maven.lifecycle.DefaultLifecycleExecutor.executeGoals(DefaultLifecycleExecutor.java:694)
	at org.apache.maven.lifecycle.DefaultLifecycleExecutor.executeGoalWithLifecycle(DefaultLifecycleExecutor.java:556)
	at org.apache.maven.lifecycle.DefaultLifecycleExecutor.executeGoal(DefaultLifecycleExecutor.java:535)
	at org.apache.maven.lifecycle.DefaultLifecycleExecutor.executeGoalAndHandleFailures(DefaultLifecycleExecutor.java:387)
	at org.apache.maven.lifecycle.DefaultLifecycleExecutor.executeTaskSegments(DefaultLifecycleExecutor.java:348)
	at org.apache.maven.lifecycle.DefaultLifecycleExecutor.execute(DefaultLifecycleExecutor.java:180)
	at org.apache.maven.lifecycle.LifecycleExecutorInterceptor.execute(LifecycleExecutorInterceptor.java:65)
	at org.apache.maven.DefaultMaven.doExecute(DefaultMaven.java:328)
	at org.apache.maven.DefaultMaven.execute(DefaultMaven.java:138)
	at org.apache.maven.cli.MavenCli.main(MavenCli.java:362)
	at sun.reflect.NativeMethodAccessorImpl.invoke0(Native Method)
	at sun.reflect.NativeMethodAccessorImpl.invoke(NativeMethodAccessorImpl.java:39)
	at sun.reflect.DelegatingMethodAccessorImpl.invoke(DelegatingMethodAccessorImpl.java:25)
	at java.lang.reflect.Method.invoke(Method.java:597)
	at org.codehaus.classworlds.Launcher.launchEnhanced(Launcher.java:315)
	at org.codehaus.classworlds.Launcher.launch(Launcher.java:255)
	at hudson.maven.agent.Main.launch(Main.java:185)
	at hudson.maven.MavenBuilder.call(MavenBuilder.java:151)
	at hudson.maven.Maven2Builder.call(Maven2Builder.java:77)
	at hudson.maven.Maven2Builder.call(Maven2Builder.java:53)
	at hudson.remoting.UserRequest.perform(UserRequest.java:118)
	at hudson.remoting.UserRequest.perform(UserRequest.java:48)
	at hudson.remoting.Request$2.run(Request.java:326)
	at hudson.remoting.InterceptingExecutorService$1.call(InterceptingExecutorService.java:72)
	at java.util.concurrent.FutureTask$Sync.innerRun(FutureTask.java:303)
	at java.util.concurrent.FutureTask.run(FutureTask.java:138)
	at java.util.concurrent.ThreadPoolExecutor$Worker.runTask(ThreadPoolExecutor.java:886)
	at java.util.concurrent.ThreadPoolExecutor$Worker.run(ThreadPoolExecutor.java:908)
	at java.lang.Thread.run(Thread.java:662)
[INFO] ------------------------------------------------------------------------
[ERROR] BUILD FAILURE
[INFO] ------------------------------------------------------------------------
[INFO] <https://builds.apache.org/job/oodt-trunk/ws/curator/pom.xml> (Too many open
files)
[INFO] ------------------------------------------------------------------------
[INFO] For more information, run Maven with the -e switch
[INFO] ------------------------------------------------------------------------
[INFO] Total time: 19 minutes 27 seconds
[INFO] Finished at: Sat Oct 27 00:50:29 UTC 2012
[INFO] Final Memory: 99M/393M
[INFO] ------------------------------------------------------------------------
channel stopped

Mime
View raw message