oodt-dev mailing list archives

Site index · List index
Message view « Date » · « Thread »
Top « Date » · « Thread »
From Apache Jenkins Server <jenk...@builds.apache.org>
Subject Build failed in Jenkins: oodt-trunk #640
Date Sun, 16 Sep 2012 19:58:32 GMT
See <https://builds.apache.org/job/oodt-trunk/640/changes>

Changes:

[mattmann] - OODT-495 WIP: test Workflow (hello world/goodbye world) now runs to completion!

------------------------------------------
[...truncated 6261 lines...]
[INFO] Copying 3 resources
[INFO] [compiler:testCompile {execution: default-testCompile}]
[INFO] Compiling 1 source file to <https://builds.apache.org/job/oodt-trunk/ws/catalog/target/test-classes>
[INFO] [surefire:test {execution: default-test}]
[INFO] Surefire report directory: <https://builds.apache.org/job/oodt-trunk/ws/catalog/target/surefire-reports>

-------------------------------------------------------
 T E S T S
-------------------------------------------------------
Running org.apache.oodt.cas.catalog.system.impl.TestCatalogServiceLocal
Sep 16, 2012 7:55:11 PM org.apache.oodt.cas.catalog.system.impl.CatalogServiceLocal setIngestMapper
INFO: Using IngestMapper 'org.apache.oodt.cas.catalog.mapping.InMemoryIngestMapper'
Sep 16, 2012 7:55:11 PM org.apache.oodt.cas.catalog.system.impl.CatalogServiceLocal setCatalogRepository
INFO: Using CatalogRepository 'org.apache.oodt.cas.catalog.repository.MemoryBasedCatalogRepository'
Sep 16, 2012 7:55:11 PM org.apache.oodt.cas.catalog.system.impl.CatalogServiceLocal setCatalogRepository
INFO: Loading Catalogs from CatalogRepository . . .
Sep 16, 2012 7:55:11 PM org.apache.oodt.cas.catalog.system.impl.CatalogServiceLocal setCatalogRepository
INFO: Loaded Catalogs: '[]'
Sep 16, 2012 7:55:11 PM org.apache.oodt.cas.catalog.system.impl.CatalogServiceLocal ingest
INFO: Performing ingest for TransactionId '04b3bd5e-6162-4acb-8709-77598b8dd175' to catalog
'TestCatalog2'
Sep 16, 2012 7:55:11 PM org.apache.oodt.cas.catalog.system.Catalog getTermBuckets
WARNING: Catalog 'TestCatalog2' has no dictionaries defined, attempting to send all Metadata
in a default TermBucket
Sep 16, 2012 7:55:11 PM org.apache.oodt.cas.catalog.system.Catalog ingest
INFO: Catalog 'TestCatalog2' attemping ingest metadata
Sep 16, 2012 7:55:11 PM org.apache.oodt.cas.catalog.system.impl.CatalogServiceLocal ingest
INFO: Successfully ingested metadata -- Indexing TransactionId information for ingest (CatalogService
TransactionId = '04b3bd5e-6162-4acb-8709-77598b8dd175', Catalog TransactionId = 'ea90f3c0-f3f9-4243-8777-ce13592aeebc',
catalog = 'TestCatalog2')
Sep 16, 2012 7:55:11 PM org.apache.oodt.cas.catalog.system.impl.CatalogServiceLocal ingest
INFO: Performing ingest for TransactionId '04b3bd5e-6162-4acb-8709-77598b8dd175' to catalog
'TestCatalog1'
Sep 16, 2012 7:55:11 PM org.apache.oodt.cas.catalog.system.Catalog getTermBuckets
WARNING: Catalog 'TestCatalog1' has no dictionaries defined, attempting to send all Metadata
in a default TermBucket
Sep 16, 2012 7:55:11 PM org.apache.oodt.cas.catalog.system.Catalog ingest
INFO: Catalog 'TestCatalog1' attemping ingest metadata
Sep 16, 2012 7:55:11 PM org.apache.oodt.cas.catalog.system.impl.CatalogServiceLocal ingest
INFO: Successfully ingested metadata -- Indexing TransactionId information for ingest (CatalogService
TransactionId = '04b3bd5e-6162-4acb-8709-77598b8dd175', Catalog TransactionId = 'd286b77e-609d-4dd6-bd5d-629b9d39497b',
catalog = 'TestCatalog1')
Sep 16, 2012 7:55:11 PM org.apache.oodt.cas.catalog.system.impl.CatalogServiceLocal ingest
INFO: TransactionId '04b3bd5e-6162-4acb-8709-77598b8dd175' is an existing TransactionId, switching
to update mode
Sep 16, 2012 7:55:11 PM org.apache.oodt.cas.catalog.system.Catalog getTermBuckets
WARNING: Catalog 'TestCatalog2' has no dictionaries defined, attempting to send all Metadata
in a default TermBucket
Sep 16, 2012 7:55:11 PM org.apache.oodt.cas.catalog.system.Catalog update
INFO: Catalog 'TestCatalog2' attemping update metadata for catalog TransactionId [id = 'ea90f3c0-f3f9-4243-8777-ce13592aeebc']
Sep 16, 2012 7:55:11 PM org.apache.oodt.cas.catalog.system.impl.CatalogServiceLocal ingest
INFO: Successfully updated metadata to catalog 'TestCatalog2' for TransactionId '04b3bd5e-6162-4acb-8709-77598b8dd175'
Sep 16, 2012 7:55:11 PM org.apache.oodt.cas.catalog.system.Catalog getTermBuckets
WARNING: Catalog 'TestCatalog1' has no dictionaries defined, attempting to send all Metadata
in a default TermBucket
Sep 16, 2012 7:55:11 PM org.apache.oodt.cas.catalog.system.Catalog update
INFO: Catalog 'TestCatalog1' attemping update metadata for catalog TransactionId [id = 'd286b77e-609d-4dd6-bd5d-629b9d39497b']
Sep 16, 2012 7:55:11 PM org.apache.oodt.cas.catalog.system.impl.CatalogServiceLocal ingest
INFO: Successfully updated metadata to catalog 'TestCatalog1' for TransactionId '04b3bd5e-6162-4acb-8709-77598b8dd175'
Sep 16, 2012 7:55:11 PM org.apache.oodt.cas.catalog.system.impl.CatalogServiceLocal _query
INFO: Recieved query '({null} testkey1 == [testval1])'
Sep 16, 2012 7:55:11 PM org.apache.oodt.cas.catalog.system.impl.CatalogServiceLocal _query
INFO: Simplified query to '({null} testkey1 == [testval1])' -- routing query to catalogs
Sep 16, 2012 7:55:11 PM org.apache.oodt.cas.catalog.system.impl.CatalogServiceLocal _query
INFO: Restricting query to understood terms for Catalog 'TestCatalog2'
Sep 16, 2012 7:55:11 PM org.apache.oodt.cas.catalog.system.impl.CatalogServiceLocal _query
INFO: Querying Catalog 'TestCatalog2' with query '({null} testkey1 == [testval1])'
Sep 16, 2012 7:55:11 PM org.apache.oodt.cas.catalog.struct.impl.index.DataSourceIndex query
INFO: Performing Query: SELECT DISTINCT transaction_id,transaction_date FROM transactions
WHERE transaction_id IN (SELECT DISTINCT transaction_id FROM transaction_terms WHERE  term_name
= 'testkey1' AND (term_value = 'testval1'))
Sep 16, 2012 7:55:11 PM org.apache.oodt.cas.catalog.system.impl.CatalogServiceLocal _query
INFO: Restricting query to understood terms for Catalog 'TestCatalog1'
Sep 16, 2012 7:55:11 PM org.apache.oodt.cas.catalog.system.impl.CatalogServiceLocal _query
INFO: Querying Catalog 'TestCatalog1' with query '({null} testkey1 == [testval1])'
Sep 16, 2012 7:55:11 PM org.apache.oodt.cas.catalog.struct.impl.index.DataSourceIndex query
INFO: Performing Query: SELECT DISTINCT transaction_id,transaction_date FROM transactions
WHERE transaction_id IN (SELECT DISTINCT transaction_id FROM transaction_terms WHERE  term_name
= 'testkey1' AND (term_value = 'testval1'))
Sep 16, 2012 7:55:11 PM org.apache.oodt.cas.catalog.system.impl.CatalogServiceLocal _query
INFO: Sorting Query Results . . . 
Sep 16, 2012 7:55:11 PM org.apache.oodt.cas.catalog.system.impl.CatalogServiceLocal _query
INFO: Query returned 1 results
Sep 16, 2012 7:55:11 PM org.apache.oodt.cas.catalog.system.impl.CatalogServiceLocal _query
INFO: Recieved query '({null} testkey1 == [testval1])'
Sep 16, 2012 7:55:11 PM org.apache.oodt.cas.catalog.system.impl.CatalogServiceLocal _query
INFO: Simplified query to '({null} testkey1 == [testval1])' -- routing query to catalogs
Sep 16, 2012 7:55:11 PM org.apache.oodt.cas.catalog.system.impl.CatalogServiceLocal _query
INFO: Restricting query to understood terms for Catalog 'TestCatalog2'
Sep 16, 2012 7:55:11 PM org.apache.oodt.cas.catalog.system.impl.CatalogServiceLocal _query
INFO: Querying Catalog 'TestCatalog2' with query '({null} testkey1 == [testval1])'
Sep 16, 2012 7:55:11 PM org.apache.oodt.cas.catalog.struct.impl.index.DataSourceIndex query
INFO: Performing Query: SELECT DISTINCT transaction_id,transaction_date FROM transactions
WHERE transaction_id IN (SELECT DISTINCT transaction_id FROM transaction_terms WHERE  term_name
= 'testkey1' AND (term_value = 'testval1'))
Sep 16, 2012 7:55:11 PM org.apache.oodt.cas.catalog.system.impl.CatalogServiceLocal _query
INFO: Restricting query to understood terms for Catalog 'TestCatalog1'
Sep 16, 2012 7:55:11 PM org.apache.oodt.cas.catalog.system.impl.CatalogServiceLocal _query
INFO: Querying Catalog 'TestCatalog1' with query '({null} testkey1 == [testval1])'
Sep 16, 2012 7:55:11 PM org.apache.oodt.cas.catalog.struct.impl.index.DataSourceIndex query
INFO: Performing Query: SELECT DISTINCT transaction_id,transaction_date FROM transactions
WHERE transaction_id IN (SELECT DISTINCT transaction_id FROM transaction_terms WHERE  term_name
= 'testkey1' AND (term_value = 'testval1'))
Sep 16, 2012 7:55:11 PM org.apache.oodt.cas.catalog.system.impl.CatalogServiceLocal _query
INFO: Sorting Query Results . . . 
Sep 16, 2012 7:55:11 PM org.apache.oodt.cas.catalog.system.impl.CatalogServiceLocal _query
INFO: Query returned 1 results
Sep 16, 2012 7:55:11 PM org.apache.oodt.cas.catalog.system.impl.CatalogServiceLocal _query
INFO: Recieved query '({null} testkey1 == [testval1])'
Sep 16, 2012 7:55:11 PM org.apache.oodt.cas.catalog.system.impl.CatalogServiceLocal _query
INFO: Simplified query to '({null} testkey1 == [testval1])' -- routing query to catalogs
Sep 16, 2012 7:55:11 PM org.apache.oodt.cas.catalog.system.impl.CatalogServiceLocal _query
INFO: Restricting query to understood terms for Catalog 'TestCatalog1'
Sep 16, 2012 7:55:11 PM org.apache.oodt.cas.catalog.system.impl.CatalogServiceLocal _query
INFO: Querying Catalog 'TestCatalog1' with query '({null} testkey1 == [testval1])'
Sep 16, 2012 7:55:11 PM org.apache.oodt.cas.catalog.struct.impl.index.DataSourceIndex query
INFO: Performing Query: SELECT DISTINCT transaction_id,transaction_date FROM transactions
WHERE transaction_id IN (SELECT DISTINCT transaction_id FROM transaction_terms WHERE  term_name
= 'testkey1' AND (term_value = 'testval1'))
Sep 16, 2012 7:55:11 PM org.apache.oodt.cas.catalog.system.impl.CatalogServiceLocal _query
INFO: Sorting Query Results . . . 
Sep 16, 2012 7:55:11 PM org.apache.oodt.cas.catalog.system.impl.CatalogServiceLocal _query
INFO: Query returned 1 results
Sep 16, 2012 7:55:11 PM org.apache.oodt.cas.catalog.system.impl.CatalogServiceLocal delete
INFO: Deleting all records of TransactionId from catalog 'TestCatalog2'
Sep 16, 2012 7:55:11 PM org.apache.oodt.cas.catalog.system.Catalog delete
INFO: Catalog 'TestCatalog2' attemping to delete all TermBuckets associated with catalog TransactionId
[id = 'ea90f3c0-f3f9-4243-8777-ce13592aeebc']
Sep 16, 2012 7:55:11 PM org.apache.oodt.cas.catalog.system.impl.CatalogServiceLocal delete
INFO: Successfully deleted metadata from catalog 'TestCatalog2' for TransactionId [id = 04b3bd5e-6162-4acb-8709-77598b8dd175]
Sep 16, 2012 7:55:11 PM org.apache.oodt.cas.catalog.system.impl.CatalogServiceLocal delete
INFO: Deleting all records of TransactionId from catalog 'TestCatalog1'
Sep 16, 2012 7:55:11 PM org.apache.oodt.cas.catalog.system.Catalog delete
INFO: Catalog 'TestCatalog1' attemping to delete all TermBuckets associated with catalog TransactionId
[id = 'd286b77e-609d-4dd6-bd5d-629b9d39497b']
Sep 16, 2012 7:55:11 PM org.apache.oodt.cas.catalog.system.impl.CatalogServiceLocal delete
INFO: Successfully deleted metadata from catalog 'TestCatalog1' for TransactionId [id = 04b3bd5e-6162-4acb-8709-77598b8dd175]
Tests run: 1, Failures: 0, Errors: 0, Skipped: 0, Time elapsed: 0.42 sec

Results :

Tests run: 1, Failures: 0, Errors: 0, Skipped: 0

[JENKINS] Recording test results
[INFO] [jar:jar {execution: default-jar}]
[INFO] Building jar: <https://builds.apache.org/job/oodt-trunk/ws/catalog/target/cas-catalog-0.5-SNAPSHOT.jar>
[INFO] Preparing javadoc:javadoc
[WARNING] Removing: javadoc from forked lifecycle, to prevent recursive invocation.
[INFO] No goals needed for project - skipping
[WARNING] DEPRECATED [aggregate]: since 2.5. Use the goals <code>javadoc:aggregate</code>
and <code>javadoc:test-aggregate</code> instead.
[INFO] [javadoc:javadoc {execution: attach-javadocs}]
[INFO] [assembly:single {execution: default}]
[INFO] Reading assembly descriptor: src/main/assembly/assembly.xml
[INFO] Processing DependencySet (output=lib)
[INFO] Building tar : <https://builds.apache.org/job/oodt-trunk/ws/catalog/target/cas-catalog-0.5-SNAPSHOT-dist.tar.gz>
[INFO] Processing DependencySet (output=lib)
[INFO] Building zip: <https://builds.apache.org/job/oodt-trunk/ws/catalog/target/cas-catalog-0.5-SNAPSHOT-dist.zip>
[INFO] [install:install {execution: default-install}]
[INFO] Installing <https://builds.apache.org/job/oodt-trunk/ws/catalog/target/cas-catalog-0.5-SNAPSHOT.jar>
to <https://builds.apache.org/job/oodt-trunk/ws/.repository/org/apache/oodt/cas-catalog/0.5-SNAPSHOT/cas-catalog-0.5-SNAPSHOT.jar>
[INFO] Installing <https://builds.apache.org/job/oodt-trunk/ws/catalog/target/cas-catalog-0.5-SNAPSHOT-dist.tar.gz>
to <https://builds.apache.org/job/oodt-trunk/ws/.repository/org/apache/oodt/cas-catalog/0.5-SNAPSHOT/cas-catalog-0.5-SNAPSHOT-dist.tar.gz>
[INFO] Installing <https://builds.apache.org/job/oodt-trunk/ws/catalog/target/cas-catalog-0.5-SNAPSHOT-dist.zip>
to <https://builds.apache.org/job/oodt-trunk/ws/.repository/org/apache/oodt/cas-catalog/0.5-SNAPSHOT/cas-catalog-0.5-SNAPSHOT-dist.zip>
[JENKINS] Archiving <https://builds.apache.org/job/oodt-trunk/ws/catalog/pom.xml> to
/home/hudson/hudson/jobs/oodt-trunk/modules/org.apache.oodt$cas-catalog/builds/2012-09-16_19-45-07/archive/org.apache.oodt/cas-catalog/0.5-SNAPSHOT/cas-catalog-0.5-SNAPSHOT.pom
[JENKINS] Archiving <https://builds.apache.org/job/oodt-trunk/ws/catalog/target/cas-catalog-0.5-SNAPSHOT.jar>
to /home/hudson/hudson/jobs/oodt-trunk/modules/org.apache.oodt$cas-catalog/builds/2012-09-16_19-45-07/archive/org.apache.oodt/cas-catalog/0.5-SNAPSHOT/cas-catalog-0.5-SNAPSHOT.jar
[JENKINS] Archiving <https://builds.apache.org/job/oodt-trunk/ws/catalog/target/cas-catalog-0.5-SNAPSHOT-dist.tar.gz>
to /home/hudson/hudson/jobs/oodt-trunk/modules/org.apache.oodt$cas-catalog/builds/2012-09-16_19-45-07/archive/org.apache.oodt/cas-catalog/0.5-SNAPSHOT/cas-catalog-0.5-SNAPSHOT-dist.tar.gz
[JENKINS] Archiving <https://builds.apache.org/job/oodt-trunk/ws/catalog/target/cas-catalog-0.5-SNAPSHOT-dist.zip>
to /home/hudson/hudson/jobs/oodt-trunk/modules/org.apache.oodt$cas-catalog/builds/2012-09-16_19-45-07/archive/org.apache.oodt/cas-catalog/0.5-SNAPSHOT/cas-catalog-0.5-SNAPSHOT-dist.zip
[INFO] ------------------------------------------------------------------------
[INFO] Building Catalog and Archive Resource Management Component
[INFO]    task-segment: [install]
[INFO] ------------------------------------------------------------------------
[INFO] [remote-resources:process {execution: default}]
[INFO] [resources:resources {execution: default-resources}]
[INFO] Using 'UTF-8' encoding to copy filtered resources.
[INFO] Copying 9 resources
[INFO] Copying 3 resources
[INFO] [compiler:compile {execution: default-compile}]
[INFO] Compiling 84 source files to <https://builds.apache.org/job/oodt-trunk/ws/resource/target/classes>
[INFO] [resources:testResources {execution: default-testResources}]
[INFO] Using 'UTF-8' encoding to copy filtered resources.
[INFO] skip non existing resourceDirectory <https://builds.apache.org/job/oodt-trunk/ws/resource/src/test/resources>
[INFO] Copying 3 resources
[INFO] [compiler:testCompile {execution: default-testCompile}]
[INFO] Compiling 9 source files to <https://builds.apache.org/job/oodt-trunk/ws/resource/target/test-classes>
[INFO] [surefire:test {execution: default-test}]
[INFO] Surefire report directory: <https://builds.apache.org/job/oodt-trunk/ws/resource/target/surefire-reports>

-------------------------------------------------------
 T E S T S
-------------------------------------------------------
Running org.apache.oodt.cas.resource.queuerepo.TestXmlQueueRepository
Tests run: 1, Failures: 0, Errors: 0, Skipped: 0, Time elapsed: 0.191 sec
Running org.apache.oodt.cas.resource.cli.TestResourceCli
Tests run: 17, Failures: 0, Errors: 0, Skipped: 0, Time elapsed: 4.218 sec
Running org.apache.oodt.cas.resource.jobqueue.TestJobStack
Tests run: 5, Failures: 0, Errors: 0, Skipped: 0, Time elapsed: 0.054 sec
Running org.apache.oodt.cas.resource.system.TestXmlRpcResourceManager
Tests run: 1, Failures: 0, Errors: 0, Skipped: 0, Time elapsed: 0.531 sec
Running org.apache.oodt.cas.resource.monitor.TestAssignmentMonitor
Tests run: 4, Failures: 0, Errors: 0, Skipped: 0, Time elapsed: 0.203 sec
Running org.apache.oodt.cas.resource.util.TestUlimit
Tests run: 2, Failures: 0, Errors: 0, Skipped: 0, Time elapsed: 0.045 sec

Results :

Tests run: 30, Failures: 0, Errors: 0, Skipped: 0

[JENKINS] Recording test results
[INFO] [jar:jar {execution: default-jar}]
[INFO] Building jar: <https://builds.apache.org/job/oodt-trunk/ws/resource/target/cas-resource-0.5-SNAPSHOT.jar>
[INFO] Preparing javadoc:javadoc
[WARNING] Removing: javadoc from forked lifecycle, to prevent recursive invocation.
[INFO] No goals needed for project - skipping
[WARNING] DEPRECATED [aggregate]: since 2.5. Use the goals <code>javadoc:aggregate</code>
and <code>javadoc:test-aggregate</code> instead.
[INFO] [javadoc:javadoc {execution: attach-javadocs}]
[INFO] [assembly:single {execution: default}]
[INFO] Reading assembly descriptor: src/main/assembly/assembly.xml
[INFO] Processing DependencySet (output=lib)
[INFO] Building tar : <https://builds.apache.org/job/oodt-trunk/ws/resource/target/cas-resource-0.5-SNAPSHOT-dist.tar.gz>
[INFO] Processing DependencySet (output=lib)
[INFO] Building zip: <https://builds.apache.org/job/oodt-trunk/ws/resource/target/cas-resource-0.5-SNAPSHOT-dist.zip>
[INFO] [install:install {execution: default-install}]
[INFO] Installing <https://builds.apache.org/job/oodt-trunk/ws/resource/target/cas-resource-0.5-SNAPSHOT.jar>
to <https://builds.apache.org/job/oodt-trunk/ws/.repository/org/apache/oodt/cas-resource/0.5-SNAPSHOT/cas-resource-0.5-SNAPSHOT.jar>
[INFO] Installing <https://builds.apache.org/job/oodt-trunk/ws/resource/target/cas-resource-0.5-SNAPSHOT-dist.tar.gz>
to <https://builds.apache.org/job/oodt-trunk/ws/.repository/org/apache/oodt/cas-resource/0.5-SNAPSHOT/cas-resource-0.5-SNAPSHOT-dist.tar.gz>
[INFO] Installing <https://builds.apache.org/job/oodt-trunk/ws/resource/target/cas-resource-0.5-SNAPSHOT-dist.zip>
to <https://builds.apache.org/job/oodt-trunk/ws/.repository/org/apache/oodt/cas-resource/0.5-SNAPSHOT/cas-resource-0.5-SNAPSHOT-dist.zip>
[JENKINS] Archiving <https://builds.apache.org/job/oodt-trunk/ws/resource/pom.xml> to
/home/hudson/hudson/jobs/oodt-trunk/modules/org.apache.oodt$cas-resource/builds/2012-09-16_19-45-07/archive/org.apache.oodt/cas-resource/0.5-SNAPSHOT/cas-resource-0.5-SNAPSHOT.pom
[JENKINS] Archiving <https://builds.apache.org/job/oodt-trunk/ws/resource/target/cas-resource-0.5-SNAPSHOT.jar>
to /home/hudson/hudson/jobs/oodt-trunk/modules/org.apache.oodt$cas-resource/builds/2012-09-16_19-45-07/archive/org.apache.oodt/cas-resource/0.5-SNAPSHOT/cas-resource-0.5-SNAPSHOT.jar
[JENKINS] Archiving <https://builds.apache.org/job/oodt-trunk/ws/resource/target/cas-resource-0.5-SNAPSHOT-dist.tar.gz>
to /home/hudson/hudson/jobs/oodt-trunk/modules/org.apache.oodt$cas-resource/builds/2012-09-16_19-45-07/archive/org.apache.oodt/cas-resource/0.5-SNAPSHOT/cas-resource-0.5-SNAPSHOT-dist.tar.gz
[JENKINS] Archiving <https://builds.apache.org/job/oodt-trunk/ws/resource/target/cas-resource-0.5-SNAPSHOT-dist.zip>
to /home/hudson/hudson/jobs/oodt-trunk/modules/org.apache.oodt$cas-resource/builds/2012-09-16_19-45-07/archive/org.apache.oodt/cas-resource/0.5-SNAPSHOT/cas-resource-0.5-SNAPSHOT-dist.zip
[INFO] ------------------------------------------------------------------------
[INFO] Building Catalog and Archive Workflow Management Component
[INFO]    task-segment: [install]
[INFO] ------------------------------------------------------------------------
[INFO] [remote-resources:process {execution: default}]
Downloading: http://repo1.maven.org/maven2/concurrent/concurrent/1.3.4/concurrent-1.3.4.pom
1K downloaded  (concurrent-1.3.4.pom)
Downloading: http://repo1.maven.org/maven2/joda-time/joda-time/2.1/joda-time-2.1.pom
15K downloaded  (joda-time-2.1.pom)
Downloading: http://repo1.maven.org/maven2/concurrent/concurrent/1.3.4/concurrent-1.3.4.jar
Downloading: http://repo1.maven.org/maven2/joda-time/joda-time/2.1/joda-time-2.1.jar
557K downloaded  (joda-time-2.1.jar)
184K downloaded  (concurrent-1.3.4.jar)
[INFO] [resources:resources {execution: default-resources}]
[INFO] Using 'UTF-8' encoding to copy filtered resources.
[INFO] Copying 26 resources
[INFO] Copying 3 resources
[INFO] [compiler:compile {execution: default-compile}]
[INFO] Compiling 119 source files to <https://builds.apache.org/job/oodt-trunk/ws/workflow/target/classes>
[INFO] -------------------------------------------------------------
[ERROR] COMPILATION ERROR : 
[INFO] -------------------------------------------------------------
[ERROR] <https://builds.apache.org/job/oodt-trunk/ws/workflow/src/main/java/org/apache/oodt/cas/workflow/lifecycle/WorkflowLifecycle.java>:[268,31]
cannot find symbol
symbol  : method getSubStates()
location: class org.apache.oodt.cas.workflow.lifecycle.WorkflowState
[INFO] 1 error
[INFO] -------------------------------------------------------------
[JENKINS] Archiving <https://builds.apache.org/job/oodt-trunk/ws/workflow/pom.xml> to
/home/hudson/hudson/jobs/oodt-trunk/modules/org.apache.oodt$cas-workflow/builds/2012-09-16_19-45-07/archive/org.apache.oodt/cas-workflow/0.5-SNAPSHOT/cas-workflow-0.5-SNAPSHOT.pom
[INFO] ------------------------------------------------------------------------
[ERROR] BUILD FAILURE
[INFO] ------------------------------------------------------------------------
[INFO] Compilation failure
<https://builds.apache.org/job/oodt-trunk/ws/workflow/src/main/java/org/apache/oodt/cas/workflow/lifecycle/WorkflowLifecycle.java>:[268,31]
cannot find symbol
symbol  : method getSubStates()
location: class org.apache.oodt.cas.workflow.lifecycle.WorkflowState

[INFO] ------------------------------------------------------------------------
[INFO] For more information, run Maven with the -e switch
[INFO] ------------------------------------------------------------------------
[INFO] Total time: 12 minutes 56 seconds
[INFO] Finished at: Sun Sep 16 19:58:29 UTC 2012
[INFO] Final Memory: 84M/457M
[INFO] ------------------------------------------------------------------------
Sending e-mails to: dev@oodt.apache.org
channel stopped

Mime
View raw message