oodt-dev mailing list archives

Site index · List index
Message view « Date » · « Thread »
Top « Date » · « Thread »
From Apache Jenkins Server <jenk...@builds.apache.org>
Subject Build failed in Jenkins: oodt-trunk » Catalog and Archive Workflow Management Component #643
Date Mon, 17 Sep 2012 15:56:26 GMT
See <https://builds.apache.org/job/oodt-trunk/org.apache.oodt$cas-workflow/643/changes>

Changes:

[mattmann] - fix for OODT-505: Remove synchronous Runner

------------------------------------------
[INFO] ------------------------------------------------------------------------
[INFO] Building Catalog and Archive Workflow Management Component
[INFO]    task-segment: [install]
[INFO] ------------------------------------------------------------------------
[INFO] [remote-resources:process {execution: default}]
Downloading: http://repo1.maven.org/maven2/concurrent/concurrent/1.3.4/concurrent-1.3.4.pom
1K downloaded  (concurrent-1.3.4.pom)
Downloading: http://repo1.maven.org/maven2/joda-time/joda-time/2.1/joda-time-2.1.pom
15K downloaded  (joda-time-2.1.pom)
Downloading: http://repo1.maven.org/maven2/concurrent/concurrent/1.3.4/concurrent-1.3.4.jar
Downloading: http://repo1.maven.org/maven2/joda-time/joda-time/2.1/joda-time-2.1.jar
184K downloaded  (concurrent-1.3.4.jar)
557K downloaded  (joda-time-2.1.jar)
[INFO] [resources:resources {execution: default-resources}]
[INFO] Using 'UTF-8' encoding to copy filtered resources.
[INFO] Copying 26 resources
[INFO] Copying 3 resources
[INFO] [compiler:compile {execution: default-compile}]
[INFO] Compiling 118 source files to <https://builds.apache.org/job/oodt-trunk/org.apache.oodt$cas-workflow/ws/target/classes>
[INFO] -------------------------------------------------------------
[ERROR] COMPILATION ERROR : 
[INFO] -------------------------------------------------------------
[ERROR] <https://builds.apache.org/job/oodt-trunk/org.apache.oodt$cas-workflow/ws/src/main/java/org/apache/oodt/cas/workflow/system/XmlRpcWorkflowManager.java>:[32,49]
cannot find symbol
symbol  : class SynchronousLocalEngineRunnerFactory
location: package org.apache.oodt.cas.workflow.engine.runner
[INFO] 1 error
[INFO] -------------------------------------------------------------
[JENKINS] Archiving <https://builds.apache.org/job/oodt-trunk/org.apache.oodt$cas-workflow/ws/pom.xml>
to /home/hudson/hudson/jobs/oodt-trunk/modules/org.apache.oodt$cas-workflow/builds/2012-09-17_15-51-28/archive/org.apache.oodt/cas-workflow/0.5-SNAPSHOT/cas-workflow-0.5-SNAPSHOT.pom
[INFO] ------------------------------------------------------------------------
[ERROR] BUILD FAILURE
[INFO] ------------------------------------------------------------------------
[INFO] Compilation failure
<https://builds.apache.org/job/oodt-trunk/org.apache.oodt$cas-workflow/ws/src/main/java/org/apache/oodt/cas/workflow/system/XmlRpcWorkflowManager.java>:[32,49]
cannot find symbol
symbol  : class SynchronousLocalEngineRunnerFactory
location: package org.apache.oodt.cas.workflow.engine.runner

[INFO] ------------------------------------------------------------------------
[INFO] For more information, run Maven with the -e switch
[INFO] ------------------------------------------------------------------------
[INFO] Total time: 4 minutes 50 seconds
[INFO] Finished at: Mon Sep 17 15:56:25 UTC 2012
[INFO] Final Memory: 84M/605M
[INFO] ------------------------------------------------------------------------

Mime
View raw message