oodt-dev mailing list archives

Site index · List index
Message view « Date » · « Thread »
Top « Date » · « Thread »
From Apache Jenkins Server <jenk...@builds.apache.org>
Subject Build failed in Jenkins: oodt-trunk #603
Date Fri, 24 Aug 2012 00:39:58 GMT
See <https://builds.apache.org/job/oodt-trunk/603/>

------------------------------------------
[...truncated 7082 lines...]
	at $Proxy0.invoke(Unknown Source)
	at org.apache.maven.surefire.booter.SurefireStarter.invokeProvider(SurefireStarter.java:150)
	at org.apache.maven.surefire.booter.SurefireStarter.runSuitesInProcess(SurefireStarter.java:91)
	at org.apache.maven.surefire.booter.ForkedBooter.main(ForkedBooter.java:69)
Aug 24, 2012 12:33:13 AM org.apache.oodt.cas.filemgr.util.GenericFileManagerObjectFactory
getCatalogServiceFromFactory
WARNING: ClassNotFoundException when loading metadata store factory class  Message: 
java.lang.ClassNotFoundException: 
	at java.lang.Class.forName0(Native Method)
	at java.lang.Class.forName(Class.java:169)
	at org.apache.oodt.cas.filemgr.util.GenericFileManagerObjectFactory.getRepositoryManagerServiceFromFactory(GenericFileManagerObjectFactory.java:120)
	at org.apache.oodt.cas.filemgr.system.XmlRpcFileManager.loadConfiguration(XmlRpcFileManager.java:1345)
	at org.apache.oodt.cas.filemgr.system.XmlRpcFileManager.<init>(XmlRpcFileManager.java:131)
	at org.apache.oodt.cas.pge.staging.TestFileStager.testCreateFileManagerClient(TestFileStager.java:76)
	at sun.reflect.NativeMethodAccessorImpl.invoke0(Native Method)
	at sun.reflect.NativeMethodAccessorImpl.invoke(NativeMethodAccessorImpl.java:39)
	at sun.reflect.DelegatingMethodAccessorImpl.invoke(DelegatingMethodAccessorImpl.java:25)
	at java.lang.reflect.Method.invoke(Method.java:597)
	at junit.framework.TestCase.runTest(TestCase.java:164)
	at junit.framework.TestCase.runBare(TestCase.java:130)
	at junit.framework.TestResult$1.protect(TestResult.java:106)
	at junit.framework.TestResult.runProtected(TestResult.java:124)
	at junit.framework.TestResult.run(TestResult.java:109)
	at junit.framework.TestCase.run(TestCase.java:120)
	at junit.framework.TestSuite.runTest(TestSuite.java:230)
	at junit.framework.TestSuite.run(TestSuite.java:225)
	at sun.reflect.NativeMethodAccessorImpl.invoke0(Native Method)
	at sun.reflect.NativeMethodAccessorImpl.invoke(NativeMethodAccessorImpl.java:39)
	at sun.reflect.DelegatingMethodAccessorImpl.invoke(DelegatingMethodAccessorImpl.java:25)
	at java.lang.reflect.Method.invoke(Method.java:597)
	at org.apache.maven.surefire.junit.JUnitTestSet.execute(JUnitTestSet.java:98)
	at org.apache.maven.surefire.junit.JUnit3Provider.executeTestSet(JUnit3Provider.java:107)
	at org.apache.maven.surefire.junit.JUnit3Provider.invoke(JUnit3Provider.java:84)
	at sun.reflect.NativeMethodAccessorImpl.invoke0(Native Method)
	at sun.reflect.NativeMethodAccessorImpl.invoke(NativeMethodAccessorImpl.java:39)
	at sun.reflect.DelegatingMethodAccessorImpl.invoke(DelegatingMethodAccessorImpl.java:25)
	at java.lang.reflect.Method.invoke(Method.java:597)
	at org.apache.maven.surefire.booter.ProviderFactory$ClassLoaderProxy.invoke(ProviderFactory.java:103)
	at $Proxy0.invoke(Unknown Source)
	at org.apache.maven.surefire.booter.SurefireStarter.invokeProvider(SurefireStarter.java:150)
	at org.apache.maven.surefire.booter.SurefireStarter.runSuitesInProcess(SurefireStarter.java:91)
	at org.apache.maven.surefire.booter.ForkedBooter.main(ForkedBooter.java:69)
Aug 24, 2012 12:33:13 AM org.apache.oodt.cas.filemgr.util.GenericFileManagerObjectFactory
getRepositoryManagerServiceFromFactory
WARNING: ClassNotFoundException when loading data store factory class  Message: 
Aug 24, 2012 12:33:13 AM org.apache.oodt.cas.filemgr.datatransfer.LocalDataTransferer setFileManagerUrl
INFO: Local Data Transfer to: [http://localhost:9876] enabled
Aug 24, 2012 12:33:13 AM org.apache.oodt.cas.filemgr.system.XmlRpcFileManager <init>
INFO: File Manager started by hudson
Tests run: 3, Failures: 0, Errors: 0, Skipped: 0, Time elapsed: 0.397 sec

Results :

Tests run: 28, Failures: 0, Errors: 0, Skipped: 0

[JENKINS] Recording test results
[INFO] [jar:jar {execution: default-jar}]
[INFO] Building jar: <https://builds.apache.org/job/oodt-trunk/ws/pge/target/cas-pge-0.5-SNAPSHOT.jar>
[INFO] Preparing javadoc:javadoc
[WARNING] Removing: javadoc from forked lifecycle, to prevent recursive invocation.
[INFO] No goals needed for project - skipping
[WARNING] DEPRECATED [aggregate]: since 2.5. Use the goals <code>javadoc:aggregate</code>
and <code>javadoc:test-aggregate</code> instead.
[INFO] [javadoc:javadoc {execution: attach-javadocs}]
[INFO] [assembly:single {execution: default}]
[INFO] Reading assembly descriptor: src/main/assembly/assembly.xml
[INFO] Processing DependencySet (output=lib)
[INFO] Building tar : <https://builds.apache.org/job/oodt-trunk/ws/pge/target/cas-pge-0.5-SNAPSHOT-dist.tar.gz>
[INFO] Processing DependencySet (output=lib)
[INFO] Building zip: <https://builds.apache.org/job/oodt-trunk/ws/pge/target/cas-pge-0.5-SNAPSHOT-dist.zip>
[INFO] [install:install {execution: default-install}]
[INFO] Installing <https://builds.apache.org/job/oodt-trunk/ws/pge/target/cas-pge-0.5-SNAPSHOT.jar>
to <https://builds.apache.org/job/oodt-trunk/ws/.repository/org/apache/oodt/cas-pge/0.5-SNAPSHOT/cas-pge-0.5-SNAPSHOT.jar>
[INFO] Installing <https://builds.apache.org/job/oodt-trunk/ws/pge/target/cas-pge-0.5-SNAPSHOT-dist.tar.gz>
to <https://builds.apache.org/job/oodt-trunk/ws/.repository/org/apache/oodt/cas-pge/0.5-SNAPSHOT/cas-pge-0.5-SNAPSHOT-dist.tar.gz>
[INFO] Installing <https://builds.apache.org/job/oodt-trunk/ws/pge/target/cas-pge-0.5-SNAPSHOT-dist.zip>
to <https://builds.apache.org/job/oodt-trunk/ws/.repository/org/apache/oodt/cas-pge/0.5-SNAPSHOT/cas-pge-0.5-SNAPSHOT-dist.zip>
[JENKINS] Archiving <https://builds.apache.org/job/oodt-trunk/ws/pge/pom.xml> to /home/hudson/hudson/jobs/oodt-trunk/modules/org.apache.oodt$cas-pge/builds/2012-08-24_00-11-41/archive/org.apache.oodt/cas-pge/0.5-SNAPSHOT/cas-pge-0.5-SNAPSHOT.pom
[JENKINS] Archiving <https://builds.apache.org/job/oodt-trunk/ws/pge/target/cas-pge-0.5-SNAPSHOT.jar>
to /home/hudson/hudson/jobs/oodt-trunk/modules/org.apache.oodt$cas-pge/builds/2012-08-24_00-11-41/archive/org.apache.oodt/cas-pge/0.5-SNAPSHOT/cas-pge-0.5-SNAPSHOT.jar
[JENKINS] Archiving <https://builds.apache.org/job/oodt-trunk/ws/pge/target/cas-pge-0.5-SNAPSHOT-dist.tar.gz>
to /home/hudson/hudson/jobs/oodt-trunk/modules/org.apache.oodt$cas-pge/builds/2012-08-24_00-11-41/archive/org.apache.oodt/cas-pge/0.5-SNAPSHOT/cas-pge-0.5-SNAPSHOT-dist.tar.gz
[JENKINS] Archiving <https://builds.apache.org/job/oodt-trunk/ws/pge/target/cas-pge-0.5-SNAPSHOT-dist.zip>
to /home/hudson/hudson/jobs/oodt-trunk/modules/org.apache.oodt$cas-pge/builds/2012-08-24_00-11-41/archive/org.apache.oodt/cas-pge/0.5-SNAPSHOT/cas-pge-0.5-SNAPSHOT-dist.zip
[INFO] ------------------------------------------------------------------------
[INFO] Building CAS Installer Maven Mojo
[INFO]    task-segment: [install]
[INFO] ------------------------------------------------------------------------
Downloading: http://repo1.maven.org/maven2/org/apache/maven/plugins/maven-plugin-plugin/2.7/maven-plugin-plugin-2.7.pom
10K downloaded  (maven-plugin-plugin-2.7.pom)
Downloading: http://repo1.maven.org/maven2/org/apache/maven/plugins/maven-plugin-plugin/2.7/maven-plugin-plugin-2.7.jar
39K downloaded  (maven-plugin-plugin-2.7.jar)
Downloading: http://repo1.maven.org/maven2/org/apache/ant/ant/1.7.0/ant-1.7.0.pom
9K downloaded  (ant-1.7.0.pom)
Downloading: http://repo1.maven.org/maven2/org/apache/ant/ant-parent/1.7.0/ant-parent-1.7.0.pom
4K downloaded  (ant-parent-1.7.0.pom)
Downloading: http://repo1.maven.org/maven2/org/apache/ant/ant-launcher/1.7.0/ant-launcher-1.7.0.pom
2K downloaded  (ant-launcher-1.7.0.pom)
Downloading: http://repo1.maven.org/maven2/org/apache/maven/maven-plugin-api/2.0/maven-plugin-api-2.0.jar
Downloading: http://repo1.maven.org/maven2/org/apache/ant/ant/1.7.0/ant-1.7.0.jar
1259K downloaded  (ant-1.7.0.jar)
Downloading: http://repo1.maven.org/maven2/org/apache/ant/ant-launcher/1.7.0/ant-launcher-1.7.0.jar
11K downloaded  (ant-launcher-1.7.0.jar)
9K downloaded  (maven-plugin-api-2.0.jar)
Downloading: http://repo1.maven.org/maven2/org/apache/maven/plugin-tools/maven-plugin-tools-api/2.7/maven-plugin-tools-api-2.7.pom
4K downloaded  (maven-plugin-tools-api-2.7.pom)
Downloading: http://repo1.maven.org/maven2/org/apache/maven/plugin-tools/maven-plugin-tools/2.7/maven-plugin-tools-2.7.pom
9K downloaded  (maven-plugin-tools-2.7.pom)
Downloading: http://repo1.maven.org/maven2/org/apache/maven/reporting/maven-reporting-impl/2.0.5/maven-reporting-impl-2.0.5.pom
4K downloaded  (maven-reporting-impl-2.0.5.pom)
Downloading: http://repo1.maven.org/maven2/org/apache/maven/shared/maven-doxia-tools/1.0.2/maven-doxia-tools-1.0.2.pom
5K downloaded  (maven-doxia-tools-1.0.2.pom)
Downloading: http://repo1.maven.org/maven2/commons-validator/commons-validator/1.2.0/commons-validator-1.2.0.pom
8K downloaded  (commons-validator-1.2.0.pom)
Downloading: http://repo1.maven.org/maven2/commons-beanutils/commons-beanutils/1.7.0/commons-beanutils-1.7.0.pom
357b downloaded  (commons-beanutils-1.7.0.pom)
Downloading: http://repo1.maven.org/maven2/commons-digester/commons-digester/1.6/commons-digester-1.6.pom
974b downloaded  (commons-digester-1.6.pom)
Downloading: http://repo1.maven.org/maven2/commons-beanutils/commons-beanutils/1.6/commons-beanutils-1.6.pom
2K downloaded  (commons-beanutils-1.6.pom)
Downloading: http://repo1.maven.org/maven2/commons-logging/commons-logging/1.0/commons-logging-1.0.pom
163b downloaded  (commons-logging-1.0.pom)
Downloading: http://repo1.maven.org/maven2/org/apache/maven/plugin-tools/maven-plugin-tools-java/2.7/maven-plugin-tools-java-2.7.pom
2K downloaded  (maven-plugin-tools-java-2.7.pom)
Downloading: http://repo1.maven.org/maven2/com/thoughtworks/qdox/qdox/1.11/qdox-1.11.pom
18K downloaded  (qdox-1.11.pom)
Downloading: http://repo1.maven.org/maven2/org/apache/maven/plugin-tools/maven-plugin-tools-beanshell/2.7/maven-plugin-tools-beanshell-2.7.pom
2K downloaded  (maven-plugin-tools-beanshell-2.7.pom)
Downloading: http://repo1.maven.org/maven2/bsh/bsh/1.3.0/bsh-1.3.0.pom
210b downloaded  (bsh-1.3.0.pom)
Downloading: http://repo1.maven.org/maven2/org/apache/maven/reporting/maven-reporting-impl/2.0.5/maven-reporting-impl-2.0.5.jar
Downloading: http://repo1.maven.org/maven2/jtidy/jtidy/4aug2000r7-dev/jtidy-4aug2000r7-dev.jar
Downloading: http://repo1.maven.org/maven2/commons-validator/commons-validator/1.2.0/commons-validator-1.2.0.jar
Downloading: http://repo1.maven.org/maven2/org/apache/maven/plugin-tools/maven-plugin-tools-api/2.7/maven-plugin-tools-api-2.7.jar
Downloading: http://repo1.maven.org/maven2/commons-digester/commons-digester/1.6/commons-digester-1.6.jar
20K downloaded  (maven-reporting-impl-2.0.5.jar)
134K downloaded  (jtidy-4aug2000r7-dev.jar)
Downloading: http://repo1.maven.org/maven2/org/apache/maven/shared/maven-doxia-tools/1.0.2/maven-doxia-tools-1.0.2.jar
88K downloaded  (commons-validator-1.2.0.jar)
Downloading: http://repo1.maven.org/maven2/com/thoughtworks/qdox/qdox/1.11/qdox-1.11.jar
40K downloaded  (maven-doxia-tools-1.0.2.jar)
164K downloaded  (commons-digester-1.6.jar)
Downloading: http://repo1.maven.org/maven2/commons-logging/commons-logging/1.0.4/commons-logging-1.0.4.jar
55K downloaded  (maven-plugin-tools-api-2.7.jar)
Downloading: http://repo1.maven.org/maven2/commons-beanutils/commons-beanutils/1.7.0/commons-beanutils-1.7.0.jar
Downloading: http://repo1.maven.org/maven2/bsh/bsh/1.3.0/bsh-1.3.0.jar
171K downloaded  (qdox-1.11.jar)
Downloading: http://repo1.maven.org/maven2/org/apache/maven/plugin-tools/maven-plugin-tools-java/2.7/maven-plugin-tools-java-2.7.jar
37K downloaded  (commons-logging-1.0.4.jar)
16K downloaded  (maven-plugin-tools-java-2.7.jar)
184K downloaded  (commons-beanutils-1.7.0.jar)
Downloading: http://repo1.maven.org/maven2/org/apache/maven/plugin-tools/maven-plugin-tools-beanshell/2.7/maven-plugin-tools-beanshell-2.7.jar
236K downloaded  (bsh-1.3.0.jar)
12K downloaded  (maven-plugin-tools-beanshell-2.7.jar)
[INFO] [plugin:descriptor {execution: default-descriptor}]
[INFO] Using 'UTF-8' encoding to read mojo metadata.
[INFO] Applying mojo extractor for language: java
[INFO] Mojo extractor for language: java found 1 mojo descriptors.
[INFO] Applying mojo extractor for language: bsh
[INFO] Mojo extractor for language: bsh found 0 mojo descriptors.
[INFO] [remote-resources:process {execution: default}]
[INFO] [resources:resources {execution: default-resources}]
[INFO] Using 'UTF-8' encoding to copy filtered resources.
[INFO] skip non existing resourceDirectory <https://builds.apache.org/job/oodt-trunk/ws/mvn/plugins/cas-install/src/main/resources>
[INFO] Copying 3 resources
[INFO] [compiler:compile {execution: default-compile}]
[INFO] Compiling 4 source files to <https://builds.apache.org/job/oodt-trunk/ws/mvn/plugins/cas-install/target/classes>
[INFO] [resources:testResources {execution: default-testResources}]
[INFO] Using 'UTF-8' encoding to copy filtered resources.
[INFO] skip non existing resourceDirectory <https://builds.apache.org/job/oodt-trunk/ws/mvn/plugins/cas-install/src/test/resources>
[INFO] Copying 3 resources
[INFO] [compiler:testCompile {execution: default-testCompile}]
[INFO] No sources to compile
[INFO] [surefire:test {execution: default-test}]
[INFO] Surefire report directory: <https://builds.apache.org/job/oodt-trunk/ws/mvn/plugins/cas-install/target/surefire-reports>

-------------------------------------------------------
 T E S T S
-------------------------------------------------------
There are no tests to run.

Results :

Tests run: 0, Failures: 0, Errors: 0, Skipped: 0

[JENKINS] Recording test results
[INFO] [jar:jar {execution: default-jar}]
[INFO] Building jar: <https://builds.apache.org/job/oodt-trunk/ws/mvn/plugins/cas-install/target/maven-cas-install-plugin-0.5-SNAPSHOT.jar>
[INFO] [plugin:addPluginArtifactMetadata {execution: default-addPluginArtifactMetadata}]
[INFO] Preparing javadoc:javadoc
[WARNING] Removing: javadoc from forked lifecycle, to prevent recursive invocation.
[INFO] No goals needed for project - skipping
[WARNING] DEPRECATED [aggregate]: since 2.5. Use the goals <code>javadoc:aggregate</code>
and <code>javadoc:test-aggregate</code> instead.
[INFO] [javadoc:javadoc {execution: attach-javadocs}]
[INFO] [install:install {execution: default-install}]
[INFO] Installing <https://builds.apache.org/job/oodt-trunk/ws/mvn/plugins/cas-install/target/maven-cas-install-plugin-0.5-SNAPSHOT.jar>
to <https://builds.apache.org/job/oodt-trunk/ws/.repository/org/apache/oodt/maven-cas-install-plugin/0.5-SNAPSHOT/maven-cas-install-plugin-0.5-SNAPSHOT.jar>
[JENKINS] Archiving <https://builds.apache.org/job/oodt-trunk/ws/mvn/plugins/cas-install/pom.xml>
to /home/hudson/hudson/jobs/oodt-trunk/modules/org.apache.oodt$maven-cas-install-plugin/builds/2012-08-24_00-11-41/archive/org.apache.oodt/maven-cas-install-plugin/0.5-SNAPSHOT/maven-cas-install-plugin-0.5-SNAPSHOT.pom
[JENKINS] Archiving <https://builds.apache.org/job/oodt-trunk/ws/mvn/plugins/cas-install/target/maven-cas-install-plugin-0.5-SNAPSHOT.jar>
to /home/hudson/hudson/jobs/oodt-trunk/modules/org.apache.oodt$maven-cas-install-plugin/builds/2012-08-24_00-11-41/archive/org.apache.oodt/maven-cas-install-plugin/0.5-SNAPSHOT/maven-cas-install-plugin-0.5-SNAPSHOT.jar
[INFO] ------------------------------------------------------------------------
[INFO] Building CAS Push-Pull-Framework
[INFO]    task-segment: [install]
[INFO] ------------------------------------------------------------------------
[INFO] [remote-resources:process {execution: default}]
[INFO] [resources:resources {execution: default-resources}]
[INFO] Using 'UTF-8' encoding to copy filtered resources.
[INFO] Copying 28 resources
[INFO] Copying 3 resources
[INFO] [compiler:compile {execution: default-compile}]
[INFO] Compiling 72 source files to <https://builds.apache.org/job/oodt-trunk/ws/pushpull/target/classes>
[INFO] [resources:testResources {execution: default-testResources}]
[INFO] Using 'UTF-8' encoding to copy filtered resources.
[INFO] skip non existing resourceDirectory <https://builds.apache.org/job/oodt-trunk/ws/pushpull/src/test/resources>
[INFO] Copying 3 resources
[INFO] [compiler:testCompile {execution: default-testCompile}]
[INFO] No sources to compile
[INFO] [surefire:test {execution: default-test}]
[INFO] Surefire report directory: <https://builds.apache.org/job/oodt-trunk/ws/pushpull/target/surefire-reports>

-------------------------------------------------------
 T E S T S
-------------------------------------------------------
There are no tests to run.

Results :

Tests run: 0, Failures: 0, Errors: 0, Skipped: 0

[JENKINS] Recording test results
[INFO] [jar:jar {execution: default-jar}]
[INFO] Building jar: <https://builds.apache.org/job/oodt-trunk/ws/pushpull/target/cas-pushpull-0.5-SNAPSHOT.jar>
[INFO] Preparing javadoc:javadoc
[WARNING] Removing: javadoc from forked lifecycle, to prevent recursive invocation.
[INFO] No goals needed for project - skipping
[WARNING] DEPRECATED [aggregate]: since 2.5. Use the goals <code>javadoc:aggregate</code>
and <code>javadoc:test-aggregate</code> instead.
[INFO] [javadoc:javadoc {execution: attach-javadocs}]
[INFO] [assembly:single {execution: default}]
[INFO] Reading assembly descriptor: src/main/assembly/assembly.xml
[INFO] Processing DependencySet (output=lib)
[INFO] Building tar : <https://builds.apache.org/job/oodt-trunk/ws/pushpull/target/cas-pushpull-0.5-SNAPSHOT-dist.tar.gz>
[INFO] Processing DependencySet (output=lib)
[JENKINS] Archiving <https://builds.apache.org/job/oodt-trunk/ws/pushpull/pom.xml> to
/home/hudson/hudson/jobs/oodt-trunk/modules/org.apache.oodt$cas-pushpull/builds/2012-08-24_00-11-41/archive/org.apache.oodt/cas-pushpull/0.5-SNAPSHOT/cas-pushpull-0.5-SNAPSHOT.pom
[JENKINS] Archiving <https://builds.apache.org/job/oodt-trunk/ws/pushpull/target/cas-pushpull-0.5-SNAPSHOT.jar>
to /home/hudson/hudson/jobs/oodt-trunk/modules/org.apache.oodt$cas-pushpull/builds/2012-08-24_00-11-41/archive/org.apache.oodt/cas-pushpull/0.5-SNAPSHOT/cas-pushpull-0.5-SNAPSHOT.jar
[JENKINS] Archiving <https://builds.apache.org/job/oodt-trunk/ws/pushpull/target/cas-pushpull-0.5-SNAPSHOT-dist.tar.gz>
to /home/hudson/hudson/jobs/oodt-trunk/modules/org.apache.oodt$cas-pushpull/builds/2012-08-24_00-11-41/archive/org.apache.oodt/cas-pushpull/0.5-SNAPSHOT/cas-pushpull-0.5-SNAPSHOT-dist.tar.gz
[INFO] ------------------------------------------------------------------------
[ERROR] BUILD ERROR
[INFO] ------------------------------------------------------------------------
[INFO] Failed to create assembly: Failed to retrieve OS environment variables. Reason: Cannot
run program "env": java.io.IOException: error=24, Too many open files

[INFO] ------------------------------------------------------------------------
[INFO] For more information, run Maven with the -e switch
[INFO] ------------------------------------------------------------------------
[INFO] Total time: 27 minutes 48 seconds
[INFO] Finished at: Fri Aug 24 00:39:54 UTC 2012
[INFO] Final Memory: 130M/496M
[INFO] ------------------------------------------------------------------------
Waiting for Jenkins to finish collecting data
Sending e-mails to: dev@oodt.apache.org
channel stopped

Mime
View raw message