oodt-dev mailing list archives

Site index · List index
Message view « Date » · « Thread »
Top « Date » · « Thread »
From Apache Jenkins Server <jenk...@builds.apache.org>
Subject Build failed in Jenkins: oodt-trunk #509
Date Thu, 14 Jun 2012 11:55:44 GMT
See <https://builds.apache.org/job/oodt-trunk/509/changes>

Changes:

[pramirez] [maven-release-plugin] prepare for next development iteration

[pramirez] [maven-release-plugin] prepare release oodt-0.4

------------------------------------------
[...truncated 5057 lines...]
Tests run: 1, Failures: 0, Errors: 0, Skipped: 0, Time elapsed: 0.025 sec
Running org.apache.oodt.cas.metadata.filenaming.TestPathUtilsNamingConvention
Tests run: 1, Failures: 0, Errors: 0, Skipped: 0, Time elapsed: 0.009 sec
Running org.apache.oodt.cas.metadata.extractors.TestExternMetExtractor
Jun 14, 2012 11:44:03 AM org.apache.oodt.cas.metadata.extractors.ExternMetExtractor extrMetadata
INFO: Generating met file for product file: [<https://builds.apache.org/job/oodt-trunk/ws/metadata/target/classes/metadata8400038312933449769.tests/testfile.txt]>
Jun 14, 2012 11:44:03 AM org.apache.oodt.cas.metadata.extractors.ExternMetExtractor extrMetadata
INFO: Executing command line: [<https://builds.apache.org/job/oodt-trunk/ws/metadata/target/classes/metadata8400038312933449769.tests/testExtractor>
<https://builds.apache.org/job/oodt-trunk/ws/metadata/target/classes/metadata8400038312933449769.tests/testfile.txt>
<https://builds.apache.org/job/oodt-trunk/ws/metadata/target/classes/metadata8400038312933449769.tests/testfile.txt.met>
-Dtrue=always foo bar /home/jenkins/test\ boo ] with workingDir: [<https://builds.apache.org/job/oodt-trunk/ws/metadata/target/classes/metadata8400038312933449769.tests]>
to extract metadata
Jun 14, 2012 11:44:03 AM org.apache.oodt.cas.metadata.extractors.ExternMetExtractor extrMetadata
INFO: Met extraction successful for product file: [<https://builds.apache.org/job/oodt-trunk/ws/metadata/target/classes/metadata8400038312933449769.tests/testfile.txt]>
Tests run: 1, Failures: 0, Errors: 0, Skipped: 0, Time elapsed: 0.291 sec
Running org.apache.oodt.cas.metadata.extractors.TestCopyAndRewriteExtractor
Tests run: 2, Failures: 0, Errors: 0, Skipped: 0, Time elapsed: 0.008 sec
Running org.apache.oodt.cas.metadata.extractors.TestMetReader
Jun 14, 2012 11:44:03 AM org.apache.oodt.cas.metadata.extractors.MetReaderExtractor extrMetadata
INFO: Reading metadata from <https://builds.apache.org/job/oodt-trunk/ws/metadata/target/classes/metadata5231846102882854406.tests/testfile2.txt.met>
Tests run: 1, Failures: 0, Errors: 0, Skipped: 0, Time elapsed: 0.003 sec
Running org.apache.oodt.cas.metadata.extractors.TestExternMetExtractorConfigReader
Tests run: 1, Failures: 0, Errors: 0, Skipped: 0, Time elapsed: 0.104 sec
Running org.apache.oodt.cas.metadata.TestMetadata
Tests run: 5, Failures: 0, Errors: 0, Skipped: 0, Time elapsed: 0.001 sec

Results :

Tests run: 20, Failures: 0, Errors: 0, Skipped: 0

[INFO] [jar:jar {execution: default-jar}]
[INFO] Building jar: <https://builds.apache.org/job/oodt-trunk/ws/metadata/target/cas-metadata-0.5-SNAPSHOT.jar>
[INFO] Preparing javadoc:javadoc
[WARNING] Removing: javadoc from forked lifecycle, to prevent recursive invocation.
[INFO] No goals needed for project - skipping
[WARNING] DEPRECATED [aggregate]: since 2.5. Use the goals <code>javadoc:aggregate</code>
and <code>javadoc:test-aggregate</code> instead.
[INFO] [javadoc:javadoc {execution: attach-javadocs}]
[INFO] [install:install {execution: default-install}]
[INFO] Installing <https://builds.apache.org/job/oodt-trunk/ws/metadata/target/cas-metadata-0.5-SNAPSHOT.jar>
to <https://builds.apache.org/job/oodt-trunk/ws/.repository/org/apache/oodt/cas-metadata/0.5-SNAPSHOT/cas-metadata-0.5-SNAPSHOT.jar>
[JENKINS] Archiving <https://builds.apache.org/job/oodt-trunk/ws/metadata/pom.xml> to
/home/hudson/hudson/jobs/oodt-trunk/modules/org.apache.oodt$cas-metadata/builds/2012-06-14_08-55-52/archive/org.apache.oodt/cas-metadata/0.5-SNAPSHOT/cas-metadata-0.5-SNAPSHOT.pom
[JENKINS] Archiving <https://builds.apache.org/job/oodt-trunk/ws/metadata/target/cas-metadata-0.5-SNAPSHOT.jar>
to /home/hudson/hudson/jobs/oodt-trunk/modules/org.apache.oodt$cas-metadata/builds/2012-06-14_08-55-52/archive/org.apache.oodt/cas-metadata/0.5-SNAPSHOT/cas-metadata-0.5-SNAPSHOT.jar
[INFO] ------------------------------------------------------------------------
[INFO] Building CAS Protocol
[INFO]    task-segment: [install]
[INFO] ------------------------------------------------------------------------
[INFO] [remote-resources:process {execution: default}]
Downloading: http://repo1.maven.org/maven2/com/thoughtworks/xstream/xstream/1.3.1/xstream-1.3.1.pom

Downloading: http://repo1.maven.org/maven2/com/thoughtworks/xstream/xstream-parent/1.3.1/xstream-parent-1.3.1.pom

Downloading: http://repo1.maven.org/maven2/xpp3/xpp3_min/1.1.4c/xpp3_min-1.1.4c.pom

Downloading: http://repo1.maven.org/maven2/xpp3/xpp3_min/1.1.4c/xpp3_min-1.1.4c.jar
Downloading: http://repo1.maven.org/maven2/com/thoughtworks/xstream/xstream/1.3.1/xstream-1.3.1.jar


[INFO] [resources:resources {execution: default-resources}]
[INFO] Using 'UTF-8' encoding to copy filtered resources.
[INFO] Copying 1 resource to org/apache/oodt/cas/protocol
[INFO] Copying 3 resources
[INFO] [compiler:compile {execution: default-compile}]
[INFO] Compiling 21 source files to <https://builds.apache.org/job/oodt-trunk/ws/protocol/api/target/classes>
[INFO] [resources:testResources {execution: default-testResources}]
[INFO] Using 'UTF-8' encoding to copy filtered resources.
[INFO] skip non existing resourceDirectory <https://builds.apache.org/job/oodt-trunk/ws/protocol/api/src/test/resources>
[INFO] Copying 3 resources
[INFO] [compiler:testCompile {execution: default-testCompile}]
[INFO] Compiling 11 source files to <https://builds.apache.org/job/oodt-trunk/ws/protocol/api/target/test-classes>
[INFO] [surefire:test {execution: default-test}]
[INFO] Surefire report directory: <https://builds.apache.org/job/oodt-trunk/ws/protocol/api/target/surefire-reports>

-------------------------------------------------------
 T E S T S
-------------------------------------------------------
Running org.apache.oodt.cas.protocol.system.TestProtocolManager
Jun 14, 2012 11:46:36 AM org.springframework.context.support.AbstractApplicationContext prepareRefresh
INFO: Refreshing org.springframework.context.support.FileSystemXmlApplicationContext@18fd984:
display name [org.springframework.context.support.FileSystemXmlApplicationContext@18fd984];
startup date [Thu Jun 14 11:46:36 UTC 2012]; root of context hierarchy
Jun 14, 2012 11:46:36 AM org.springframework.beans.factory.xml.XmlBeanDefinitionReader loadBeanDefinitions
INFO: Loading XML bean definitions from file [<https://builds.apache.org/job/oodt-trunk/ws/protocol/api/src/testdata/test-protocol-config.xml]>
Jun 14, 2012 11:46:37 AM org.springframework.context.support.AbstractApplicationContext obtainFreshBeanFactory
INFO: Bean factory for application context [org.springframework.context.support.FileSystemXmlApplicationContext@18fd984]:
org.springframework.beans.factory.support.DefaultListableBeanFactory@1982fc1
Jun 14, 2012 11:46:37 AM org.springframework.context.support.AbstractApplicationContext$BeanPostProcessorChecker
postProcessAfterInitialization
INFO: Bean 'org.apache.oodt.commons.spring.postprocessor.SetIdBeanPostProcessor' is not eligible
for getting processed by all BeanPostProcessors (for example: not eligible for auto-proxying)
Jun 14, 2012 11:46:37 AM org.springframework.beans.factory.support.DefaultListableBeanFactory
preInstantiateSingletons
INFO: Pre-instantiating singletons in org.springframework.beans.factory.support.DefaultListableBeanFactory@1982fc1:
defining beans [org.apache.oodt.commons.spring.postprocessor.SetIdBeanPostProcessor,ftp1,ftp2,ftp3,sftp1,sftp2,http1];
root of factory hierarchy
Jun 14, 2012 11:46:37 AM org.springframework.context.support.AbstractApplicationContext prepareRefresh
INFO: Refreshing org.springframework.context.support.FileSystemXmlApplicationContext@19113f8:
display name [org.springframework.context.support.FileSystemXmlApplicationContext@19113f8];
startup date [Thu Jun 14 11:46:37 UTC 2012]; root of context hierarchy
Jun 14, 2012 11:46:37 AM org.springframework.beans.factory.xml.XmlBeanDefinitionReader loadBeanDefinitions
INFO: Loading XML bean definitions from file [<https://builds.apache.org/job/oodt-trunk/ws/protocol/api/src/testdata/test-protocol-config.xml]>
Jun 14, 2012 11:46:37 AM org.springframework.context.support.AbstractApplicationContext obtainFreshBeanFactory
INFO: Bean factory for application context [org.springframework.context.support.FileSystemXmlApplicationContext@19113f8]:
org.springframework.beans.factory.support.DefaultListableBeanFactory@941db6
Jun 14, 2012 11:46:37 AM org.springframework.context.support.AbstractApplicationContext$BeanPostProcessorChecker
postProcessAfterInitialization
INFO: Bean 'org.apache.oodt.commons.spring.postprocessor.SetIdBeanPostProcessor' is not eligible
for getting processed by all BeanPostProcessors (for example: not eligible for auto-proxying)
Jun 14, 2012 11:46:37 AM org.springframework.beans.factory.support.DefaultListableBeanFactory
preInstantiateSingletons
INFO: Pre-instantiating singletons in org.springframework.beans.factory.support.DefaultListableBeanFactory@941db6:
defining beans [org.apache.oodt.commons.spring.postprocessor.SetIdBeanPostProcessor,ftp1,ftp2,ftp3,sftp1,sftp2,http1];
root of factory hierarchy
Jun 14, 2012 11:46:37 AM org.springframework.context.support.AbstractApplicationContext prepareRefresh
INFO: Refreshing org.springframework.context.support.FileSystemXmlApplicationContext@6b9c84:
display name [org.springframework.context.support.FileSystemXmlApplicationContext@6b9c84];
startup date [Thu Jun 14 11:46:37 UTC 2012]; root of context hierarchy
Jun 14, 2012 11:46:37 AM org.springframework.beans.factory.xml.XmlBeanDefinitionReader loadBeanDefinitions
INFO: Loading XML bean definitions from file [<https://builds.apache.org/job/oodt-trunk/ws/protocol/api/src/testdata/test-protocol-config.xml]>
Jun 14, 2012 11:46:37 AM org.springframework.context.support.AbstractApplicationContext obtainFreshBeanFactory
INFO: Bean factory for application context [org.springframework.context.support.FileSystemXmlApplicationContext@6b9c84]:
org.springframework.beans.factory.support.DefaultListableBeanFactory@90832e
Jun 14, 2012 11:46:37 AM org.springframework.context.support.AbstractApplicationContext$BeanPostProcessorChecker
postProcessAfterInitialization
INFO: Bean 'org.apache.oodt.commons.spring.postprocessor.SetIdBeanPostProcessor' is not eligible
for getting processed by all BeanPostProcessors (for example: not eligible for auto-proxying)
Jun 14, 2012 11:46:37 AM org.springframework.beans.factory.support.DefaultListableBeanFactory
preInstantiateSingletons
INFO: Pre-instantiating singletons in org.springframework.beans.factory.support.DefaultListableBeanFactory@90832e:
defining beans [org.apache.oodt.commons.spring.postprocessor.SetIdBeanPostProcessor,ftp1,ftp2,ftp3,sftp1,sftp2,http1];
root of factory hierarchy
Tests run: 3, Failures: 0, Errors: 0, Skipped: 0, Time elapsed: 0.703 sec
Running org.apache.oodt.cas.protocol.cli.action.TestProtocolCliAction
Tests run: 1, Failures: 0, Errors: 0, Skipped: 0, Time elapsed: 0.002 sec
Running org.apache.oodt.cas.protocol.cli.action.TestBasicVerifyCliAction
Jun 14, 2012 11:46:37 AM org.springframework.context.support.AbstractApplicationContext prepareRefresh
INFO: Refreshing org.springframework.context.support.FileSystemXmlApplicationContext@f593af:
display name [org.springframework.context.support.FileSystemXmlApplicationContext@f593af];
startup date [Thu Jun 14 11:46:37 UTC 2012]; root of context hierarchy
Jun 14, 2012 11:46:37 AM org.springframework.beans.factory.xml.XmlBeanDefinitionReader loadBeanDefinitions
INFO: Loading XML bean definitions from file [<https://builds.apache.org/job/oodt-trunk/ws/protocol/api/src/testdata/test-protocol-config.xml]>
Jun 14, 2012 11:46:37 AM org.springframework.context.support.AbstractApplicationContext obtainFreshBeanFactory
INFO: Bean factory for application context [org.springframework.context.support.FileSystemXmlApplicationContext@f593af]:
org.springframework.beans.factory.support.DefaultListableBeanFactory@48edb5
Jun 14, 2012 11:46:37 AM org.springframework.context.support.AbstractApplicationContext$BeanPostProcessorChecker
postProcessAfterInitialization
INFO: Bean 'org.apache.oodt.commons.spring.postprocessor.SetIdBeanPostProcessor' is not eligible
for getting processed by all BeanPostProcessors (for example: not eligible for auto-proxying)
Jun 14, 2012 11:46:37 AM org.springframework.beans.factory.support.DefaultListableBeanFactory
preInstantiateSingletons
INFO: Pre-instantiating singletons in org.springframework.beans.factory.support.DefaultListableBeanFactory@48edb5:
defining beans [org.apache.oodt.commons.spring.postprocessor.SetIdBeanPostProcessor,ftp1,ftp2,ftp3,sftp1,sftp2,http1];
root of factory hierarchy
Tests run: 1, Failures: 0, Errors: 0, Skipped: 0, Time elapsed: 0.038 sec
Running org.apache.oodt.cas.protocol.cli.action.TestDownloadCliAction
Jun 14, 2012 11:46:37 AM org.springframework.context.support.AbstractApplicationContext prepareRefresh
INFO: Refreshing org.springframework.context.support.FileSystemXmlApplicationContext@1961581:
display name [org.springframework.context.support.FileSystemXmlApplicationContext@1961581];
startup date [Thu Jun 14 11:46:37 UTC 2012]; root of context hierarchy
Jun 14, 2012 11:46:37 AM org.springframework.beans.factory.xml.XmlBeanDefinitionReader loadBeanDefinitions
INFO: Loading XML bean definitions from file [<https://builds.apache.org/job/oodt-trunk/ws/protocol/api/src/testdata/test-protocol-config.xml]>
Jun 14, 2012 11:46:37 AM org.springframework.context.support.AbstractApplicationContext obtainFreshBeanFactory
INFO: Bean factory for application context [org.springframework.context.support.FileSystemXmlApplicationContext@1961581]:
org.springframework.beans.factory.support.DefaultListableBeanFactory@18c74
Jun 14, 2012 11:46:37 AM org.springframework.context.support.AbstractApplicationContext$BeanPostProcessorChecker
postProcessAfterInitialization
INFO: Bean 'org.apache.oodt.commons.spring.postprocessor.SetIdBeanPostProcessor' is not eligible
for getting processed by all BeanPostProcessors (for example: not eligible for auto-proxying)
Jun 14, 2012 11:46:37 AM org.springframework.beans.factory.support.DefaultListableBeanFactory
preInstantiateSingletons
INFO: Pre-instantiating singletons in org.springframework.beans.factory.support.DefaultListableBeanFactory@18c74:
defining beans [org.apache.oodt.commons.spring.postprocessor.SetIdBeanPostProcessor,ftp1,ftp2,ftp3,sftp1,sftp2,http1];
root of factory hierarchy
Jun 14, 2012 11:46:37 AM org.springframework.context.support.AbstractApplicationContext prepareRefresh
INFO: Refreshing org.springframework.context.support.FileSystemXmlApplicationContext@16d2702:
display name [org.springframework.context.support.FileSystemXmlApplicationContext@16d2702];
startup date [Thu Jun 14 11:46:37 UTC 2012]; root of context hierarchy
Jun 14, 2012 11:46:37 AM org.springframework.beans.factory.xml.XmlBeanDefinitionReader loadBeanDefinitions
INFO: Loading XML bean definitions from file [<https://builds.apache.org/job/oodt-trunk/ws/protocol/api/src/testdata/test-protocol-config.xml]>
Jun 14, 2012 11:46:37 AM org.springframework.context.support.AbstractApplicationContext obtainFreshBeanFactory
INFO: Bean factory for application context [org.springframework.context.support.FileSystemXmlApplicationContext@16d2702]:
org.springframework.beans.factory.support.DefaultListableBeanFactory@1d3cdaa
Jun 14, 2012 11:46:37 AM org.springframework.context.support.AbstractApplicationContext$BeanPostProcessorChecker
postProcessAfterInitialization
INFO: Bean 'org.apache.oodt.commons.spring.postprocessor.SetIdBeanPostProcessor' is not eligible
for getting processed by all BeanPostProcessors (for example: not eligible for auto-proxying)
Jun 14, 2012 11:46:37 AM org.springframework.beans.factory.support.DefaultListableBeanFactory
preInstantiateSingletons
INFO: Pre-instantiating singletons in org.springframework.beans.factory.support.DefaultListableBeanFactory@1d3cdaa:
defining beans [org.apache.oodt.commons.spring.postprocessor.SetIdBeanPostProcessor,ftp1,ftp2,ftp3,sftp1,sftp2,http1];
root of factory hierarchy
Jun 14, 2012 11:46:37 AM org.springframework.context.support.AbstractApplicationContext prepareRefresh
INFO: Refreshing org.springframework.context.support.FileSystemXmlApplicationContext@15718f2:
display name [org.springframework.context.support.FileSystemXmlApplicationContext@15718f2];
startup date [Thu Jun 14 11:46:37 UTC 2012]; root of context hierarchy
Jun 14, 2012 11:46:37 AM org.springframework.beans.factory.xml.XmlBeanDefinitionReader loadBeanDefinitions
INFO: Loading XML bean definitions from file [<https://builds.apache.org/job/oodt-trunk/ws/protocol/api/src/testdata/test-protocol-config.xml]>
Jun 14, 2012 11:46:37 AM org.springframework.context.support.AbstractApplicationContext obtainFreshBeanFactory
INFO: Bean factory for application context [org.springframework.context.support.FileSystemXmlApplicationContext@15718f2]:
org.springframework.beans.factory.support.DefaultListableBeanFactory@1b273cc
Jun 14, 2012 11:46:37 AM org.springframework.context.support.AbstractApplicationContext$BeanPostProcessorChecker
postProcessAfterInitialization
INFO: Bean 'org.apache.oodt.commons.spring.postprocessor.SetIdBeanPostProcessor' is not eligible
for getting processed by all BeanPostProcessors (for example: not eligible for auto-proxying)
Jun 14, 2012 11:46:37 AM org.springframework.beans.factory.support.DefaultListableBeanFactory
preInstantiateSingletons
INFO: Pre-instantiating singletons in org.springframework.beans.factory.support.DefaultListableBeanFactory@1b273cc:
defining beans [org.apache.oodt.commons.spring.postprocessor.SetIdBeanPostProcessor,ftp1,ftp2,ftp3,sftp1,sftp2,http1];
root of factory hierarchy
Tests run: 3, Failures: 0, Errors: 0, Skipped: 0, Time elapsed: 0.094 sec
Running org.apache.oodt.cas.protocol.TestProtocolFile
Tests run: 2, Failures: 0, Errors: 0, Skipped: 0, Time elapsed: 0.001 sec
Running org.apache.oodt.cas.protocol.auth.TestBasicAuthentication
Tests run: 2, Failures: 0, Errors: 0, Skipped: 0, Time elapsed: 0 sec
Running org.apache.oodt.cas.protocol.auth.TestNoAuthentication
Tests run: 1, Failures: 0, Errors: 0, Skipped: 0, Time elapsed: 0 sec

Results :

Tests run: 13, Failures: 0, Errors: 0, Skipped: 0

[JENKINS] Recording test results
[INFO] [jar:jar {execution: default-jar}]
[INFO] Building jar: <https://builds.apache.org/job/oodt-trunk/ws/protocol/api/target/cas-protocol-api-0.5-SNAPSHOT.jar>
[INFO] Preparing javadoc:javadoc
[WARNING] Removing: javadoc from forked lifecycle, to prevent recursive invocation.
[INFO] No goals needed for project - skipping
[WARNING] DEPRECATED [aggregate]: since 2.5. Use the goals <code>javadoc:aggregate</code>
and <code>javadoc:test-aggregate</code> instead.
[INFO] [javadoc:javadoc {execution: attach-javadocs}]
[INFO] [assembly:single {execution: default}]
[INFO] Reading assembly descriptor: src/main/assembly/assembly.xml
[INFO] Processing DependencySet (output=lib)
[INFO] Building tar : <https://builds.apache.org/job/oodt-trunk/ws/protocol/api/target/cas-protocol-api-0.5-SNAPSHOT-dist.tar.gz>
[INFO] Processing DependencySet (output=lib)
[INFO] Building zip: <https://builds.apache.org/job/oodt-trunk/ws/protocol/api/target/cas-protocol-api-0.5-SNAPSHOT-dist.zip>
[INFO] [install:install {execution: default-install}]
[INFO] Installing <https://builds.apache.org/job/oodt-trunk/ws/protocol/api/target/cas-protocol-api-0.5-SNAPSHOT.jar>
to <https://builds.apache.org/job/oodt-trunk/ws/.repository/org/apache/oodt/cas-protocol-api/0.5-SNAPSHOT/cas-protocol-api-0.5-SNAPSHOT.jar>
[INFO] Installing <https://builds.apache.org/job/oodt-trunk/ws/protocol/api/target/cas-protocol-api-0.5-SNAPSHOT-dist.tar.gz>
to <https://builds.apache.org/job/oodt-trunk/ws/.repository/org/apache/oodt/cas-protocol-api/0.5-SNAPSHOT/cas-protocol-api-0.5-SNAPSHOT-dist.tar.gz>
[INFO] Installing <https://builds.apache.org/job/oodt-trunk/ws/protocol/api/target/cas-protocol-api-0.5-SNAPSHOT-dist.zip>
to <https://builds.apache.org/job/oodt-trunk/ws/.repository/org/apache/oodt/cas-protocol-api/0.5-SNAPSHOT/cas-protocol-api-0.5-SNAPSHOT-dist.zip>
[JENKINS] Archiving <https://builds.apache.org/job/oodt-trunk/ws/protocol/api/pom.xml>
to /home/hudson/hudson/jobs/oodt-trunk/modules/org.apache.oodt$cas-protocol-api/builds/2012-06-14_08-55-55/archive/org.apache.oodt/cas-protocol-api/0.5-SNAPSHOT/cas-protocol-api-0.5-SNAPSHOT.pom
[JENKINS] Archiving <https://builds.apache.org/job/oodt-trunk/ws/protocol/api/target/cas-protocol-api-0.5-SNAPSHOT.jar>
to /home/hudson/hudson/jobs/oodt-trunk/modules/org.apache.oodt$cas-protocol-api/builds/2012-06-14_08-55-55/archive/org.apache.oodt/cas-protocol-api/0.5-SNAPSHOT/cas-protocol-api-0.5-SNAPSHOT.jar
[JENKINS] Archiving <https://builds.apache.org/job/oodt-trunk/ws/protocol/api/target/cas-protocol-api-0.5-SNAPSHOT-dist.tar.gz>
to /home/hudson/hudson/jobs/oodt-trunk/modules/org.apache.oodt$cas-protocol-api/builds/2012-06-14_08-55-55/archive/org.apache.oodt/cas-protocol-api/0.5-SNAPSHOT/cas-protocol-api-0.5-SNAPSHOT-dist.tar.gz
Build timed out (after 180 minutes). Marking the build as failed.
[INFO] ------------------------------------------------------------------------
[ERROR] FATAL ERROR
[INFO] ------------------------------------------------------------------------
channel stopped
[INFO] hudson.remoting.RequestAbortedException: hudson.remoting.Channel$OrderlyShutdown
[INFO] ------------------------------------------------------------------------
[INFO] Trace
hudson.remoting.RequestAbortedException: hudson.remoting.RequestAbortedException: hudson.remoting.Channel$OrderlyShutdown
	at hudson.remoting.Request.call(Request.java:149)
	at hudson.remoting.Channel.call(Channel.java:646)
	at hudson.remoting.RemoteInvocationHandler.invoke(RemoteInvocationHandler.java:158)
	at $Proxy2.isArchivingDisabled(Unknown Source)
	at hudson.maven.MavenBuildProxy$Filter.isArchivingDisabled(MavenBuildProxy.java:227)
	at hudson.maven.reporters.MavenArtifact.archive(MavenArtifact.java:223)
	at hudson.maven.reporters.MavenArtifactArchiver.postBuild(MavenArtifactArchiver.java:108)
	at hudson.maven.Maven2Builder.postModule(Maven2Builder.java:127)
	at hudson.maven.MavenBuilder$Adapter.fireLeaveModule(MavenBuilder.java:327)
	at hudson.maven.MavenBuilder$Adapter.postBuild(MavenBuilder.java:285)
	at org.apache.maven.lifecycle.LifecycleExecutorInterceptor.execute(LifecycleExecutorInterceptor.java:68)
	at org.apache.maven.DefaultMaven.doExecute(DefaultMaven.java:328)
	at org.apache.maven.DefaultMaven.execute(DefaultMaven.java:138)
	at org.apache.maven.cli.MavenCli.main(MavenCli.java:362)
	at sun.reflect.NativeMethodAccessorImpl.invoke0(Native Method)
	at sun.reflect.NativeMethodAccessorImpl.invoke(NativeMethodAccessorImpl.java:39)
	at sun.reflect.DelegatingMethodAccessorImpl.invoke(DelegatingMethodAccessorImpl.java:25)
	at java.lang.reflect.Method.invoke(Method.java:597)
	at org.codehaus.classworlds.Launcher.launchEnhanced(Launcher.java:315)
	at org.codehaus.classworlds.Launcher.launch(Launcher.java:255)
	at hudson.maven.agent.Main.launch(Main.java:185)
	at hudson.maven.MavenBuilder.call(MavenBuilder.java:151)
	at hudson.maven.Maven2Builder.call(Maven2Builder.java:77)
	at hudson.maven.Maven2Builder.call(Maven2Builder.java:53)
	at hudson.remoting.UserRequest.perform(UserRequest.java:118)
	at hudson.remoting.UserRequest.perform(UserRequest.java:48)
	at hudson.remoting.Request$2.run(Request.java:287)
	at hudson.remoting.InterceptingExecutorService$1.call(InterceptingExecutorService.java:72)
	at java.util.concurrent.FutureTask$Sync.innerRun(FutureTask.java:303)
	at java.util.concurrent.FutureTask.run(FutureTask.java:138)
	at java.util.concurrent.ThreadPoolExecutor$Worker.runTask(ThreadPoolExecutor.java:886)
	at java.util.concurrent.ThreadPoolExecutor$Worker.run(ThreadPoolExecutor.java:908)
	at java.lang.Thread.run(Thread.java:662)
Caused by: hudson.remoting.RequestAbortedException: hudson.remoting.Channel$OrderlyShutdown
	at hudson.remoting.Request.abort(Request.java:273)
	at hudson.remoting.Channel.terminate(Channel.java:702)
	at hudson.remoting.Channel$CloseCommand.execute(Channel.java:818)
	at hudson.remoting.Channel$1.handle(Channel.java:416)
	at hudson.remoting.SynchronousCommandTransport$ReaderThread.run(SynchronousCommandTransport.java:60)
Caused by: hudson.remoting.Channel$OrderlyShutdown
	... 3 more
Caused by: Command close created at
	at hudson.remoting.Command.<init>(Command.java:54)
	at hudson.remoting.Channel$CloseCommand.<init>(Channel.java:812)
	at hudson.remoting.Channel$CloseCommand.<init>(Channel.java:810)
	at hudson.remoting.Channel.close(Channel.java:877)
	at hudson.remoting.Channel.close(Channel.java:860)
	at hudson.slaves.Channels$1.close(Channels.java:91)
	at hudson.maven.ProcessCache$MavenProcess.discard(ProcessCache.java:145)
	at hudson.maven.MavenModuleSetBuild$RunnerImpl.doRun(MavenModuleSetBuild.java:796)
	at hudson.model.AbstractBuild$AbstractRunner.run(AbstractBuild.java:480)
	at hudson.model.Run.run(Run.java:1434)
	at hudson.maven.MavenModuleSetBuild.run(MavenModuleSetBuild.java:477)
	at hudson.model.ResourceController.execute(ResourceController.java:88)
	at hudson.model.Executor.run(Executor.java:239)
[INFO] ------------------------------------------------------------------------
[INFO] Total time: 149 minutes 50 seconds
[INFO] Finished at: Thu Jun 14 11:55:31 UTC 2012
[INFO] Final Memory: 69M/179M
[INFO] ------------------------------------------------------------------------

Mime
View raw message