oodt-dev mailing list archives

Site index · List index
Message view « Date » · « Thread »
Top « Date » · « Thread »
From Apache Jenkins Server <jenk...@builds.apache.org>
Subject Build failed in Jenkins: oodt-trunk » CAS PGE Adaptor Framework #444
Date Sat, 05 May 2012 00:27:10 GMT
See <https://builds.apache.org/job/oodt-trunk/org.apache.oodt$cas-pge/444/>

------------------------------------------
[INFO] ------------------------------------------------------------------------
[INFO] Building CAS PGE Adaptor Framework
[INFO]    task-segment: [install]
[INFO] ------------------------------------------------------------------------
[INFO] [remote-resources:process {execution: default}]
Downloading: http://repo1.maven.org/maven2/net/sf/saxon/saxon-dom/8.7/saxon-dom-8.7.pom

Downloading: http://repo1.maven.org/maven2/net/sf/saxon/saxon/8.7/saxon-8.7.pom

Downloading: http://repo1.maven.org/maven2/net/sf/saxon/saxon-dom/8.7/saxon-dom-8.7.jar

Downloading: http://repo1.maven.org/maven2/net/sf/saxon/saxon/8.7/saxon-8.7.jar

[INFO] [resources:resources {execution: default-resources}]
[INFO] Using 'UTF-8' encoding to copy filtered resources.
[INFO] Copying 14 resources
[INFO] Copying 3 resources
[INFO] [compiler:compile {execution: default-compile}]
[INFO] Compiling 20 source files to <https://builds.apache.org/job/oodt-trunk/org.apache.oodt$cas-pge/ws/target/classes>
[INFO] [resources:testResources {execution: default-testResources}]
[INFO] Using 'UTF-8' encoding to copy filtered resources.
[INFO] skip non existing resourceDirectory <https://builds.apache.org/job/oodt-trunk/org.apache.oodt$cas-pge/ws/src/test/resources>
[INFO] Copying 3 resources
[INFO] [compiler:testCompile {execution: default-testCompile}]
[INFO] Compiling 8 source files to <https://builds.apache.org/job/oodt-trunk/org.apache.oodt$cas-pge/ws/target/test-classes>
[INFO] -------------------------------------------------------------
[ERROR] COMPILATION ERROR : 
[INFO] -------------------------------------------------------------
[ERROR] <https://builds.apache.org/job/oodt-trunk/org.apache.oodt$cas-pge/ws/src/test/org/apache/oodt/cas/pge/staging/TestFileStager.java>:[131,51]
cannot find symbol
symbol  : class IArgumentMatcher
location: class org.apache.oodt.cas.pge.staging.TestFileStager
[ERROR] <https://builds.apache.org/job/oodt-trunk/org.apache.oodt$cas-pge/ws/src/test/org/apache/oodt/cas/pge/staging/TestFileStager.java>:[139,6]
method does not override or implement a method from a supertype
[ERROR] <https://builds.apache.org/job/oodt-trunk/org.apache.oodt$cas-pge/ws/src/test/org/apache/oodt/cas/pge/staging/TestFileStager.java>:[147,6]
method does not override or implement a method from a supertype
[ERROR] <https://builds.apache.org/job/oodt-trunk/org.apache.oodt$cas-pge/ws/src/test/org/apache/oodt/cas/pge/staging/TestFileStager.java>:[156,17]
reportMatcher(org.easymock.IArgumentMatcher) in org.easymock.EasyMock cannot be applied to
(org.apache.oodt.cas.pge.staging.TestFileStager.ProductIdMatcher)
[INFO] 4 errors 
[INFO] -------------------------------------------------------------
[JENKINS] Archiving <https://builds.apache.org/job/oodt-trunk/org.apache.oodt$cas-pge/ws/pom.xml>
to /home/hudson/hudson/jobs/oodt-trunk/modules/org.apache.oodt$cas-pge/builds/2012-05-05_00-11-34/archive/org.apache.oodt/cas-pge/0.4-SNAPSHOT/cas-pge-0.4-SNAPSHOT.pom
[INFO] ------------------------------------------------------------------------
[ERROR] BUILD FAILURE
[INFO] ------------------------------------------------------------------------
[INFO] Compilation failure

<https://builds.apache.org/job/oodt-trunk/org.apache.oodt$cas-pge/ws/src/test/org/apache/oodt/cas/pge/staging/TestFileStager.java>:[131,51]
cannot find symbol
symbol  : class IArgumentMatcher
location: class org.apache.oodt.cas.pge.staging.TestFileStager
<https://builds.apache.org/job/oodt-trunk/org.apache.oodt$cas-pge/ws/src/test/org/apache/oodt/cas/pge/staging/TestFileStager.java>:[139,6]
method does not override or implement a method from a supertype
<https://builds.apache.org/job/oodt-trunk/org.apache.oodt$cas-pge/ws/src/test/org/apache/oodt/cas/pge/staging/TestFileStager.java>:[147,6]
method does not override or implement a method from a supertype
<https://builds.apache.org/job/oodt-trunk/org.apache.oodt$cas-pge/ws/src/test/org/apache/oodt/cas/pge/staging/TestFileStager.java>:[156,17]
reportMatcher(org.easymock.IArgumentMatcher) in org.easymock.EasyMock cannot be applied to
(org.apache.oodt.cas.pge.staging.TestFileStager.ProductIdMatcher)

[INFO] ------------------------------------------------------------------------
[INFO] For more information, run Maven with the -e switch
[INFO] ------------------------------------------------------------------------
[INFO] Total time: 15 minutes 27 seconds
[INFO] Finished at: Sat May 05 00:27:08 UTC 2012
[INFO] Final Memory: 127M/378M
[INFO] ------------------------------------------------------------------------
Waiting for Jenkins to finish collecting data

Mime
View raw message