oodt-dev mailing list archives

Site index · List index
Message view « Date » · « Thread »
Top « Date » · « Thread »
From Apache Jenkins Server <jenk...@builds.apache.org>
Subject Build failed in Jenkins: oodt-trunk #487
Date Wed, 30 May 2012 16:14:32 GMT
See <https://builds.apache.org/job/oodt-trunk/487/changes>

Changes:

[luca] Updated CHANGES with OODT-463 resolution.

------------------------------------------
[...truncated 6508 lines...]
Downloading: http://repo1.maven.org/maven2/org/springframework/spring-context/2.5.4/spring-context-2.5.4.jar

[INFO] [resources:resources {execution: default-resources}]
[INFO] Using 'UTF-8' encoding to copy filtered resources.
[INFO] Copying 4 resources to org/apache/oodt/cas/crawl
[INFO] Copying 3 resources
[INFO] [compiler:compile {execution: default-compile}]
[INFO] Compiling 41 source files to <https://builds.apache.org/job/oodt-trunk/ws/crawler/target/classes>
[INFO] [resources:testResources {execution: default-testResources}]
[INFO] Using 'UTF-8' encoding to copy filtered resources.
[INFO] skip non existing resourceDirectory <https://builds.apache.org/job/oodt-trunk/ws/crawler/src/test/resources>
[INFO] Copying 3 resources
[INFO] [compiler:testCompile {execution: default-testCompile}]
[INFO] Compiling 5 source files to <https://builds.apache.org/job/oodt-trunk/ws/crawler/target/test-classes>
[INFO] [surefire:test {execution: default-test}]
[INFO] Surefire report directory: <https://builds.apache.org/job/oodt-trunk/ws/crawler/target/surefire-reports>

-------------------------------------------------------
 T E S T S
-------------------------------------------------------
Running org.apache.oodt.cas.crawl.cli.option.handler.TestCrawlerBeansPropHandler
Tests run: 1, Failures: 0, Errors: 0, Skipped: 0, Time elapsed: 0.03 sec
Running org.apache.oodt.cas.crawl.option.TestBooleanOptions
Tests run: 1, Failures: 0, Errors: 0, Skipped: 0, Time elapsed: 0.034 sec
Running org.apache.oodt.cas.crawl.typedetection.TestMimeExtractorConfigReader
Tests run: 2, Failures: 0, Errors: 0, Skipped: 0, Time elapsed: 0.181 sec
Running org.apache.oodt.cas.crawl.TestProductCrawler
Tests run: 19, Failures: 0, Errors: 0, Skipped: 0, Time elapsed: 2.16 sec

Results :

Tests run: 23, Failures: 0, Errors: 0, Skipped: 0

[JENKINS] Recording test results
[INFO] [jar:jar {execution: default-jar}]
[INFO] Building jar: <https://builds.apache.org/job/oodt-trunk/ws/crawler/target/cas-crawler-0.4-SNAPSHOT.jar>
[INFO] Preparing javadoc:javadoc
[WARNING] Removing: javadoc from forked lifecycle, to prevent recursive invocation.
[INFO] No goals needed for project - skipping
[WARNING] DEPRECATED [aggregate]: since 2.5. Use the goals <code>javadoc:aggregate</code>
and <code>javadoc:test-aggregate</code> instead.
[INFO] [javadoc:javadoc {execution: attach-javadocs}]
[INFO] [assembly:single {execution: default}]
[INFO] Reading assembly descriptor: src/main/assembly/assembly.xml
[INFO] Processing DependencySet (output=lib)
[INFO] Building tar : <https://builds.apache.org/job/oodt-trunk/ws/crawler/target/cas-crawler-0.4-SNAPSHOT-dist.tar.gz>
[INFO] Processing DependencySet (output=lib)
[INFO] Building zip: <https://builds.apache.org/job/oodt-trunk/ws/crawler/target/cas-crawler-0.4-SNAPSHOT-dist.zip>
[INFO] [install:install {execution: default-install}]
[INFO] Installing <https://builds.apache.org/job/oodt-trunk/ws/crawler/target/cas-crawler-0.4-SNAPSHOT.jar>
to <https://builds.apache.org/job/oodt-trunk/ws/.repository/org/apache/oodt/cas-crawler/0.4-SNAPSHOT/cas-crawler-0.4-SNAPSHOT.jar>
[INFO] Installing <https://builds.apache.org/job/oodt-trunk/ws/crawler/target/cas-crawler-0.4-SNAPSHOT-dist.tar.gz>
to <https://builds.apache.org/job/oodt-trunk/ws/.repository/org/apache/oodt/cas-crawler/0.4-SNAPSHOT/cas-crawler-0.4-SNAPSHOT-dist.tar.gz>
[INFO] Installing <https://builds.apache.org/job/oodt-trunk/ws/crawler/target/cas-crawler-0.4-SNAPSHOT-dist.zip>
to <https://builds.apache.org/job/oodt-trunk/ws/.repository/org/apache/oodt/cas-crawler/0.4-SNAPSHOT/cas-crawler-0.4-SNAPSHOT-dist.zip>
[JENKINS] Archiving <https://builds.apache.org/job/oodt-trunk/ws/crawler/pom.xml> to
/home/hudson/hudson/jobs/oodt-trunk/modules/org.apache.oodt$cas-crawler/builds/2012-05-30_13-14-31/archive/org.apache.oodt/cas-crawler/0.4-SNAPSHOT/cas-crawler-0.4-SNAPSHOT.pom
[JENKINS] Archiving <https://builds.apache.org/job/oodt-trunk/ws/crawler/target/cas-crawler-0.4-SNAPSHOT.jar>
to /home/hudson/hudson/jobs/oodt-trunk/modules/org.apache.oodt$cas-crawler/builds/2012-05-30_13-14-31/archive/org.apache.oodt/cas-crawler/0.4-SNAPSHOT/cas-crawler-0.4-SNAPSHOT.jar
[JENKINS] Archiving <https://builds.apache.org/job/oodt-trunk/ws/crawler/target/cas-crawler-0.4-SNAPSHOT-dist.tar.gz>
to /home/hudson/hudson/jobs/oodt-trunk/modules/org.apache.oodt$cas-crawler/builds/2012-05-30_13-14-31/archive/org.apache.oodt/cas-crawler/0.4-SNAPSHOT/cas-crawler-0.4-SNAPSHOT-dist.tar.gz
[JENKINS] Archiving <https://builds.apache.org/job/oodt-trunk/ws/crawler/target/cas-crawler-0.4-SNAPSHOT-dist.zip>
to /home/hudson/hudson/jobs/oodt-trunk/modules/org.apache.oodt$cas-crawler/builds/2012-05-30_13-14-31/archive/org.apache.oodt/cas-crawler/0.4-SNAPSHOT/cas-crawler-0.4-SNAPSHOT-dist.zip
[INFO] ------------------------------------------------------------------------
[INFO] Building CAS Curation Interface
[INFO]    task-segment: [install]
[INFO] ------------------------------------------------------------------------
Downloading: http://repo1.maven.org/maven2/org/apache/maven/plugins/maven-war-plugin/2.1-alpha-2/maven-war-plugin-2.1-alpha-2.pom

Downloading: http://repo1.maven.org/maven2/org/apache/maven/plugins/maven-plugins/11/maven-plugins-11.pom

Downloading: http://repo1.maven.org/maven2/org/apache/maven/plugins/maven-war-plugin/2.1-alpha-2/maven-war-plugin-2.1-alpha-2.jar

[INFO] [remote-resources:process {execution: default}]
Downloading: http://mirrors.ibiblio.org/pub/mirrors/maven2/commons-fileupload/commons-fileupload/1.2.1/commons-fileupload-1.2.1.pom
7K downloaded  (commons-fileupload-1.2.1.pom)
Downloading: http://mirrors.ibiblio.org/pub/mirrors/maven2/commons-collections/commons-collections/3.2.1/commons-collections-3.2.1.pom
12K downloaded  (commons-collections-3.2.1.pom)
Downloading: http://mirrors.ibiblio.org/pub/mirrors/maven2/net/sf/json-lib/json-lib/2.3/json-lib-2.3.pom
13K downloaded  (json-lib-2.3.pom)
[WARNING] *** CHECKSUM FAILED - Error retrieving checksum file for net/sf/json-lib/json-lib/2.3/json-lib-2.3.pom
- IGNORING
Downloading: http://mirrors.ibiblio.org/pub/mirrors/maven2/commons-beanutils/commons-beanutils/1.8.0/commons-beanutils-1.8.0.pom
10K downloaded  (commons-beanutils-1.8.0.pom)
Downloading: http://mirrors.ibiblio.org/pub/mirrors/maven2/net/sf/ezmorph/ezmorph/1.0.6/ezmorph-1.0.6.pom
6K downloaded  (ezmorph-1.0.6.pom)
Downloading: http://mirrors.ibiblio.org/pub/mirrors/maven2/org/apache/cxf/cxf-rt-frontend-jaxrs/2.3.1/cxf-rt-frontend-jaxrs-2.3.1.pom
6K downloaded  (cxf-rt-frontend-jaxrs-2.3.1.pom)
Downloading: http://mirrors.ibiblio.org/pub/mirrors/maven2/org/apache/cxf/cxf-parent/2.3.1/cxf-parent-2.3.1.pom
65K downloaded  (cxf-parent-2.3.1.pom)
Downloading: http://mirrors.ibiblio.org/pub/mirrors/maven2/org/apache/cxf/cxf/2.3.1/cxf-2.3.1.pom
32K downloaded  (cxf-2.3.1.pom)
Downloading: http://mirrors.ibiblio.org/pub/mirrors/maven2/org/apache/cxf/cxf-common-utilities/2.3.1/cxf-common-utilities-2.3.1.pom
6K downloaded  (cxf-common-utilities-2.3.1.pom)
Downloading: http://mirrors.ibiblio.org/pub/mirrors/maven2/org/apache/ws/commons/schema/XmlSchema/1.4.7/XmlSchema-1.4.7.pom
16K downloaded  (XmlSchema-1.4.7.pom)
Downloading: http://mirrors.ibiblio.org/pub/mirrors/maven2/org/codehaus/woodstox/woodstox-core-asl/4.0.8/woodstox-core-asl-4.0.8.pom
1K downloaded  (woodstox-core-asl-4.0.8.pom)
Downloading: http://mirrors.ibiblio.org/pub/mirrors/maven2/org/codehaus/woodstox/stax2-api/3.0.2/stax2-api-3.0.2.pom
1K downloaded  (stax2-api-3.0.2.pom)
Downloading: http://mirrors.ibiblio.org/pub/mirrors/maven2/org/apache/cxf/cxf-api/2.3.1/cxf-api-2.3.1.pom
11K downloaded  (cxf-api-2.3.1.pom)
Downloading: http://mirrors.ibiblio.org/pub/mirrors/maven2/org/apache/neethi/neethi/2.0.4/neethi-2.0.4.pom
9K downloaded  (neethi-2.0.4.pom)
Downloading: http://mirrors.ibiblio.org/pub/mirrors/maven2/wsdl4j/wsdl4j/1.6.2/wsdl4j-1.6.2.pom
939b downloaded  (wsdl4j-1.6.2.pom)
Downloading: http://mirrors.ibiblio.org/pub/mirrors/maven2/org/apache/cxf/cxf-common-schemas/2.3.1/cxf-common-schemas-2.3.1.pom
1K downloaded  (cxf-common-schemas-2.3.1.pom)
Downloading: http://mirrors.ibiblio.org/pub/mirrors/maven2/org/apache/cxf/cxf-rt-core/2.3.1/cxf-rt-core-2.3.1.pom
3K downloaded  (cxf-rt-core-2.3.1.pom)
Downloading: http://mirrors.ibiblio.org/pub/mirrors/maven2/com/sun/xml/bind/jaxb-impl/2.1.13/jaxb-impl-2.1.13.pom
2K downloaded  (jaxb-impl-2.1.13.pom)
Downloading: http://mirrors.ibiblio.org/pub/mirrors/maven2/org/apache/geronimo/specs/geronimo-javamail_1.4_spec/1.7.1/geronimo-javamail_1.4_spec-1.7.1.pom
6K downloaded  (geronimo-javamail_1.4_spec-1.7.1.pom)
Downloading: http://mirrors.ibiblio.org/pub/mirrors/maven2/javax/ws/rs/jsr311-api/1.1.1/jsr311-api-1.1.1.pom
5K downloaded  (jsr311-api-1.1.1.pom)
Downloading: http://mirrors.ibiblio.org/pub/mirrors/maven2/org/apache/cxf/cxf-rt-bindings-xml/2.3.1/cxf-rt-bindings-xml-2.3.1.pom
4K downloaded  (cxf-rt-bindings-xml-2.3.1.pom)
Downloading: http://mirrors.ibiblio.org/pub/mirrors/maven2/org/apache/cxf/cxf-rt-transports-http/2.3.1/cxf-rt-transports-http-2.3.1.pom
4K downloaded  (cxf-rt-transports-http-2.3.1.pom)
Downloading: http://mirrors.ibiblio.org/pub/mirrors/maven2/org/springframework/spring-web/3.0.5.RELEASE/spring-web-3.0.5.RELEASE.pom
4K downloaded  (spring-web-3.0.5.RELEASE.pom)
Downloading: http://mirrors.ibiblio.org/pub/mirrors/maven2/org/apache/cxf/cxf-rt-databinding-aegis/2.3.1/cxf-rt-databinding-aegis-2.3.1.pom
5K downloaded  (cxf-rt-databinding-aegis-2.3.1.pom)
Downloading: http://mirrors.ibiblio.org/pub/mirrors/maven2/org/codehaus/jettison/jettison/1.2/jettison-1.2.pom
3K downloaded  (jettison-1.2.pom)
Downloading: http://mirrors.ibiblio.org/pub/mirrors/maven2/org/apache/xmlbeans/xmlbeans/2.4.0/xmlbeans-2.4.0.pom
4K downloaded  (xmlbeans-2.4.0.pom)
Downloading: http://mirrors.ibiblio.org/pub/mirrors/maven2/net/sf/json-lib/json-lib/2.3/json-lib-2.3-jdk15.jar
Downloading: http://mirrors.ibiblio.org/pub/mirrors/maven2/javax/ws/rs/jsr311-api/1.1.1/jsr311-api-1.1.1.jar
Downloading: http://mirrors.ibiblio.org/pub/mirrors/maven2/org/codehaus/jettison/jettison/1.2/jettison-1.2.jar
Downloading: http://mirrors.ibiblio.org/pub/mirrors/maven2/org/apache/xmlbeans/xmlbeans/2.4.0/xmlbeans-2.4.0.jar
Downloading: http://mirrors.ibiblio.org/pub/mirrors/maven2/commons-fileupload/commons-fileupload/1.2.1/commons-fileupload-1.2.1.jar
70K downloaded  (jettison-1.2.jar)
Downloading: http://mirrors.ibiblio.org/pub/mirrors/maven2/com/sun/xml/bind/jaxb-impl/2.1.13/jaxb-impl-2.1.13.jar
45K downloaded  (jsr311-api-1.1.1.jar)
Downloading: http://mirrors.ibiblio.org/pub/mirrors/maven2/commons-collections/commons-collections/3.2.1/commons-collections-3.2.1.jar
148K downloaded  (json-lib-2.3-jdk15.jar)
[WARNING] Unable to get resource 'net.sf.json-lib:json-lib:jar:jdk15:2.3' from repository
ibiblio (http://mirrors.ibiblio.org/pub/mirrors/maven2): Authorization failed: Access denied
to: http://mirrors.ibiblio.org/pub/mirrors/maven2/net/sf/json-lib/json-lib/2.3/json-lib-2.3-jdk15.jar.sha1
Downloading: http://download.java.net/maven/2//net/sf/json-lib/json-lib/2.3/json-lib-2.3-jdk15.jar
[INFO] Unable to find resource 'net.sf.json-lib:json-lib:jar:jdk15:2.3' in repository maven2-repository.dev.java.net
(http://download.java.net/maven/2/)
Downloading: http://repo1.maven.org/maven2/net/sf/json-lib/json-lib/2.3/json-lib-2.3-jdk15.jar

[WARNING] *** CHECKSUM FAILED - Error retrieving checksum file for net/sf/json-lib/json-lib/2.3/json-lib-2.3-jdk15.jar
- IGNORING
Downloading: http://mirrors.ibiblio.org/pub/mirrors/maven2/org/apache/neethi/neethi/2.0.4/neethi-2.0.4.jar
[WARNING] Unable to get resource 'org.apache.neethi:neethi:jar:2.0.4' from repository ibiblio
(http://mirrors.ibiblio.org/pub/mirrors/maven2): Authorization failed: Access denied to: http://mirrors.ibiblio.org/pub/mirrors/maven2/org/apache/neethi/neethi/2.0.4/neethi-2.0.4.jar
Downloading: http://download.java.net/maven/2//org/apache/neethi/neethi/2.0.4/neethi-2.0.4.jar
[INFO] Unable to find resource 'org.apache.neethi:neethi:jar:2.0.4' in repository maven2-repository.dev.java.net
(http://download.java.net/maven/2/)
Downloading: http://repo1.maven.org/maven2/org/apache/neethi/neethi/2.0.4/neethi-2.0.4.jar

Downloading: http://mirrors.ibiblio.org/pub/mirrors/maven2/wsdl4j/wsdl4j/1.6.2/wsdl4j-1.6.2.jar
[WARNING] Unable to get resource 'wsdl4j:wsdl4j:jar:1.6.2' from repository ibiblio (http://mirrors.ibiblio.org/pub/mirrors/maven2):
Error transferring file: Connection refused
Downloading: http://download.java.net/maven/2//wsdl4j/wsdl4j/1.6.2/wsdl4j-1.6.2.jar
[INFO] Unable to find resource 'wsdl4j:wsdl4j:jar:1.6.2' in repository maven2-repository.dev.java.net
(http://download.java.net/maven/2/)
Downloading: http://repo1.maven.org/maven//wsdl4j/jars/wsdl4j-1.6.2.jar

Downloading: http://mirrors.ibiblio.org/pub/mirrors/maven2/net/sf/ezmorph/ezmorph/1.0.6/ezmorph-1.0.6.jar
[WARNING] Unable to get resource 'net.sf.ezmorph:ezmorph:jar:1.0.6' from repository ibiblio
(http://mirrors.ibiblio.org/pub/mirrors/maven2): Error transferring file: Connection refused
Downloading: http://download.java.net/maven/2//net/sf/ezmorph/ezmorph/1.0.6/ezmorph-1.0.6.jar
[INFO] Unable to find resource 'net.sf.ezmorph:ezmorph:jar:1.0.6' in repository maven2-repository.dev.java.net
(http://download.java.net/maven/2/)
Downloading: http://repo1.maven.org/maven2/net/sf/ezmorph/ezmorph/1.0.6/ezmorph-1.0.6.jar

Downloading: http://mirrors.ibiblio.org/pub/mirrors/maven2/commons-beanutils/commons-beanutils/1.8.0/commons-beanutils-1.8.0.jar
[WARNING] Unable to get resource 'commons-beanutils:commons-beanutils:jar:1.8.0' from repository
ibiblio (http://mirrors.ibiblio.org/pub/mirrors/maven2): Error transferring file: Connection
refused
Downloading: http://download.java.net/maven/2//commons-beanutils/commons-beanutils/1.8.0/commons-beanutils-1.8.0.jar
[INFO] Unable to find resource 'commons-beanutils:commons-beanutils:jar:1.8.0' in repository
maven2-repository.dev.java.net (http://download.java.net/maven/2/)
Downloading: http://repo1.maven.org/maven2/commons-beanutils/commons-beanutils/1.8.0/commons-beanutils-1.8.0.jar

Downloading: http://mirrors.ibiblio.org/pub/mirrors/maven2/org/apache/ws/commons/schema/XmlSchema/1.4.7/XmlSchema-1.4.7.jar
[WARNING] Unable to get resource 'org.apache.ws.commons.schema:XmlSchema:jar:1.4.7' from repository
ibiblio (http://mirrors.ibiblio.org/pub/mirrors/maven2): Error transferring file: Connection
refused
Downloading: http://download.java.net/maven/2//org/apache/ws/commons/schema/XmlSchema/1.4.7/XmlSchema-1.4.7.jar
[INFO] Unable to find resource 'org.apache.ws.commons.schema:XmlSchema:jar:1.4.7' in repository
maven2-repository.dev.java.net (http://download.java.net/maven/2/)
Downloading: http://repo1.maven.org/maven2/org/apache/ws/commons/schema/XmlSchema/1.4.7/XmlSchema-1.4.7.jar

Downloading: http://mirrors.ibiblio.org/pub/mirrors/maven2/org/apache/cxf/cxf-rt-frontend-jaxrs/2.3.1/cxf-rt-frontend-jaxrs-2.3.1.jar
[WARNING] Unable to get resource 'org.apache.cxf:cxf-rt-frontend-jaxrs:jar:2.3.1' from repository
ibiblio (http://mirrors.ibiblio.org/pub/mirrors/maven2): Error transferring file: Connection
refused
Downloading: http://download.java.net/maven/2//org/apache/cxf/cxf-rt-frontend-jaxrs/2.3.1/cxf-rt-frontend-jaxrs-2.3.1.jar
[INFO] Unable to find resource 'org.apache.cxf:cxf-rt-frontend-jaxrs:jar:2.3.1' in repository
maven2-repository.dev.java.net (http://download.java.net/maven/2/)
Downloading: http://repo1.maven.org/maven2/org/apache/cxf/cxf-rt-frontend-jaxrs/2.3.1/cxf-rt-frontend-jaxrs-2.3.1.jar

Downloading: http://mirrors.ibiblio.org/pub/mirrors/maven2/org/codehaus/woodstox/woodstox-core-asl/4.0.8/woodstox-core-asl-4.0.8.jar
[WARNING] Unable to get resource 'org.codehaus.woodstox:woodstox-core-asl:jar:4.0.8' from
repository ibiblio (http://mirrors.ibiblio.org/pub/mirrors/maven2): Error transferring file:
Connection refused
Downloading: http://download.java.net/maven/2//org/codehaus/woodstox/woodstox-core-asl/4.0.8/woodstox-core-asl-4.0.8.jar
[INFO] Unable to find resource 'org.codehaus.woodstox:woodstox-core-asl:jar:4.0.8' in repository
maven2-repository.dev.java.net (http://download.java.net/maven/2/)
Downloading: http://repo1.maven.org/maven2/org/codehaus/woodstox/woodstox-core-asl/4.0.8/woodstox-core-asl-4.0.8.jar

Downloading: http://mirrors.ibiblio.org/pub/mirrors/maven2/commons-io/commons-io/1.3.2/commons-io-1.3.2.jar
[WARNING] Unable to get resource 'commons-io:commons-io:jar:1.3.2' from repository ibiblio
(http://mirrors.ibiblio.org/pub/mirrors/maven2): Error transferring file: Connection refused
Downloading: http://download.java.net/maven/2//commons-io/commons-io/1.3.2/commons-io-1.3.2.jar
[INFO] Unable to find resource 'commons-io:commons-io:jar:1.3.2' in repository maven2-repository.dev.java.net
(http://download.java.net/maven/2/)
Downloading: http://repo1.maven.org/maven2/commons-io/commons-io/1.3.2/commons-io-1.3.2.jar

Downloading: http://mirrors.ibiblio.org/pub/mirrors/maven2/org/apache/cxf/cxf-common-utilities/2.3.1/cxf-common-utilities-2.3.1.jar
[WARNING] Unable to get resource 'org.apache.cxf:cxf-common-utilities:jar:2.3.1' from repository
ibiblio (http://mirrors.ibiblio.org/pub/mirrors/maven2): Error transferring file: Connection
refused
Downloading: http://download.java.net/maven/2//org/apache/cxf/cxf-common-utilities/2.3.1/cxf-common-utilities-2.3.1.jar
[INFO] Unable to find resource 'org.apache.cxf:cxf-common-utilities:jar:2.3.1' in repository
maven2-repository.dev.java.net (http://download.java.net/maven/2/)
Downloading: http://repo1.maven.org/maven2/org/apache/cxf/cxf-common-utilities/2.3.1/cxf-common-utilities-2.3.1.jar

Downloading: http://mirrors.ibiblio.org/pub/mirrors/maven2/org/codehaus/woodstox/stax2-api/3.0.2/stax2-api-3.0.2.jar
[WARNING] Unable to get resource 'org.codehaus.woodstox:stax2-api:jar:3.0.2' from repository
ibiblio (http://mirrors.ibiblio.org/pub/mirrors/maven2): Error transferring file: Connection
refused
Downloading: http://download.java.net/maven/2//org/codehaus/woodstox/stax2-api/3.0.2/stax2-api-3.0.2.jar
[INFO] Unable to find resource 'org.codehaus.woodstox:stax2-api:jar:3.0.2' in repository maven2-repository.dev.java.net
(http://download.java.net/maven/2/)
Downloading: http://repo1.maven.org/maven2/org/codehaus/woodstox/stax2-api/3.0.2/stax2-api-3.0.2.jar

Downloading: http://mirrors.ibiblio.org/pub/mirrors/maven2/org/apache/geronimo/specs/geronimo-javamail_1.4_spec/1.7.1/geronimo-javamail_1.4_spec-1.7.1.jar
[WARNING] Unable to get resource 'org.apache.geronimo.specs:geronimo-javamail_1.4_spec:jar:1.7.1'
from repository ibiblio (http://mirrors.ibiblio.org/pub/mirrors/maven2): Error transferring
file: Connection refused
Downloading: http://download.java.net/maven/2//org/apache/geronimo/specs/geronimo-javamail_1.4_spec/1.7.1/geronimo-javamail_1.4_spec-1.7.1.jar
[INFO] Unable to find resource 'org.apache.geronimo.specs:geronimo-javamail_1.4_spec:jar:1.7.1'
in repository maven2-repository.dev.java.net (http://download.java.net/maven/2/)
Downloading: http://repo1.maven.org/maven2/org/apache/geronimo/specs/geronimo-javamail_1.4_spec/1.7.1/geronimo-javamail_1.4_spec-1.7.1.jar

Downloading: http://mirrors.ibiblio.org/pub/mirrors/maven2/org/apache/cxf/cxf-api/2.3.1/cxf-api-2.3.1.jar
317K downloaded  (cxf-api-2.3.1.jar)
Downloading: http://mirrors.ibiblio.org/pub/mirrors/maven2/org/apache/cxf/cxf-common-schemas/2.3.1/cxf-common-schemas-2.3.1.jar
47K downloaded  (cxf-common-schemas-2.3.1.jar)
Downloading: http://mirrors.ibiblio.org/pub/mirrors/maven2/org/apache/cxf/cxf-rt-core/2.3.1/cxf-rt-core-2.3.1.jar
447K downloaded  (cxf-rt-core-2.3.1.jar)
561K downloaded  (commons-collections-3.2.1.jar)
Downloading: http://mirrors.ibiblio.org/pub/mirrors/maven2/org/springframework/spring-web/3.0.5.RELEASE/spring-web-3.0.5.RELEASE.jar
386K downloaded  (spring-web-3.0.5.RELEASE.jar)
856K downloaded  (jaxb-impl-2.1.13.jar)
Downloading: http://mirrors.ibiblio.org/pub/mirrors/maven2/org/apache/cxf/cxf-rt-bindings-xml/2.3.1/cxf-rt-bindings-xml-2.3.1.jar
36K downloaded  (cxf-rt-bindings-xml-2.3.1.jar)
Downloading: http://mirrors.ibiblio.org/pub/mirrors/maven2/org/apache/cxf/cxf-rt-transports-http/2.3.1/cxf-rt-transports-http-2.3.1.jar
202K downloaded  (cxf-rt-transports-http-2.3.1.jar)
Downloading: http://mirrors.ibiblio.org/pub/mirrors/maven2/org/apache/cxf/cxf-rt-databinding-aegis/2.3.1/cxf-rt-databinding-aegis-2.3.1.jar
231K downloaded  (cxf-rt-databinding-aegis-2.3.1.jar)
2630K downloaded  (xmlbeans-2.4.0.jar)
[WARNING] Unable to get resource 'org.apache.xmlbeans:xmlbeans:jar:2.4.0' from repository
ibiblio (http://mirrors.ibiblio.org/pub/mirrors/maven2): Error transferring file: Connection
timed out
Downloading: http://download.java.net/maven/2//org/apache/xmlbeans/xmlbeans/2.4.0/xmlbeans-2.4.0.jar
[INFO] Unable to find resource 'org.apache.xmlbeans:xmlbeans:jar:2.4.0' in repository maven2-repository.dev.java.net
(http://download.java.net/maven/2/)
Downloading: http://repo1.maven.org/maven2/org/apache/xmlbeans/xmlbeans/2.4.0/xmlbeans-2.4.0.jar

Build timed out (after 180 minutes). Marking the build as failed.
[INFO] ------------------------------------------------------------------------
[ERROR] FATAL ERROR
[INFO] ------------------------------------------------------------------------
[INFO] Unable to call isArchivingDisabled. Invalid object ID 28
[INFO] ------------------------------------------------------------------------
[INFO] Trace
java.lang.IllegalStateException: Unable to call isArchivingDisabled. Invalid object ID 28
	at hudson.remoting.RemoteInvocationHandler$RPCRequest.perform(RemoteInvocationHandler.java:268)
	at hudson.remoting.RemoteInvocationHandler$RPCRequest.call(RemoteInvocationHandler.java:255)
	at hudson.remoting.RemoteInvocationHandler$RPCRequest.call(RemoteInvocationHandler.java:215)
	at hudson.remoting.UserRequest.perform(UserRequest.java:118)
	at hudson.remoting.UserRequest.perform(UserRequest.java:48)
	at hudson.remoting.Request$2.run(Request.java:287)
	at hudson.remoting.InterceptingExecutorService$1.call(InterceptingExecutorService.java:72)
	at java.util.concurrent.FutureTask$Sync.innerRun(FutureTask.java:334)
	at java.util.concurrent.FutureTask.run(FutureTask.java:166)
	at java.util.concurrent.ThreadPoolExecutor.runWorker(ThreadPoolExecutor.java:1110)
	at java.util.concurrent.ThreadPoolExecutor$Worker.run(ThreadPoolExecutor.java:603)
	at java.lang.Thread.run(Thread.java:722)
[INFO] ------------------------------------------------------------------------
[INFO] Total time: 179 minutes 52 seconds
[INFO] Finished at: Wed May 30 16:14:30 UTC 2012
[INFO] Final Memory: 103M/332M
[INFO] ------------------------------------------------------------------------
channel stopped

Mime
View raw message