oodt-dev mailing list archives

Site index · List index
Message view « Date » · « Thread »
Top « Date » · « Thread »
From Apache Jenkins Server <jenk...@builds.apache.org>
Subject Build failed in Jenkins: oodt-trunk » Catalog and Archive Service Generic Multi-valued Metadata Container #378
Date Tue, 27 Mar 2012 07:01:12 GMT
See <https://builds.apache.org/job/oodt-trunk/org.apache.oodt$cas-metadata/378/>

------------------------------------------
[INFO] ------------------------------------------------------------------------
[INFO] Building Catalog and Archive Service Generic Multi-valued Metadata Container
[INFO]    task-segment: [install]
[INFO] ------------------------------------------------------------------------
Downloading: http://repo1.maven.org/maven2/org/apache/maven/plugins/maven-surefire-plugin/2.8.1/maven-surefire-plugin-2.8.1.pom

Downloading: http://repo1.maven.org/maven2/org/apache/maven/surefire/surefire/2.8.1/surefire-2.8.1.pom

Downloading: http://repo1.maven.org/maven2/org/apache/maven/maven-parent/19/maven-parent-19.pom

Downloading: http://repo1.maven.org/maven2/org/apache/maven/plugins/maven-surefire-plugin/2.8.1/maven-surefire-plugin-2.8.1.jar

[INFO] [remote-resources:process {execution: default}]
Downloading: http://repo1.maven.org/maven2/org/apache/tika/tika-core/0.8/tika-core-0.8.pom

Downloading: http://repo1.maven.org/maven2/org/apache/tika/tika-parent/0.8/tika-parent-0.8.pom

Downloading: http://repo1.maven.org/maven2/org/apache/tika/tika-core/0.8/tika-core-0.8.jar

[INFO] [resources:resources {execution: default-resources}]
[INFO] Using 'UTF-8' encoding to copy filtered resources.
[INFO] Copying 1 resource to org/apache/oodt/cas/metadata/util
[INFO] Copying 3 resources
[INFO] [compiler:compile {execution: default-compile}]
[INFO] Compiling 39 source files to <https://builds.apache.org/job/oodt-trunk/org.apache.oodt$cas-metadata/ws/target/classes>
[INFO] [resources:testResources {execution: default-testResources}]
[INFO] Using 'UTF-8' encoding to copy filtered resources.
[INFO] Copying 9 resources to org/apache/oodt/cas/metadata
[INFO] Copying 3 resources
[INFO] [compiler:testCompile {execution: default-testCompile}]
[INFO] Compiling 11 source files to <https://builds.apache.org/job/oodt-trunk/org.apache.oodt$cas-metadata/ws/target/test-classes>
[INFO] -------------------------------------------------------------
[ERROR] COMPILATION ERROR : 
[INFO] -------------------------------------------------------------
[ERROR] <https://builds.apache.org/job/oodt-trunk/org.apache.oodt$cas-metadata/ws/src/test/org/apache/oodt/cas/metadata/filenaming/TestPathUtilsNamingConvention.java>:[19,51]
cannot find symbol
symbol: class TestCase
public class TestPathUtilsNamingConvention extends TestCase {
[INFO] 1 error
[INFO] -------------------------------------------------------------
[JENKINS] Archiving <https://builds.apache.org/job/oodt-trunk/org.apache.oodt$cas-metadata/ws/pom.xml>
to /home/hudson/hudson/jobs/oodt-trunk/modules/org.apache.oodt$cas-metadata/builds/2012-03-27_06-54-20/archive/org.apache.oodt/cas-metadata/0.4-SNAPSHOT/cas-metadata-0.4-SNAPSHOT.pom
[INFO] ------------------------------------------------------------------------
[ERROR] BUILD FAILURE
[INFO] ------------------------------------------------------------------------
[INFO] Compilation failure
<https://builds.apache.org/job/oodt-trunk/org.apache.oodt$cas-metadata/ws/src/test/org/apache/oodt/cas/metadata/filenaming/TestPathUtilsNamingConvention.java>:[19,51]
cannot find symbol
symbol: class TestCase
public class TestPathUtilsNamingConvention extends TestCase {

[INFO] ------------------------------------------------------------------------
[INFO] For more information, run Maven with the -e switch
[INFO] ------------------------------------------------------------------------
[INFO] Total time: 6 minutes 25 seconds
[INFO] Finished at: Tue Mar 27 07:01:11 UTC 2012
[INFO] Final Memory: 79M/218M
[INFO] ------------------------------------------------------------------------

Mime
View raw message