oodt-dev mailing list archives

Site index · List index
Message view « Date » · « Thread »
Top « Date » · « Thread »
From Apache Jenkins Server <jenk...@builds.apache.org>
Subject Build failed in Jenkins: oodt-trunk #345
Date Fri, 16 Mar 2012 08:34:31 GMT
See <https://builds.apache.org/job/oodt-trunk/345/changes>

Changes:

[mattmann] - not just used by the webapp anymore

------------------------------------------
[...truncated 4525 lines...]
[INFO] META-INF/DEPENDENCIES already added, skipping
[INFO] logging.properties already added, skipping
[INFO] META-INF/maven/ already added, skipping
[INFO] META-INF/maven/org.apache.oodt/ already added, skipping
[INFO] META-INF/INDEX.LIST already added, skipping
[INFO] [install:install {execution: default-install}]
[INFO] Installing <https://builds.apache.org/job/oodt-trunk/ws/opendapps/target/opendapps-0.4-SNAPSHOT.jar>
to <https://builds.apache.org/job/oodt-trunk/ws/.repository/org/apache/oodt/opendapps/0.4-SNAPSHOT/opendapps-0.4-SNAPSHOT.jar>
[INFO] Installing <https://builds.apache.org/job/oodt-trunk/ws/opendapps/target/opendapps-0.4-SNAPSHOT-jar-with-dependencies.jar>
to <https://builds.apache.org/job/oodt-trunk/ws/.repository/org/apache/oodt/opendapps/0.4-SNAPSHOT/opendapps-0.4-SNAPSHOT-jar-with-dependencies.jar>
[JENKINS] Archiving <https://builds.apache.org/job/oodt-trunk/ws/opendapps/pom.xml>
to /home/hudson/hudson/jobs/oodt-trunk/modules/org.apache.oodt$opendapps/builds/2012-03-16_05-04-01/archive/org.apache.oodt/opendapps/0.4-SNAPSHOT/opendapps-0.4-SNAPSHOT.pom
[JENKINS] Archiving <https://builds.apache.org/job/oodt-trunk/ws/opendapps/target/opendapps-0.4-SNAPSHOT.jar>
to /home/hudson/hudson/jobs/oodt-trunk/modules/org.apache.oodt$opendapps/builds/2012-03-16_05-04-01/archive/org.apache.oodt/opendapps/0.4-SNAPSHOT/opendapps-0.4-SNAPSHOT.jar
[JENKINS] Archiving <https://builds.apache.org/job/oodt-trunk/ws/opendapps/target/opendapps-0.4-SNAPSHOT-jar-with-dependencies.jar>
to /home/hudson/hudson/jobs/oodt-trunk/modules/org.apache.oodt$opendapps/builds/2012-03-16_05-04-01/archive/org.apache.oodt/opendapps/0.4-SNAPSHOT/opendapps-0.4-SNAPSHOT-jar-with-dependencies.jar
[INFO] ------------------------------------------------------------------------
[INFO] Building Process Control System Core Package
[INFO]    task-segment: [install]
[INFO] ------------------------------------------------------------------------
[INFO] [remote-resources:process {execution: default}]
[INFO] [resources:resources {execution: default-resources}]
[INFO] Using 'UTF-8' encoding to copy filtered resources.
[INFO] Copying 4 resources
[INFO] Copying 3 resources
[INFO] [compiler:compile {execution: default-compile}]
[INFO] Nothing to compile - all classes are up to date
[INFO] [resources:testResources {execution: default-testResources}]
[INFO] Using 'UTF-8' encoding to copy filtered resources.
[INFO] skip non existing resourceDirectory <https://builds.apache.org/job/oodt-trunk/ws/pcs/core/src/test/resources>
[INFO] Copying 3 resources
[INFO] [compiler:testCompile {execution: default-testCompile}]
[INFO] No sources to compile
[INFO] [surefire:test {execution: default-test}]
[INFO] Surefire report directory: <https://builds.apache.org/job/oodt-trunk/ws/pcs/core/target/surefire-reports>

-------------------------------------------------------
 T E S T S
-------------------------------------------------------
There are no tests to run.

Results :

Tests run: 0, Failures: 0, Errors: 0, Skipped: 0

[JENKINS] Recording test results
[INFO] [jar:jar {execution: default-jar}]
[INFO] Building jar: <https://builds.apache.org/job/oodt-trunk/ws/pcs/core/target/pcs-core-0.4-SNAPSHOT.jar>
[INFO] Preparing javadoc:javadoc
[WARNING] Removing: javadoc from forked lifecycle, to prevent recursive invocation.
[INFO] No goals needed for project - skipping
[WARNING] DEPRECATED [aggregate]: since 2.5. Use the goals <code>javadoc:aggregate</code>
and <code>javadoc:test-aggregate</code> instead.
[INFO] [javadoc:javadoc {execution: attach-javadocs}]
[INFO] [assembly:single {execution: default}]
[INFO] Reading assembly descriptor: src/main/assembly/assembly.xml
[INFO] Processing DependencySet (output=lib)
[INFO] Building tar : <https://builds.apache.org/job/oodt-trunk/ws/pcs/core/target/pcs-core-0.4-SNAPSHOT-dist.tar.gz>
[INFO] Processing DependencySet (output=lib)
[INFO] Building zip: <https://builds.apache.org/job/oodt-trunk/ws/pcs/core/target/pcs-core-0.4-SNAPSHOT-dist.zip>
[INFO] [install:install {execution: default-install}]
[INFO] Installing <https://builds.apache.org/job/oodt-trunk/ws/pcs/core/target/pcs-core-0.4-SNAPSHOT.jar>
to <https://builds.apache.org/job/oodt-trunk/ws/.repository/org/apache/oodt/pcs-core/0.4-SNAPSHOT/pcs-core-0.4-SNAPSHOT.jar>
[INFO] Installing <https://builds.apache.org/job/oodt-trunk/ws/pcs/core/target/pcs-core-0.4-SNAPSHOT-dist.tar.gz>
to <https://builds.apache.org/job/oodt-trunk/ws/.repository/org/apache/oodt/pcs-core/0.4-SNAPSHOT/pcs-core-0.4-SNAPSHOT-dist.tar.gz>
[INFO] Installing <https://builds.apache.org/job/oodt-trunk/ws/pcs/core/target/pcs-core-0.4-SNAPSHOT-dist.zip>
to <https://builds.apache.org/job/oodt-trunk/ws/.repository/org/apache/oodt/pcs-core/0.4-SNAPSHOT/pcs-core-0.4-SNAPSHOT-dist.zip>
[JENKINS] Archiving <https://builds.apache.org/job/oodt-trunk/ws/pcs/core/pom.xml> to
/home/hudson/hudson/jobs/oodt-trunk/modules/org.apache.oodt$pcs-core/builds/2012-03-16_05-04-27/archive/org.apache.oodt/pcs-core/0.4-SNAPSHOT/pcs-core-0.4-SNAPSHOT.pom
[JENKINS] Archiving <https://builds.apache.org/job/oodt-trunk/ws/pcs/core/target/pcs-core-0.4-SNAPSHOT.jar>
to /home/hudson/hudson/jobs/oodt-trunk/modules/org.apache.oodt$pcs-core/builds/2012-03-16_05-04-27/archive/org.apache.oodt/pcs-core/0.4-SNAPSHOT/pcs-core-0.4-SNAPSHOT.jar
[JENKINS] Archiving <https://builds.apache.org/job/oodt-trunk/ws/pcs/core/target/pcs-core-0.4-SNAPSHOT-dist.tar.gz>
to /home/hudson/hudson/jobs/oodt-trunk/modules/org.apache.oodt$pcs-core/builds/2012-03-16_05-04-27/archive/org.apache.oodt/pcs-core/0.4-SNAPSHOT/pcs-core-0.4-SNAPSHOT-dist.tar.gz
[JENKINS] Archiving <https://builds.apache.org/job/oodt-trunk/ws/pcs/core/target/pcs-core-0.4-SNAPSHOT-dist.zip>
to /home/hudson/hudson/jobs/oodt-trunk/modules/org.apache.oodt$pcs-core/builds/2012-03-16_05-04-27/archive/org.apache.oodt/pcs-core/0.4-SNAPSHOT/pcs-core-0.4-SNAPSHOT-dist.zip
[INFO] ------------------------------------------------------------------------
[INFO] Building OODT Wicket Web Components
[INFO]    task-segment: [install]
[INFO] ------------------------------------------------------------------------
[INFO] [remote-resources:process {execution: default}]
[INFO] [resources:resources {execution: default-resources}]
[INFO] Using 'UTF-8' encoding to copy filtered resources.
[INFO] Copying 1 resource
[INFO] Copying 49 resources
[INFO] Copying 3 resources
[INFO] [compiler:compile {execution: default-compile}]
[INFO] Nothing to compile - all classes are up to date
[INFO] [resources:testResources {execution: default-testResources}]
[INFO] Using 'UTF-8' encoding to copy filtered resources.
[INFO] Copying 0 resource
[INFO] Copying 3 resources
[INFO] [compiler:testCompile {execution: default-testCompile}]
[INFO] Nothing to compile - all classes are up to date
[INFO] [surefire:test {execution: default-test}]
[INFO] Surefire report directory: <https://builds.apache.org/job/oodt-trunk/ws/webapp/components/target/surefire-reports>

-------------------------------------------------------
 T E S T S
-------------------------------------------------------
There are no tests to run.

Results :

Tests run: 0, Failures: 0, Errors: 0, Skipped: 0

[JENKINS] Recording test results
[INFO] [jar:jar {execution: default-jar}]
[INFO] Building jar: <https://builds.apache.org/job/oodt-trunk/ws/webapp/components/target/oodt-webapp-components-0.4-SNAPSHOT.jar>
[INFO] Preparing javadoc:javadoc
[WARNING] Removing: javadoc from forked lifecycle, to prevent recursive invocation.
[INFO] No goals needed for project - skipping
[WARNING] DEPRECATED [aggregate]: since 2.5. Use the goals <code>javadoc:aggregate</code>
and <code>javadoc:test-aggregate</code> instead.
[INFO] [javadoc:javadoc {execution: attach-javadocs}]
[INFO] [install:install {execution: default-install}]
[INFO] Installing <https://builds.apache.org/job/oodt-trunk/ws/webapp/components/target/oodt-webapp-components-0.4-SNAPSHOT.jar>
to <https://builds.apache.org/job/oodt-trunk/ws/.repository/org/apache/oodt/oodt-webapp-components/0.4-SNAPSHOT/oodt-webapp-components-0.4-SNAPSHOT.jar>
[JENKINS] Archiving <https://builds.apache.org/job/oodt-trunk/ws/webapp/components/pom.xml>
to /home/hudson/hudson/jobs/oodt-trunk/modules/org.apache.oodt$oodt-webapp-components/builds/2012-03-16_05-04-05/archive/org.apache.oodt/oodt-webapp-components/0.4-SNAPSHOT/oodt-webapp-components-0.4-SNAPSHOT.pom
[JENKINS] Archiving <https://builds.apache.org/job/oodt-trunk/ws/webapp/components/target/oodt-webapp-components-0.4-SNAPSHOT.jar>
to /home/hudson/hudson/jobs/oodt-trunk/modules/org.apache.oodt$oodt-webapp-components/builds/2012-03-16_05-04-05/archive/org.apache.oodt/oodt-webapp-components/0.4-SNAPSHOT/oodt-webapp-components-0.4-SNAPSHOT.jar
[INFO] ------------------------------------------------------------------------
[INFO] Building CAS File Manager Browser Web App
[INFO]    task-segment: [install]
[INFO] ------------------------------------------------------------------------
[INFO] [remote-resources:process {execution: default}]
[INFO] [resources:resources {execution: default-resources}]
[INFO] Using 'UTF-8' encoding to copy filtered resources.
[INFO] Copying 1 resource
[INFO] Copying 6 resources
[INFO] Copying 3 resources
[INFO] [compiler:compile {execution: default-compile}]
[INFO] Nothing to compile - all classes are up to date
[INFO] [resources:testResources {execution: default-testResources}]
[INFO] Using 'UTF-8' encoding to copy filtered resources.
[INFO] Copying 0 resource
[INFO] Copying 3 resources
[INFO] [compiler:testCompile {execution: default-testCompile}]
[INFO] Compiling 1 source file to <https://builds.apache.org/job/oodt-trunk/ws/webapp/fmbrowser/target/test-classes>
[INFO] [surefire:test {execution: default-test}]
[INFO] Surefire report directory: <https://builds.apache.org/job/oodt-trunk/ws/webapp/fmbrowser/target/surefire-reports>

-------------------------------------------------------
 T E S T S
-------------------------------------------------------
Running org.apache.oodt.cas.filemgr.webapp.browser.TestHome
WARN  - WicketURLEncoder           - No current Application found - defaulting encoding to
UTF-8
WARN  - WicketURLEncoder           - No current Application found - defaulting encoding to
UTF-8
WARN  - WicketURLEncoder           - No current Application found - defaulting encoding to
UTF-8
INFO  - Application                - [FMBrowserApp] init: Wicket core library initializer
INFO  - RequestListenerInterface   - registered listener interface [RequestListenerInterface
name=IBehaviorListener, method=public abstract void org.apache.wicket.behavior.IBehaviorListener.onRequest()]
INFO  - RequestListenerInterface   - registered listener interface [RequestListenerInterface
name=IBehaviorListener, method=public abstract void org.apache.wicket.behavior.IBehaviorListener.onRequest()]
INFO  - RequestListenerInterface   - registered listener interface [RequestListenerInterface
name=IFormSubmitListener, method=public abstract void org.apache.wicket.markup.html.form.IFormSubmitListener.onFormSubmitted()]
INFO  - RequestListenerInterface   - registered listener interface [RequestListenerInterface
name=IFormSubmitListener, method=public abstract void org.apache.wicket.markup.html.form.IFormSubmitListener.onFormSubmitted()]
INFO  - RequestListenerInterface   - registered listener interface [RequestListenerInterface
name=ILinkListener, method=public abstract void org.apache.wicket.markup.html.link.ILinkListener.onLinkClicked()]
INFO  - RequestListenerInterface   - registered listener interface [RequestListenerInterface
name=ILinkListener, method=public abstract void org.apache.wicket.markup.html.link.ILinkListener.onLinkClicked()]
INFO  - RequestListenerInterface   - registered listener interface [RequestListenerInterface
name=IOnChangeListener, method=public abstract void org.apache.wicket.markup.html.form.IOnChangeListener.onSelectionChanged()]
INFO  - RequestListenerInterface   - registered listener interface [RequestListenerInterface
name=IOnChangeListener, method=public abstract void org.apache.wicket.markup.html.form.IOnChangeListener.onSelectionChanged()]
INFO  - RequestListenerInterface   - registered listener interface [RequestListenerInterface
name=IRedirectListener, method=public abstract void org.apache.wicket.IRedirectListener.onRedirect()]
INFO  - RequestListenerInterface   - registered listener interface [RequestListenerInterface
name=IRedirectListener, method=public abstract void org.apache.wicket.IRedirectListener.onRedirect()]
INFO  - RequestListenerInterface   - registered listener interface [RequestListenerInterface
name=IResourceListener, method=public abstract void org.apache.wicket.IResourceListener.onResourceRequested()]
INFO  - RequestListenerInterface   - registered listener interface [RequestListenerInterface
name=IResourceListener, method=public abstract void org.apache.wicket.IResourceListener.onResourceRequested()]
INFO  - RequestListenerInterface   - registered listener interface [RequestListenerInterface
name=IActivePageBehaviorListener, method=public abstract void org.apache.wicket.behavior.IBehaviorListener.onRequest()]
INFO  - RequestListenerInterface   - registered listener interface [RequestListenerInterface
name=IActivePageBehaviorListener, method=public abstract void org.apache.wicket.behavior.IBehaviorListener.onRequest()]
INFO  - WebApplication             - [FMBrowserApp] Started Wicket version 1.4.17 in development
mode
********************************************************************
*** WARNING: Wicket is running in DEVELOPMENT mode.              ***
***                               ^^^^^^^^^^^                    ***
*** Do NOT deploy to your live server(s) without changing this.  ***
*** See Application#getConfigurationType() for more information. ***
********************************************************************
Tests run: 1, Failures: 0, Errors: 0, Skipped: 0, Time elapsed: 0.434 sec

Results :

Tests run: 1, Failures: 0, Errors: 0, Skipped: 0

[JENKINS] Recording test results
[INFO] [war:war {execution: default-war}]
[INFO] Packaging webapp
[INFO] Assembling webapp[fmbrowser] in [<https://builds.apache.org/job/oodt-trunk/ws/webapp/fmbrowser/target/fmbrowser-0.4-SNAPSHOT]>
[INFO] Dependency[Dependency {groupId=org.apache.wicket, artifactId=wicket, version=1.4.17,
type=jar}] has changed (was Dependency {groupId=org.apache.wicket, artifactId=wicket, version=1.4.17,
type=jar}).
[INFO] Dependency[Dependency {groupId=org.apache.oodt, artifactId=oodt-webapp-components,
version=0.4-SNAPSHOT, type=jar}] has changed (was Dependency {groupId=org.apache.oodt, artifactId=oodt-webapp-components,
version=0.4-SNAPSHOT, type=jar}).
[INFO] Dependency[Dependency {groupId=org.slf4j, artifactId=slf4j-log4j12, version=1.5.8,
type=jar}] has changed (was Dependency {groupId=org.slf4j, artifactId=slf4j-log4j12, version=1.5.8,
type=jar}).
[INFO] Dependency[Dependency {groupId=log4j, artifactId=log4j, version=1.2.14, type=jar}]
has changed (was Dependency {groupId=log4j, artifactId=log4j, version=1.2.14, type=jar}).
[INFO] Processing war project
[INFO] Copying webapp resources[<https://builds.apache.org/job/oodt-trunk/ws/webapp/fmbrowser/src/main/webapp]>
[INFO] Webapp assembled in[91 msecs]
[INFO] Building war: <https://builds.apache.org/job/oodt-trunk/ws/webapp/fmbrowser/target/fmbrowser-0.4-SNAPSHOT.war>
[INFO] Preparing javadoc:javadoc
[WARNING] Removing: javadoc from forked lifecycle, to prevent recursive invocation.
[INFO] No goals needed for project - skipping
[WARNING] DEPRECATED [aggregate]: since 2.5. Use the goals <code>javadoc:aggregate</code>
and <code>javadoc:test-aggregate</code> instead.
[INFO] [javadoc:javadoc {execution: attach-javadocs}]
[INFO] [install:install {execution: default-install}]
[INFO] Installing <https://builds.apache.org/job/oodt-trunk/ws/webapp/fmbrowser/target/fmbrowser-0.4-SNAPSHOT.war>
to <https://builds.apache.org/job/oodt-trunk/ws/.repository/org/apache/oodt/fmbrowser/0.4-SNAPSHOT/fmbrowser-0.4-SNAPSHOT.war>
[JENKINS] Archiving <https://builds.apache.org/job/oodt-trunk/ws/webapp/fmbrowser/pom.xml>
to /home/hudson/hudson/jobs/oodt-trunk/modules/org.apache.oodt$fmbrowser/builds/2012-03-16_05-04-09/archive/org.apache.oodt/fmbrowser/0.4-SNAPSHOT/fmbrowser-0.4-SNAPSHOT.pom
[JENKINS] Archiving <https://builds.apache.org/job/oodt-trunk/ws/webapp/fmbrowser/target/fmbrowser-0.4-SNAPSHOT.war>
to /home/hudson/hudson/jobs/oodt-trunk/modules/org.apache.oodt$fmbrowser/builds/2012-03-16_05-04-09/archive/org.apache.oodt/fmbrowser/0.4-SNAPSHOT/fmbrowser-0.4-SNAPSHOT.war
Build timed out (after 180 minutes). Marking the build as failed.
[INFO] ------------------------------------------------------------------------
[ERROR] FATAL ERROR
[INFO] ------------------------------------------------------------------------
channel stopped
[INFO] hudson.remoting.RequestAbortedException: hudson.remoting.Channel$OrderlyShutdown
[INFO] ------------------------------------------------------------------------
[INFO] Trace
hudson.remoting.RequestAbortedException: hudson.remoting.RequestAbortedException: hudson.remoting.Channel$OrderlyShutdown
	at hudson.remoting.Request.call(Request.java:149)
	at hudson.remoting.Channel.call(Channel.java:681)
	at hudson.remoting.RemoteInvocationHandler.invoke(RemoteInvocationHandler.java:158)
	at $Proxy2.isArchivingDisabled(Unknown Source)
	at hudson.maven.MavenBuildProxy$Filter.isArchivingDisabled(MavenBuildProxy.java:227)
	at hudson.maven.reporters.MavenArtifact.archive(MavenArtifact.java:223)
	at hudson.maven.reporters.MavenArtifactArchiver.postBuild(MavenArtifactArchiver.java:106)
	at hudson.maven.Maven2Builder.postModule(Maven2Builder.java:127)
	at hudson.maven.MavenBuilder$Adapter.fireLeaveModule(MavenBuilder.java:327)
	at hudson.maven.MavenBuilder$Adapter.postBuild(MavenBuilder.java:285)
	at org.apache.maven.lifecycle.LifecycleExecutorInterceptor.execute(LifecycleExecutorInterceptor.java:68)
	at org.apache.maven.DefaultMaven.doExecute(DefaultMaven.java:328)
	at org.apache.maven.DefaultMaven.execute(DefaultMaven.java:138)
	at org.apache.maven.cli.MavenCli.main(MavenCli.java:362)
	at sun.reflect.NativeMethodAccessorImpl.invoke0(Native Method)
	at sun.reflect.NativeMethodAccessorImpl.invoke(NativeMethodAccessorImpl.java:39)
	at sun.reflect.DelegatingMethodAccessorImpl.invoke(DelegatingMethodAccessorImpl.java:25)
	at java.lang.reflect.Method.invoke(Method.java:597)
	at org.codehaus.classworlds.Launcher.launchEnhanced(Launcher.java:315)
	at org.codehaus.classworlds.Launcher.launch(Launcher.java:255)
	at hudson.maven.agent.Main.launch(Main.java:185)
	at hudson.maven.MavenBuilder.call(MavenBuilder.java:151)
	at hudson.maven.Maven2Builder.call(Maven2Builder.java:77)
	at hudson.maven.Maven2Builder.call(Maven2Builder.java:53)
	at hudson.remoting.UserRequest.perform(UserRequest.java:118)
	at hudson.remoting.UserRequest.perform(UserRequest.java:48)
	at hudson.remoting.Request$2.run(Request.java:287)
	at hudson.remoting.InterceptingExecutorService$1.call(InterceptingExecutorService.java:72)
	at java.util.concurrent.FutureTask$Sync.innerRun(FutureTask.java:303)
	at java.util.concurrent.FutureTask.run(FutureTask.java:138)
	at java.util.concurrent.ThreadPoolExecutor$Worker.runTask(ThreadPoolExecutor.java:886)
	at java.util.concurrent.ThreadPoolExecutor$Worker.run(ThreadPoolExecutor.java:908)
	at java.lang.Thread.run(Thread.java:662)
Caused by: hudson.remoting.RequestAbortedException: hudson.remoting.Channel$OrderlyShutdown
	at hudson.remoting.Request.abort(Request.java:273)
	at hudson.remoting.Channel.terminate(Channel.java:732)
	at hudson.remoting.Channel$CloseCommand.execute(Channel.java:848)
	at hudson.remoting.Channel$ReaderThread.run(Channel.java:1146)
Caused by: hudson.remoting.Channel$OrderlyShutdown
	... 2 more
Caused by: Command close created at
	at hudson.remoting.Command.<init>(Command.java:51)
	at hudson.remoting.Channel$CloseCommand.<init>(Channel.java:842)
	at hudson.remoting.Channel$CloseCommand.<init>(Channel.java:840)
	at hudson.remoting.Channel.close(Channel.java:907)
	at hudson.remoting.Channel.close(Channel.java:890)
	at hudson.slaves.Channels$1.close(Channels.java:91)
	at hudson.maven.ProcessCache$MavenProcess.discard(ProcessCache.java:145)
	at hudson.maven.MavenModuleSetBuild$RunnerImpl.doRun(MavenModuleSetBuild.java:800)
	at hudson.model.AbstractBuild$AbstractRunner.run(AbstractBuild.java:473)
	at hudson.model.Run.run(Run.java:1410)
	at hudson.maven.MavenModuleSetBuild.run(MavenModuleSetBuild.java:481)
	at hudson.model.ResourceController.execute(ResourceController.java:88)
	at hudson.model.Executor.run(Executor.java:238)
[INFO] ------------------------------------------------------------------------
[INFO] Total time: 180 minutes 24 seconds
[INFO] Finished at: Fri Mar 16 08:34:29 UTC 2012
[INFO] Final Memory: 93M/191M
[INFO] ------------------------------------------------------------------------

Mime
View raw message