oodt-dev mailing list archives

Site index · List index
Message view « Date » · « Thread »
Top « Date » · « Thread »
From Apache Jenkins Server <jenk...@builds.apache.org>
Subject Build failed in Jenkins: oodt-trunk #290
Date Mon, 27 Feb 2012 17:50:58 GMT
See <https://builds.apache.org/job/oodt-trunk/290/changes>

Changes:

[pramirez] OODT-382 Lucene FileManager now initializes index in factory.

------------------------------------------
[...truncated 1314 lines...]
INFO: Deleting all records of TransactionId from catalog 'TestCatalog2'
Feb 27, 2012 5:49:38 PM org.apache.oodt.cas.catalog.system.Catalog delete
INFO: Catalog 'TestCatalog2' attemping to delete all TermBuckets associated with catalog TransactionId
[id = '92f0eb10-c2d9-416c-ae87-c3ca4da0598a']
Feb 27, 2012 5:49:38 PM org.apache.oodt.cas.catalog.system.impl.CatalogServiceLocal delete
INFO: Successfully deleted metadata from catalog 'TestCatalog2' for TransactionId [id = ffd382d6-affd-4f41-9c0e-7783efb36c1f]
Feb 27, 2012 5:49:38 PM org.apache.oodt.cas.catalog.system.impl.CatalogServiceLocal delete
INFO: Deleting all records of TransactionId from catalog 'TestCatalog1'
Feb 27, 2012 5:49:38 PM org.apache.oodt.cas.catalog.system.Catalog delete
INFO: Catalog 'TestCatalog1' attemping to delete all TermBuckets associated with catalog TransactionId
[id = '836e6a40-d93e-410e-beea-ca7b7e6b8094']
Feb 27, 2012 5:49:38 PM org.apache.oodt.cas.catalog.system.impl.CatalogServiceLocal delete
INFO: Successfully deleted metadata from catalog 'TestCatalog1' for TransactionId [id = ffd382d6-affd-4f41-9c0e-7783efb36c1f]
Tests run: 1, Failures: 0, Errors: 0, Skipped: 0, Time elapsed: 0.481 sec

Results :

Tests run: 1, Failures: 0, Errors: 0, Skipped: 0

[JENKINS] Recording test results
[INFO] [jar:jar {execution: default-jar}]
[INFO] Building jar: <https://builds.apache.org/job/oodt-trunk/ws/catalog/target/cas-catalog-0.4-SNAPSHOT.jar>
[INFO] Preparing javadoc:javadoc
[WARNING] Removing: javadoc from forked lifecycle, to prevent recursive invocation.
[INFO] No goals needed for project - skipping
[WARNING] DEPRECATED [aggregate]: since 2.5. Use the goals <code>javadoc:aggregate</code>
and <code>javadoc:test-aggregate</code> instead.
[INFO] [javadoc:javadoc {execution: attach-javadocs}]
[INFO] [assembly:single {execution: default}]
[INFO] Reading assembly descriptor: src/main/assembly/assembly.xml
[INFO] Processing DependencySet (output=lib)
[INFO] Building tar : <https://builds.apache.org/job/oodt-trunk/ws/catalog/target/cas-catalog-0.4-SNAPSHOT-dist.tar.gz>
[INFO] Processing DependencySet (output=lib)
[INFO] Building zip: <https://builds.apache.org/job/oodt-trunk/ws/catalog/target/cas-catalog-0.4-SNAPSHOT-dist.zip>
[INFO] [install:install {execution: default-install}]
[INFO] Installing <https://builds.apache.org/job/oodt-trunk/ws/catalog/target/cas-catalog-0.4-SNAPSHOT.jar>
to <https://builds.apache.org/job/oodt-trunk/ws/.repository/org/apache/oodt/cas-catalog/0.4-SNAPSHOT/cas-catalog-0.4-SNAPSHOT.jar>
[INFO] Installing <https://builds.apache.org/job/oodt-trunk/ws/catalog/target/cas-catalog-0.4-SNAPSHOT-dist.tar.gz>
to <https://builds.apache.org/job/oodt-trunk/ws/.repository/org/apache/oodt/cas-catalog/0.4-SNAPSHOT/cas-catalog-0.4-SNAPSHOT-dist.tar.gz>
[INFO] Installing <https://builds.apache.org/job/oodt-trunk/ws/catalog/target/cas-catalog-0.4-SNAPSHOT-dist.zip>
to <https://builds.apache.org/job/oodt-trunk/ws/.repository/org/apache/oodt/cas-catalog/0.4-SNAPSHOT/cas-catalog-0.4-SNAPSHOT-dist.zip>
[JENKINS] Archiving <https://builds.apache.org/job/oodt-trunk/ws/catalog/pom.xml> to
/home/hudson/hudson/jobs/oodt-trunk/modules/org.apache.oodt$cas-catalog/builds/2012-02-27_17-46-17/archive/org.apache.oodt/cas-catalog/0.4-SNAPSHOT/cas-catalog-0.4-SNAPSHOT.pom
[JENKINS] Archiving <https://builds.apache.org/job/oodt-trunk/ws/catalog/target/cas-catalog-0.4-SNAPSHOT.jar>
to /home/hudson/hudson/jobs/oodt-trunk/modules/org.apache.oodt$cas-catalog/builds/2012-02-27_17-46-17/archive/org.apache.oodt/cas-catalog/0.4-SNAPSHOT/cas-catalog-0.4-SNAPSHOT.jar
[JENKINS] Archiving <https://builds.apache.org/job/oodt-trunk/ws/catalog/target/cas-catalog-0.4-SNAPSHOT-dist.tar.gz>
to /home/hudson/hudson/jobs/oodt-trunk/modules/org.apache.oodt$cas-catalog/builds/2012-02-27_17-46-17/archive/org.apache.oodt/cas-catalog/0.4-SNAPSHOT/cas-catalog-0.4-SNAPSHOT-dist.tar.gz
[JENKINS] Archiving <https://builds.apache.org/job/oodt-trunk/ws/catalog/target/cas-catalog-0.4-SNAPSHOT-dist.zip>
to /home/hudson/hudson/jobs/oodt-trunk/modules/org.apache.oodt$cas-catalog/builds/2012-02-27_17-46-17/archive/org.apache.oodt/cas-catalog/0.4-SNAPSHOT/cas-catalog-0.4-SNAPSHOT-dist.zip
[INFO] ------------------------------------------------------------------------
[INFO] Building Catalog and Archive Resource Management Component
[INFO]    task-segment: [install]
[INFO] ------------------------------------------------------------------------
[INFO] [remote-resources:process {execution: default}]
[INFO] [resources:resources {execution: default-resources}]
[INFO] Using 'UTF-8' encoding to copy filtered resources.
[INFO] Copying 9 resources
[INFO] Copying 3 resources
[INFO] [compiler:compile {execution: default-compile}]
[INFO] Nothing to compile - all classes are up to date
[INFO] [resources:testResources {execution: default-testResources}]
[INFO] Using 'UTF-8' encoding to copy filtered resources.
[INFO] skip non existing resourceDirectory <https://builds.apache.org/job/oodt-trunk/ws/resource/src/test/resources>
[INFO] Copying 3 resources
[INFO] [compiler:testCompile {execution: default-testCompile}]
[INFO] Nothing to compile - all classes are up to date
[INFO] [surefire:test {execution: default-test}]
[INFO] Surefire report directory: <https://builds.apache.org/job/oodt-trunk/ws/resource/target/surefire-reports>

-------------------------------------------------------
 T E S T S
-------------------------------------------------------
Running org.apache.oodt.cas.resource.queuerepo.TestXmlQueueRepository
Tests run: 1, Failures: 0, Errors: 0, Skipped: 0, Time elapsed: 0.248 sec
Running org.apache.oodt.cas.resource.cli.TestResourceCli
Tests run: 17, Failures: 0, Errors: 0, Skipped: 0, Time elapsed: 3.234 sec
Running org.apache.oodt.cas.resource.jobqueue.TestJobStack
Tests run: 5, Failures: 0, Errors: 0, Skipped: 0, Time elapsed: 0.074 sec
Running org.apache.oodt.cas.resource.system.TestXmlRpcResourceManager
Tests run: 1, Failures: 0, Errors: 0, Skipped: 0, Time elapsed: 0.691 sec
Running org.apache.oodt.cas.resource.monitor.TestAssignmentMonitor
Tests run: 4, Failures: 0, Errors: 0, Skipped: 0, Time elapsed: 0.145 sec
Running org.apache.oodt.cas.resource.util.TestUlimit
Tests run: 2, Failures: 0, Errors: 0, Skipped: 0, Time elapsed: 0.063 sec

Results :

Tests run: 30, Failures: 0, Errors: 0, Skipped: 0

[JENKINS] Recording test results
[INFO] [jar:jar {execution: default-jar}]
[INFO] Building jar: <https://builds.apache.org/job/oodt-trunk/ws/resource/target/cas-resource-0.4-SNAPSHOT.jar>
[INFO] Preparing javadoc:javadoc
[WARNING] Removing: javadoc from forked lifecycle, to prevent recursive invocation.
[INFO] No goals needed for project - skipping
[WARNING] DEPRECATED [aggregate]: since 2.5. Use the goals <code>javadoc:aggregate</code>
and <code>javadoc:test-aggregate</code> instead.
[INFO] [javadoc:javadoc {execution: attach-javadocs}]
[INFO] [assembly:single {execution: default}]
[INFO] Reading assembly descriptor: src/main/assembly/assembly.xml
[INFO] Processing DependencySet (output=lib)
[INFO] Building tar : <https://builds.apache.org/job/oodt-trunk/ws/resource/target/cas-resource-0.4-SNAPSHOT-dist.tar.gz>
[INFO] Processing DependencySet (output=lib)
[INFO] Building zip: <https://builds.apache.org/job/oodt-trunk/ws/resource/target/cas-resource-0.4-SNAPSHOT-dist.zip>
[INFO] [install:install {execution: default-install}]
[INFO] Installing <https://builds.apache.org/job/oodt-trunk/ws/resource/target/cas-resource-0.4-SNAPSHOT.jar>
to <https://builds.apache.org/job/oodt-trunk/ws/.repository/org/apache/oodt/cas-resource/0.4-SNAPSHOT/cas-resource-0.4-SNAPSHOT.jar>
[INFO] Installing <https://builds.apache.org/job/oodt-trunk/ws/resource/target/cas-resource-0.4-SNAPSHOT-dist.tar.gz>
to <https://builds.apache.org/job/oodt-trunk/ws/.repository/org/apache/oodt/cas-resource/0.4-SNAPSHOT/cas-resource-0.4-SNAPSHOT-dist.tar.gz>
[INFO] Installing <https://builds.apache.org/job/oodt-trunk/ws/resource/target/cas-resource-0.4-SNAPSHOT-dist.zip>
to <https://builds.apache.org/job/oodt-trunk/ws/.repository/org/apache/oodt/cas-resource/0.4-SNAPSHOT/cas-resource-0.4-SNAPSHOT-dist.zip>
[JENKINS] Archiving <https://builds.apache.org/job/oodt-trunk/ws/resource/pom.xml> to
/home/hudson/hudson/jobs/oodt-trunk/modules/org.apache.oodt$cas-resource/builds/2012-02-27_17-46-17/archive/org.apache.oodt/cas-resource/0.4-SNAPSHOT/cas-resource-0.4-SNAPSHOT.pom
[JENKINS] Archiving <https://builds.apache.org/job/oodt-trunk/ws/resource/target/cas-resource-0.4-SNAPSHOT.jar>
to /home/hudson/hudson/jobs/oodt-trunk/modules/org.apache.oodt$cas-resource/builds/2012-02-27_17-46-17/archive/org.apache.oodt/cas-resource/0.4-SNAPSHOT/cas-resource-0.4-SNAPSHOT.jar
[JENKINS] Archiving <https://builds.apache.org/job/oodt-trunk/ws/resource/target/cas-resource-0.4-SNAPSHOT-dist.tar.gz>
to /home/hudson/hudson/jobs/oodt-trunk/modules/org.apache.oodt$cas-resource/builds/2012-02-27_17-46-17/archive/org.apache.oodt/cas-resource/0.4-SNAPSHOT/cas-resource-0.4-SNAPSHOT-dist.tar.gz
[JENKINS] Archiving <https://builds.apache.org/job/oodt-trunk/ws/resource/target/cas-resource-0.4-SNAPSHOT-dist.zip>
to /home/hudson/hudson/jobs/oodt-trunk/modules/org.apache.oodt$cas-resource/builds/2012-02-27_17-46-17/archive/org.apache.oodt/cas-resource/0.4-SNAPSHOT/cas-resource-0.4-SNAPSHOT-dist.zip
[INFO] ------------------------------------------------------------------------
[INFO] Building Catalog and Archive Workflow Management Component
[INFO]    task-segment: [install]
[INFO] ------------------------------------------------------------------------
[INFO] [remote-resources:process {execution: default}]
[INFO] [resources:resources {execution: default-resources}]
[INFO] Using 'UTF-8' encoding to copy filtered resources.
[INFO] Copying 25 resources
[INFO] Copying 3 resources
[INFO] [compiler:compile {execution: default-compile}]
[INFO] Nothing to compile - all classes are up to date
[INFO] [resources:testResources {execution: default-testResources}]
[INFO] Using 'UTF-8' encoding to copy filtered resources.
[INFO] skip non existing resourceDirectory <https://builds.apache.org/job/oodt-trunk/ws/workflow/src/test/resources>
[INFO] Copying 3 resources
[INFO] [compiler:testCompile {execution: default-testCompile}]
[INFO] Nothing to compile - all classes are up to date
[INFO] [surefire:test {execution: default-test}]
[INFO] Surefire report directory: <https://builds.apache.org/job/oodt-trunk/ws/workflow/target/surefire-reports>

-------------------------------------------------------
 T E S T S
-------------------------------------------------------
Running org.apache.oodt.cas.workflow.cli.TestWorkflowCli
Tests run: 20, Failures: 0, Errors: 0, Skipped: 0, Time elapsed: 4.432 sec
Running org.apache.oodt.cas.workflow.instrepo.TestLuceneWorkflowInstanceRepository
Tests run: 1, Failures: 0, Errors: 0, Skipped: 0, Time elapsed: 0.29 sec
Running org.apache.oodt.cas.workflow.structs.TestHighestFIFOPrioritySorter
Tests run: 1, Failures: 0, Errors: 0, Skipped: 0, Time elapsed: 0.07 sec
Running org.apache.oodt.cas.workflow.system.TestXmlRpcWorkflowManager
Tests run: 1, Failures: 1, Errors: 0, Skipped: 0, Time elapsed: 0.135 sec <<< FAILURE!
Running org.apache.oodt.cas.workflow.system.TestXmlRpcWorkflowManagerClient
Tests run: 1, Failures: 0, Errors: 0, Skipped: 0, Time elapsed: 0.358 sec
Running org.apache.oodt.cas.workflow.engine.TestAsynchronousLocalEngineRunner
Tests run: 1, Failures: 1, Errors: 0, Skipped: 0, Time elapsed: 0.314 sec <<< FAILURE!
Running org.apache.oodt.cas.workflow.repository.TestPackagedWorkflowRepository
Tests run: 5, Failures: 0, Errors: 0, Skipped: 0, Time elapsed: 1.977 sec
Running org.apache.oodt.cas.workflow.repository.TestWorkflowDataSourceRepository
Tests run: 2, Failures: 0, Errors: 0, Skipped: 0, Time elapsed: 0.299 sec
Running org.apache.oodt.cas.workflow.structs.TestFILOPrioritySorter
Tests run: 1, Failures: 0, Errors: 0, Skipped: 0, Time elapsed: 0.029 sec
Running org.apache.oodt.cas.workflow.tools.TestInstanceRepoCleaner
Tests run: 1, Failures: 0, Errors: 0, Skipped: 0, Time elapsed: 0.479 sec
Running org.apache.oodt.cas.workflow.structs.TestHighestPrioritySorter
Tests run: 1, Failures: 0, Errors: 0, Skipped: 0, Time elapsed: 0.051 sec
Running org.apache.oodt.cas.workflow.examples.TestExternScriptTaskInstance
Tests run: 1, Failures: 0, Errors: 0, Skipped: 0, Time elapsed: 0.046 sec
Running org.apache.oodt.cas.workflow.util.TestGenericWorkflowObjectFactory
Tests run: 2, Failures: 0, Errors: 0, Skipped: 0, Time elapsed: 0.036 sec
Running org.apache.oodt.cas.workflow.engine.TestThreadPoolWorkflowEngine
Tests run: 1, Failures: 0, Errors: 0, Skipped: 0, Time elapsed: 0.051 sec
Running org.apache.oodt.cas.workflow.repository.TestWorkflowRepository
Tests run: 15, Failures: 0, Errors: 0, Skipped: 0, Time elapsed: 14.46 sec

Results :

Failed tests: 

Tests run: 54, Failures: 2, Errors: 0, Skipped: 0

[ERROR] There are test failures.

Please refer to <https://builds.apache.org/job/oodt-trunk/ws/workflow/target/surefire-reports>
for the individual test results.
[JENKINS] Recording test results
[INFO] [jar:jar {execution: default-jar}]
[INFO] Building jar: <https://builds.apache.org/job/oodt-trunk/ws/workflow/target/cas-workflow-0.4-SNAPSHOT.jar>
[INFO] Preparing javadoc:javadoc
[WARNING] Removing: javadoc from forked lifecycle, to prevent recursive invocation.
[INFO] No goals needed for project - skipping
[WARNING] DEPRECATED [aggregate]: since 2.5. Use the goals <code>javadoc:aggregate</code>
and <code>javadoc:test-aggregate</code> instead.
[INFO] [javadoc:javadoc {execution: attach-javadocs}]
[INFO] [assembly:single {execution: default}]
[INFO] Reading assembly descriptor: src/main/assembly/assembly.xml
[INFO] Processing DependencySet (output=lib)
[INFO] Building tar : <https://builds.apache.org/job/oodt-trunk/ws/workflow/target/cas-workflow-0.4-SNAPSHOT-dist.tar.gz>
[INFO] Processing DependencySet (output=lib)
[INFO] Building zip: <https://builds.apache.org/job/oodt-trunk/ws/workflow/target/cas-workflow-0.4-SNAPSHOT-dist.zip>
[INFO] [install:install {execution: default-install}]
[INFO] Installing <https://builds.apache.org/job/oodt-trunk/ws/workflow/target/cas-workflow-0.4-SNAPSHOT.jar>
to <https://builds.apache.org/job/oodt-trunk/ws/.repository/org/apache/oodt/cas-workflow/0.4-SNAPSHOT/cas-workflow-0.4-SNAPSHOT.jar>
[INFO] Installing <https://builds.apache.org/job/oodt-trunk/ws/workflow/target/cas-workflow-0.4-SNAPSHOT-dist.tar.gz>
to <https://builds.apache.org/job/oodt-trunk/ws/.repository/org/apache/oodt/cas-workflow/0.4-SNAPSHOT/cas-workflow-0.4-SNAPSHOT-dist.tar.gz>
[INFO] Installing <https://builds.apache.org/job/oodt-trunk/ws/workflow/target/cas-workflow-0.4-SNAPSHOT-dist.zip>
to <https://builds.apache.org/job/oodt-trunk/ws/.repository/org/apache/oodt/cas-workflow/0.4-SNAPSHOT/cas-workflow-0.4-SNAPSHOT-dist.zip>
[JENKINS] Archiving <https://builds.apache.org/job/oodt-trunk/ws/workflow/pom.xml> to
/home/hudson/hudson/jobs/oodt-trunk/modules/org.apache.oodt$cas-workflow/builds/2012-02-27_17-46-17/archive/org.apache.oodt/cas-workflow/0.4-SNAPSHOT/cas-workflow-0.4-SNAPSHOT.pom
[JENKINS] Archiving <https://builds.apache.org/job/oodt-trunk/ws/workflow/target/cas-workflow-0.4-SNAPSHOT.jar>
to /home/hudson/hudson/jobs/oodt-trunk/modules/org.apache.oodt$cas-workflow/builds/2012-02-27_17-46-17/archive/org.apache.oodt/cas-workflow/0.4-SNAPSHOT/cas-workflow-0.4-SNAPSHOT.jar
[JENKINS] Archiving <https://builds.apache.org/job/oodt-trunk/ws/workflow/target/cas-workflow-0.4-SNAPSHOT-dist.tar.gz>
to /home/hudson/hudson/jobs/oodt-trunk/modules/org.apache.oodt$cas-workflow/builds/2012-02-27_17-46-17/archive/org.apache.oodt/cas-workflow/0.4-SNAPSHOT/cas-workflow-0.4-SNAPSHOT-dist.tar.gz
[JENKINS] Archiving <https://builds.apache.org/job/oodt-trunk/ws/workflow/target/cas-workflow-0.4-SNAPSHOT-dist.zip>
to /home/hudson/hudson/jobs/oodt-trunk/modules/org.apache.oodt$cas-workflow/builds/2012-02-27_17-46-17/archive/org.apache.oodt/cas-workflow/0.4-SNAPSHOT/cas-workflow-0.4-SNAPSHOT-dist.zip
[INFO] ------------------------------------------------------------------------
[INFO] Building Catalog and Archive Crawling Framework
[INFO]    task-segment: [install]
[INFO] ------------------------------------------------------------------------
[INFO] [remote-resources:process {execution: default}]
[INFO] [resources:resources {execution: default-resources}]
[INFO] Using 'UTF-8' encoding to copy filtered resources.
[INFO] Copying 2 resources to org/apache/oodt/cas/crawl
[INFO] Copying 1 resource to org/apache/oodt/cas/crawl/action
[INFO] Copying 1 resource to org/apache/oodt/cas/crawl/option
[INFO] Copying 1 resource to org/apache/oodt/cas/crawl/comparator
[INFO] Copying 3 resources
[INFO] [compiler:compile {execution: default-compile}]
[INFO] Nothing to compile - all classes are up to date
[INFO] [resources:testResources {execution: default-testResources}]
[INFO] Using 'UTF-8' encoding to copy filtered resources.
[INFO] skip non existing resourceDirectory <https://builds.apache.org/job/oodt-trunk/ws/crawler/src/test/resources>
[INFO] Copying 3 resources
[INFO] [compiler:testCompile {execution: default-testCompile}]
[INFO] Nothing to compile - all classes are up to date
[INFO] [surefire:test {execution: default-test}]
[INFO] Surefire report directory: <https://builds.apache.org/job/oodt-trunk/ws/crawler/target/surefire-reports>

-------------------------------------------------------
 T E S T S
-------------------------------------------------------
Running org.apache.oodt.cas.crawl.option.TestBooleanOptions
Tests run: 1, Failures: 0, Errors: 0, Skipped: 0, Time elapsed: 0.044 sec

Results :

Tests run: 1, Failures: 0, Errors: 0, Skipped: 0

[JENKINS] Recording test results
[INFO] [jar:jar {execution: default-jar}]
[INFO] Building jar: <https://builds.apache.org/job/oodt-trunk/ws/crawler/target/cas-crawler-0.4-SNAPSHOT.jar>
[INFO] Preparing javadoc:javadoc
[WARNING] Removing: javadoc from forked lifecycle, to prevent recursive invocation.
[INFO] No goals needed for project - skipping
[WARNING] DEPRECATED [aggregate]: since 2.5. Use the goals <code>javadoc:aggregate</code>
and <code>javadoc:test-aggregate</code> instead.
[INFO] [javadoc:javadoc {execution: attach-javadocs}]
[INFO] [assembly:single {execution: default}]
[INFO] Reading assembly descriptor: src/main/assembly/assembly.xml
[INFO] Processing DependencySet (output=lib)
[INFO] Building tar : <https://builds.apache.org/job/oodt-trunk/ws/crawler/target/cas-crawler-0.4-SNAPSHOT-dist.tar.gz>
[INFO] Processing DependencySet (output=lib)
[JENKINS] Archiving <https://builds.apache.org/job/oodt-trunk/ws/crawler/pom.xml> to
/home/hudson/hudson/jobs/oodt-trunk/modules/org.apache.oodt$cas-crawler/builds/2012-02-27_17-46-17/archive/org.apache.oodt/cas-crawler/0.4-SNAPSHOT/cas-crawler-0.4-SNAPSHOT.pom
[JENKINS] Archiving <https://builds.apache.org/job/oodt-trunk/ws/crawler/target/cas-crawler-0.4-SNAPSHOT.jar>
to /home/hudson/hudson/jobs/oodt-trunk/modules/org.apache.oodt$cas-crawler/builds/2012-02-27_17-46-17/archive/org.apache.oodt/cas-crawler/0.4-SNAPSHOT/cas-crawler-0.4-SNAPSHOT.jar
[JENKINS] Archiving <https://builds.apache.org/job/oodt-trunk/ws/crawler/target/cas-crawler-0.4-SNAPSHOT-dist.tar.gz>
to /home/hudson/hudson/jobs/oodt-trunk/modules/org.apache.oodt$cas-crawler/builds/2012-02-27_17-46-17/archive/org.apache.oodt/cas-crawler/0.4-SNAPSHOT/cas-crawler-0.4-SNAPSHOT-dist.tar.gz
[INFO] ------------------------------------------------------------------------
[ERROR] BUILD ERROR
[INFO] ------------------------------------------------------------------------
[INFO] Failed to create assembly: Failed to retrieve OS environment variables. Reason: Cannot
run program "env": java.io.IOException: error=24, Too many open files

[INFO] ------------------------------------------------------------------------
[INFO] For more information, run Maven with the -e switch
[INFO] ------------------------------------------------------------------------
[INFO] Total time: 4 minutes 33 seconds
[INFO] Finished at: Mon Feb 27 17:50:56 UTC 2012
[INFO] Final Memory: 75M/368M
[INFO] ------------------------------------------------------------------------
Maven failed with error.
channel stopped


Mime
View raw message