oodt-dev mailing list archives

Site index · List index
Message view « Date » · « Thread »
Top « Date » · « Thread »
From Apache Jenkins Server <jenk...@builds.apache.org>
Subject Build failed in Jenkins: oodt-trunk » CAS Protocol SFTP Implementation #28
Date Thu, 06 Oct 2011 03:41:38 GMT
See <https://builds.apache.org/job/oodt-trunk/org.apache.oodt$cas-protocol-sftp/28/changes>

Changes:

[mattmann] - disable failing tests: when they are not unstable on Jenkins then we can uncomment
them

------------------------------------------
[INFO] ------------------------------------------------------------------------
[INFO] Building CAS Protocol SFTP Implementation
[INFO]    task-segment: [install]
[INFO] ------------------------------------------------------------------------
[INFO] [remote-resources:process {execution: default}]
Downloading: http://download.java.net/maven/2/com/jcraft/jsch/0.1.42/jsch-0.1.42.pom
[INFO] Unable to find resource 'com.jcraft:jsch:pom:0.1.42' in repository javax-transaction
(http://download.java.net/maven/2)
Downloading: http://projects.iplantcollaborative.org/archiva/repository/internal/com/jcraft/jsch/0.1.42/jsch-0.1.42.pom
967b downloaded  (jsch-0.1.42.pom)
Downloading: http://download.java.net/maven/2/sshtools/j2ssh-core/0.2.2/j2ssh-core-0.2.2.pom
[INFO] Unable to find resource 'sshtools:j2ssh-core:pom:0.2.2' in repository javax-transaction
(http://download.java.net/maven/2)
Downloading: http://projects.iplantcollaborative.org/archiva/repository/internal/sshtools/j2ssh-core/0.2.2/j2ssh-core-0.2.2.pom
152b downloaded  (j2ssh-core-0.2.2.pom)
Downloading: http://download.java.net/maven/2/sshtools/j2ssh-daemon/0.2.2/j2ssh-daemon-0.2.2.pom
[INFO] Unable to find resource 'sshtools:j2ssh-daemon:pom:0.2.2' in repository javax-transaction
(http://download.java.net/maven/2)
Downloading: http://projects.iplantcollaborative.org/archiva/repository/internal/sshtools/j2ssh-daemon/0.2.2/j2ssh-daemon-0.2.2.pom
154b downloaded  (j2ssh-daemon-0.2.2.pom)
Downloading: http://download.java.net/maven/2/com/jcraft/jsch/0.1.42/jsch-0.1.42.jar
Downloading: http://download.java.net/maven/2/sshtools/j2ssh-core/0.2.2/j2ssh-core-0.2.2.jar
[INFO] Unable to find resource 'sshtools:j2ssh-core:jar:0.2.2' in repository javax-transaction
(http://download.java.net/maven/2)
[INFO] Unable to find resource 'com.jcraft:jsch:jar:0.1.42' in repository javax-transaction
(http://download.java.net/maven/2)
Downloading: http://projects.iplantcollaborative.org/archiva/repository/internal/sshtools/j2ssh-core/0.2.2/j2ssh-core-0.2.2.jar
Downloading: http://projects.iplantcollaborative.org/archiva/repository/internal/com/jcraft/jsch/0.1.42/jsch-0.1.42.jar
181K downloaded  (jsch-0.1.42.jar)
329K downloaded  (j2ssh-core-0.2.2.jar)
Downloading: http://download.java.net/maven/2/sshtools/j2ssh-daemon/0.2.2/j2ssh-daemon-0.2.2.jar
[INFO] Unable to find resource 'sshtools:j2ssh-daemon:jar:0.2.2' in repository javax-transaction
(http://download.java.net/maven/2)
Downloading: http://projects.iplantcollaborative.org/archiva/repository/internal/sshtools/j2ssh-daemon/0.2.2/j2ssh-daemon-0.2.2.jar
92K downloaded  (j2ssh-daemon-0.2.2.jar)
[INFO] [resources:resources {execution: default-resources}]
[INFO] Using 'UTF-8' encoding to copy filtered resources.
[INFO] Copying 1 resource to org/apache/oodt/cas/protocol/sftp
[INFO] Copying 3 resources
[INFO] [compiler:compile {execution: default-compile}]
[INFO] Nothing to compile - all classes are up to date
[INFO] [resources:testResources {execution: default-testResources}]
[INFO] Using 'UTF-8' encoding to copy filtered resources.
[INFO] skip non existing resourceDirectory <https://builds.apache.org/job/oodt-trunk/org.apache.oodt$cas-protocol-sftp/ws/src/test/resources>
[INFO] Copying 3 resources
[INFO] [compiler:testCompile {execution: default-testCompile}]
[INFO] Compiling 1 source file to <https://builds.apache.org/job/oodt-trunk/org.apache.oodt$cas-protocol-sftp/ws/target/test-classes>
[INFO] -------------------------------------------------------------
[ERROR] COMPILATION ERROR : 
[INFO] -------------------------------------------------------------
[ERROR] <https://builds.apache.org/job/oodt-trunk/org.apache.oodt$cas-protocol-sftp/ws/src/test/org/apache/oodt/cas/protocol/sftp/XTestJschSftpProtocol.java>:[47,7]
class TestJschSftpProtocol is public, should be declared in a file named TestJschSftpProtocol.java
[INFO] 1 error
[INFO] -------------------------------------------------------------
[JENKINS] Archiving <https://builds.apache.org/job/oodt-trunk/org.apache.oodt$cas-protocol-sftp/ws/pom.xml>
to /home/hudson/hudson/jobs/oodt-trunk/modules/org.apache.oodt$cas-protocol-sftp/builds/2011-10-06_03-32-22/archive/org.apache.oodt/cas-protocol-sftp/0.4-SNAPSHOT/cas-protocol-sftp-0.4-SNAPSHOT.pom
[INFO] ------------------------------------------------------------------------
[ERROR] BUILD FAILURE
[INFO] ------------------------------------------------------------------------
[INFO] Compilation failure
<https://builds.apache.org/job/oodt-trunk/org.apache.oodt$cas-protocol-sftp/ws/src/test/org/apache/oodt/cas/protocol/sftp/XTestJschSftpProtocol.java>:[47,7]
class TestJschSftpProtocol is public, should be declared in a file named TestJschSftpProtocol.java

[INFO] ------------------------------------------------------------------------
[INFO] For more information, run Maven with the -e switch
[INFO] ------------------------------------------------------------------------
[INFO] Total time: 8 minutes 48 seconds
[INFO] Finished at: Thu Oct 06 03:41:37 UTC 2011
[INFO] Final Memory: 65M/339M
[INFO] ------------------------------------------------------------------------


Mime
View raw message