oodt-dev mailing list archives

Site index · List index
Message view « Date » · « Thread »
Top « Date » · « Thread »
From Apache Jenkins Server <jenk...@builds.apache.org>
Subject Build failed in Jenkins: oodt-trunk » CAS Protocol SFTP Implementation #44
Date Sat, 08 Oct 2011 02:24:18 GMT
See <https://builds.apache.org/job/oodt-trunk/org.apache.oodt$cas-protocol-sftp/44/changes>

Changes:

[mattmann] - rename folders without protocol-* prefix (we already know we're in the protocol
dir)

------------------------------------------
[INFO] ------------------------------------------------------------------------
[INFO] Building CAS Protocol SFTP Implementation
[INFO]    task-segment: [install]
[INFO] ------------------------------------------------------------------------
[INFO] [remote-resources:process {execution: default}]
Downloading: http://download.java.net/maven/2/sshtools/j2ssh-core/0.2.9/j2ssh-core-0.2.9.pom
192b downloaded  (j2ssh-core-0.2.9.pom)
Downloading: http://download.java.net/maven/2/sshtools/j2ssh-daemon/0.2.9/j2ssh-daemon-0.2.9.pom
194b downloaded  (j2ssh-daemon-0.2.9.pom)
Downloading: http://download.java.net/maven/2/sshtools/j2ssh-core/0.2.9/j2ssh-core-0.2.9.jar
346K downloaded  (j2ssh-core-0.2.9.jar)
Downloading: http://download.java.net/maven/2/sshtools/j2ssh-daemon/0.2.9/j2ssh-daemon-0.2.9.jar
107K downloaded  (j2ssh-daemon-0.2.9.jar)
[INFO] [resources:resources {execution: default-resources}]
[INFO] Using 'UTF-8' encoding to copy filtered resources.
[INFO] Copying 1 resource
[INFO] Copying 3 resources
[INFO] [compiler:compile {execution: default-compile}]
[INFO] Compiling 3 source files to <https://builds.apache.org/job/oodt-trunk/org.apache.oodt$cas-protocol-sftp/ws/target/classes>
[INFO] [resources:testResources {execution: default-testResources}]
[INFO] Using 'UTF-8' encoding to copy filtered resources.
[INFO] skip non existing resourceDirectory <https://builds.apache.org/job/oodt-trunk/org.apache.oodt$cas-protocol-sftp/ws/src/test/resources>
[INFO] Copying 3 resources
[INFO] [compiler:testCompile {execution: default-testCompile}]
[INFO] Compiling 4 source files to <https://builds.apache.org/job/oodt-trunk/org.apache.oodt$cas-protocol-sftp/ws/target/test-classes>
[INFO] -------------------------------------------------------------
[ERROR] COMPILATION ERROR : 
[INFO] -------------------------------------------------------------
[ERROR] <https://builds.apache.org/job/oodt-trunk/org.apache.oodt$cas-protocol-sftp/ws/src/test/org/apache/oodt/cas/protocol/sftp/TestJschSftpProtocol.java>:[73,20]
stop(java.lang.String) in com.sshtools.daemon.SshDaemon cannot be applied to ()
[ERROR] <https://builds.apache.org/job/oodt-trunk/org.apache.oodt$cas-protocol-sftp/ws/src/test/org/apache/oodt/cas/protocol/sftp/TestJschSftpProtocol.java>:[84,12]
stop(java.lang.String) in com.sshtools.daemon.SshDaemon cannot be applied to ()
[INFO] 2 errors 
[INFO] -------------------------------------------------------------
[JENKINS] Archiving <https://builds.apache.org/job/oodt-trunk/org.apache.oodt$cas-protocol-sftp/ws/pom.xml>
to /home/hudson/hudson/jobs/oodt-trunk/modules/org.apache.oodt$cas-protocol-sftp/builds/2011-10-08_02-19-36/archive/org.apache.oodt/cas-protocol-sftp/0.4-SNAPSHOT/cas-protocol-sftp-0.4-SNAPSHOT.pom
[INFO] ------------------------------------------------------------------------
[ERROR] BUILD FAILURE
[INFO] ------------------------------------------------------------------------
[INFO] Compilation failure

<https://builds.apache.org/job/oodt-trunk/org.apache.oodt$cas-protocol-sftp/ws/src/test/org/apache/oodt/cas/protocol/sftp/TestJschSftpProtocol.java>:[73,20]
stop(java.lang.String) in com.sshtools.daemon.SshDaemon cannot be applied to ()
<https://builds.apache.org/job/oodt-trunk/org.apache.oodt$cas-protocol-sftp/ws/src/test/org/apache/oodt/cas/protocol/sftp/TestJschSftpProtocol.java>:[84,12]
stop(java.lang.String) in com.sshtools.daemon.SshDaemon cannot be applied to ()

[INFO] ------------------------------------------------------------------------
[INFO] For more information, run Maven with the -e switch
[INFO] ------------------------------------------------------------------------
[INFO] Total time: 3 minutes 57 seconds
[INFO] Finished at: Sat Oct 08 02:24:17 UTC 2011
[INFO] Final Memory: 99M/443M
[INFO] ------------------------------------------------------------------------


Mime
View raw message