oodt-dev mailing list archives

Site index · List index
Message view « Date » · « Thread »
Top « Date » · « Thread »
From Cameron Goodale <sigep...@gmail.com>
Subject Re: cannot install OODT, help!
Date Sun, 27 Mar 2011 05:42:54 GMT
Derek, that seems like a lot of errors. Just to cover the basics, what
version of maven are you using? OODT only builds on maven 2. This causes a
lot of issues when trying to build.
Check the version and let me know what you find.

Cameron
On Mar 26, 2011 10:34 PM, "Derek" <zhou.fighton@gmail.com> wrote:
> Hi,
>
> I cannot install OODT in my system neither using Maven Eclipse plugin nor
by
> mvn -install command.
>
> My OS is Win 7 64bit and the Following is the whole stack trace:
>
> Would you please help me to figure out what's the problem? I will really
> appreciate it.
>
> Derek
>
> [INFO] Scanning for projects...
> [WARNING]
> [WARNING] Some problems were encountered while building the effective
model
> for org.apache.oodt:oodt-core:pom:0.2
> [WARNING] 'build.plugins.plugin.version' for
> org.apache.maven.plugins:maven-compiler-plugin is missing. @ line 257,
> column 21
> [WARNING] 'build.plugins.plugin.version' for
> org.apache.maven.plugins:maven-surefire-plugin is missing. @ line 276,
> column 21
> [WARNING] 'build.plugins.plugin.version' for
> org.apache.maven.plugins:maven-jar-plugin is missing. @ line 264, column
21
> [WARNING]
> [WARNING] Some problems were encountered while building the effective
model
> for org.apache.oodt:oodt-commons:jar:0.2
> [WARNING] 'build.plugins.plugin.version' for
> org.apache.maven.plugins:maven-compiler-plugin is missing. @
> org.apache.oodt:oodt-core:0.2,
> E:\workspace\578\apache-oodt-0.2-src\core\pom.xml, line 257, column 21
> [WARNING] 'build.plugins.plugin.version' for
> org.apache.maven.plugins:maven-jar-plugin is missing. @
> org.apache.oodt:oodt-core:0.2,
> E:\workspace\578\apache-oodt-0.2-src\core\pom.xml, line 264, column 21
> [WARNING]
> [WARNING] Some problems were encountered while building the effective
model
> for org.apache.oodt:pcs-input:jar:0.2
> [WARNING] 'build.plugins.plugin.version' for
> org.apache.maven.plugins:maven-compiler-plugin is missing. @
> org.apache.oodt:oodt-core:0.2,
> E:\workspace\578\apache-oodt-0.2-src\core\pom.xml, line 257, column 21
> [WARNING] 'build.plugins.plugin.version' for
> org.apache.maven.plugins:maven-jar-plugin is missing. @
> org.apache.oodt:oodt-core:0.2,
> E:\workspace\578\apache-oodt-0.2-src\core\pom.xml, line 264, column 21
> [WARNING]
> [WARNING] Some problems were encountered while building the effective
model
> for org.apache.oodt:cas-metadata:jar:0.2
> [WARNING] 'build.plugins.plugin.version' for
> org.apache.maven.plugins:maven-compiler-plugin is missing. @
> org.apache.oodt:oodt-core:0.2,
> E:\workspace\578\apache-oodt-0.2-src\core\pom.xml, line 257, column 21
> [WARNING] 'build.plugins.plugin.version' for
> org.apache.maven.plugins:maven-surefire-plugin is missing. @ line 70,
column
> 15
> [WARNING] 'build.plugins.plugin.version' for
> org.apache.maven.plugins:maven-jar-plugin is missing. @
> org.apache.oodt:oodt-core:0.2,
> E:\workspace\578\apache-oodt-0.2-src\core\pom.xml, line 264, column 21
> [WARNING]
> [WARNING] Some problems were encountered while building the effective
model
> for org.apache.oodt:oodt-xmlquery:jar:0.2
> [WARNING] 'build.plugins.plugin.version' for
> org.apache.maven.plugins:maven-compiler-plugin is missing. @
> org.apache.oodt:oodt-core:0.2,
> E:\workspace\578\apache-oodt-0.2-src\core\pom.xml, line 257, column 21
> [WARNING] 'build.plugins.plugin.version' for
> org.apache.maven.plugins:maven-surefire-plugin is missing. @ line 53,
column
> 15
> [WARNING] 'build.plugins.plugin.version' for
> org.apache.maven.plugins:maven-jar-plugin is missing. @
> org.apache.oodt:oodt-core:0.2,
> E:\workspace\578\apache-oodt-0.2-src\core\pom.xml, line 264, column 21
> [WARNING]
> [WARNING] Some problems were encountered while building the effective
model
> for org.apache.oodt:oodt-sso:jar:0.2
> [WARNING] 'build.plugins.plugin.version' for
> org.apache.maven.plugins:maven-compiler-plugin is missing. @
> org.apache.oodt:oodt-core:0.2,
> E:\workspace\578\apache-oodt-0.2-src\core\pom.xml, line 257, column 21
> [WARNING] 'build.plugins.plugin.version' for
> org.apache.maven.plugins:maven-surefire-plugin is missing. @
> org.apache.oodt:oodt-core:0.2,
> E:\workspace\578\apache-oodt-0.2-src\core\pom.xml, line 276, column 21
> [WARNING] 'build.plugins.plugin.version' for
> org.apache.maven.plugins:maven-jar-plugin is missing. @
> org.apache.oodt:oodt-core:0.2,
> E:\workspace\578\apache-oodt-0.2-src\core\pom.xml, line 264, column 21
> [WARNING]
> [WARNING] Some problems were encountered while building the effective
model
> for org.apache.oodt:cas-filemgr:jar:0.2
> [WARNING] 'build.plugins.plugin.version' for
> org.apache.maven.plugins:maven-compiler-plugin is missing. @
> org.apache.oodt:oodt-core:0.2,
> E:\workspace\578\apache-oodt-0.2-src\core\pom.xml, line 257, column 21
> [WARNING] 'build.plugins.plugin.version' for
> org.apache.maven.plugins:maven-jar-plugin is missing. @
> org.apache.oodt:oodt-core:0.2,
> E:\workspace\578\apache-oodt-0.2-src\core\pom.xml, line 264, column 21
> [WARNING]
> [WARNING] Some problems were encountered while building the effective
model
> for org.apache.oodt:cas-catalog:jar:0.2
> [WARNING] 'build.plugins.plugin.version' for
> org.apache.maven.plugins:maven-compiler-plugin is missing. @
> org.apache.oodt:oodt-core:0.2,
> E:\workspace\578\apache-oodt-0.2-src\core\pom.xml, line 257, column 21
> [WARNING] 'build.plugins.plugin.version' for
> org.apache.maven.plugins:maven-surefire-plugin is missing. @
> org.apache.oodt:oodt-core:0.2,
> E:\workspace\578\apache-oodt-0.2-src\core\pom.xml, line 276, column 21
> [WARNING] 'build.plugins.plugin.version' for
> org.apache.maven.plugins:maven-jar-plugin is missing. @
> org.apache.oodt:oodt-core:0.2,
> E:\workspace\578\apache-oodt-0.2-src\core\pom.xml, line 264, column 21
> [WARNING]
> [WARNING] Some problems were encountered while building the effective
model
> for org.apache.oodt:cas-workflow:jar:0.2
> [WARNING] 'build.plugins.plugin.version' for
> org.apache.maven.plugins:maven-compiler-plugin is missing. @
> org.apache.oodt:oodt-core:0.2,
> E:\workspace\578\apache-oodt-0.2-src\core\pom.xml, line 257, column 21
> [WARNING] 'build.plugins.plugin.version' for
> org.apache.maven.plugins:maven-jar-plugin is missing. @
> org.apache.oodt:oodt-core:0.2,
> E:\workspace\578\apache-oodt-0.2-src\core\pom.xml, line 264, column 21
> [WARNING]
> [WARNING] Some problems were encountered while building the effective
model
> for org.apache.oodt:cas-crawler:jar:0.2
> [WARNING] 'build.plugins.plugin.version' for
> org.apache.maven.plugins:maven-compiler-plugin is missing. @
> org.apache.oodt:oodt-core:0.2,
> E:\workspace\578\apache-oodt-0.2-src\core\pom.xml, line 257, column 21
> [WARNING] 'build.plugins.plugin.version' for
> org.apache.maven.plugins:maven-jar-plugin is missing. @
> org.apache.oodt:oodt-core:0.2,
> E:\workspace\578\apache-oodt-0.2-src\core\pom.xml, line 264, column 21
> [WARNING]
> [WARNING] Some problems were encountered while building the effective
model
> for org.apache.oodt:cas-resource:jar:0.2
> [WARNING] 'build.plugins.plugin.version' for
> org.apache.maven.plugins:maven-compiler-plugin is missing. @
> org.apache.oodt:oodt-core:0.2,
> E:\workspace\578\apache-oodt-0.2-src\core\pom.xml, line 257, column 21
> [WARNING] 'build.plugins.plugin.version' for
> org.apache.maven.plugins:maven-jar-plugin is missing. @
> org.apache.oodt:oodt-core:0.2,
> E:\workspace\578\apache-oodt-0.2-src\core\pom.xml, line 264, column 21
> [WARNING]
> [WARNING] Some problems were encountered while building the effective
model
> for org.apache.oodt:cas-curator:war:0.2
> [WARNING] 'build.plugins.plugin.version' for
> org.apache.maven.plugins:maven-compiler-plugin is missing. @
> org.apache.oodt:oodt-core:0.2,
> E:\workspace\578\apache-oodt-0.2-src\core\pom.xml, line 257, column 21
> [WARNING] 'build.plugins.plugin.version' for
> org.apache.maven.plugins:maven-surefire-plugin is missing. @
> org.apache.oodt:oodt-core:0.2,
> E:\workspace\578\apache-oodt-0.2-src\core\pom.xml, line 276, column 21
> [WARNING] 'build.plugins.plugin.version' for
> org.apache.maven.plugins:maven-jar-plugin is missing. @
> org.apache.oodt:oodt-core:0.2,
> E:\workspace\578\apache-oodt-0.2-src\core\pom.xml, line 264, column 21
> [WARNING]
> [WARNING] Some problems were encountered while building the effective
model
> for org.apache.oodt:cas-pge:jar:0.2
> [WARNING] 'build.plugins.plugin.version' for
> org.apache.maven.plugins:maven-compiler-plugin is missing. @
> org.apache.oodt:oodt-core:0.2,
> E:\workspace\578\apache-oodt-0.2-src\core\pom.xml, line 257, column 21
> [WARNING] 'build.plugins.plugin.version' for
> org.apache.maven.plugins:maven-surefire-plugin is missing. @
> org.apache.oodt:oodt-core:0.2,
> E:\workspace\578\apache-oodt-0.2-src\core\pom.xml, line 276, column 21
> [WARNING] 'build.plugins.plugin.version' for
> org.apache.maven.plugins:maven-jar-plugin is missing. @
> org.apache.oodt:oodt-core:0.2,
> E:\workspace\578\apache-oodt-0.2-src\core\pom.xml, line 264, column 21
> [WARNING]
> [WARNING] Some problems were encountered while building the effective
model
> for org.apache.oodt:maven-cas-install-plugin:maven-plugin:0.2
> [WARNING] 'build.plugins.plugin.version' for
> org.apache.maven.plugins:maven-compiler-plugin is missing. @
> org.apache.oodt:oodt-core:0.2,
> E:\workspace\578\apache-oodt-0.2-src\core\pom.xml, line 257, column 21
> [WARNING] 'build.plugins.plugin.version' for
> org.apache.maven.plugins:maven-surefire-plugin is missing. @
> org.apache.oodt:oodt-core:0.2,
> E:\workspace\578\apache-oodt-0.2-src\core\pom.xml, line 276, column 21
> [WARNING] 'build.plugins.plugin.version' for
> org.apache.maven.plugins:maven-jar-plugin is missing. @
> org.apache.oodt:oodt-core:0.2,
> E:\workspace\578\apache-oodt-0.2-src\core\pom.xml, line 264, column 21
> [WARNING]
> [WARNING] Some problems were encountered while building the effective
model
> for org.apache.oodt:cas-pushpull:jar:0.2
> [WARNING] 'build.plugins.plugin.version' for
> org.apache.maven.plugins:maven-compiler-plugin is missing. @
> org.apache.oodt:oodt-core:0.2,
> E:\workspace\578\apache-oodt-0.2-src\core\pom.xml, line 257, column 21
> [WARNING] 'build.plugins.plugin.version' for
> org.apache.maven.plugins:maven-surefire-plugin is missing. @
> org.apache.oodt:oodt-core:0.2,
> E:\workspace\578\apache-oodt-0.2-src\core\pom.xml, line 276, column 21
> [WARNING] 'build.plugins.plugin.version' for
> org.apache.maven.plugins:maven-jar-plugin is missing. @
> org.apache.oodt:oodt-core:0.2,
> E:\workspace\578\apache-oodt-0.2-src\core\pom.xml, line 264, column 21
> [WARNING]
> [WARNING] Some problems were encountered while building the effective
model
> for org.apache.oodt:oodt-product:jar:0.2
> [WARNING] 'build.plugins.plugin.version' for
> org.apache.maven.plugins:maven-compiler-plugin is missing. @
> org.apache.oodt:oodt-core:0.2,
> E:\workspace\578\apache-oodt-0.2-src\core\pom.xml, line 257, column 21
> [WARNING] 'build.plugins.plugin.version' for
> org.apache.maven.plugins:maven-surefire-plugin is missing. @
> org.apache.oodt:oodt-core:0.2,
> E:\workspace\578\apache-oodt-0.2-src\core\pom.xml, line 276, column 21
> [WARNING] 'build.plugins.plugin.version' for
> org.apache.maven.plugins:maven-jar-plugin is missing. @
> org.apache.oodt:oodt-core:0.2,
> E:\workspace\578\apache-oodt-0.2-src\core\pom.xml, line 264, column 21
> [WARNING]
> [WARNING] Some problems were encountered while building the effective
model
> for org.apache.oodt:oodt-profile:jar:0.2
> [WARNING] 'build.plugins.plugin.version' for
> org.apache.maven.plugins:maven-compiler-plugin is missing. @
> org.apache.oodt:oodt-core:0.2,
> E:\workspace\578\apache-oodt-0.2-src\core\pom.xml, line 257, column 21
> [WARNING] 'build.plugins.plugin.version' for
> org.apache.maven.plugins:maven-surefire-plugin is missing. @ line 58,
column
> 15
> [WARNING] 'build.plugins.plugin.version' for
> org.apache.maven.plugins:maven-jar-plugin is missing. @
> org.apache.oodt:oodt-core:0.2,
> E:\workspace\578\apache-oodt-0.2-src\core\pom.xml, line 264, column 21
> [WARNING]
> [WARNING] Some problems were encountered while building the effective
model
> for org.apache.oodt:web-grid:war:0.2
> [WARNING] 'build.plugins.plugin.version' for
> org.apache.maven.plugins:maven-compiler-plugin is missing. @
> org.apache.oodt:oodt-core:0.2,
> E:\workspace\578\apache-oodt-0.2-src\core\pom.xml, line 257, column 21
> [WARNING] 'build.plugins.plugin.version' for
> org.apache.maven.plugins:maven-surefire-plugin is missing. @
> org.apache.oodt:oodt-core:0.2,
> E:\workspace\578\apache-oodt-0.2-src\core\pom.xml, line 276, column 21
> [WARNING] 'build.plugins.plugin.version' for
> org.apache.maven.plugins:maven-war-plugin is missing. @ line 64, column 15
> [WARNING] 'build.plugins.plugin.version' for
> org.apache.maven.plugins:maven-jar-plugin is missing. @
> org.apache.oodt:oodt-core:0.2,
> E:\workspace\578\apache-oodt-0.2-src\core\pom.xml, line 264, column 21
> [WARNING]
> [WARNING] Some problems were encountered while building the effective
model
> for org.apache.oodt:oodt-xmlps:jar:${oodt.version}
> [WARNING] 'version' contains an expression but should be a constant. @
line
> 31, column 11
> [WARNING] 'build.plugins.plugin.version' for
> org.apache.maven.plugins:maven-compiler-plugin is missing. @
> org.apache.oodt:oodt-core:0.2,
> E:\workspace\578\apache-oodt-0.2-src\core\pom.xml, line 257, column 21
> [WARNING] 'build.plugins.plugin.version' for
> org.apache.maven.plugins:maven-surefire-plugin is missing. @ line 64,
column
> 12
> [WARNING] 'build.plugins.plugin.version' for
> org.apache.maven.plugins:maven-jar-plugin is missing. @
> org.apache.oodt:oodt-core:0.2,
> E:\workspace\578\apache-oodt-0.2-src\core\pom.xml, line 264, column 21
> [WARNING]
> [WARNING] Some problems were encountered while building the effective
model
> for org.apache.oodt:opendapps:jar:0.2
> [WARNING] 'build.plugins.plugin.version' for
> org.apache.maven.plugins:maven-compiler-plugin is missing. @
> org.apache.oodt:oodt-core:0.2,
>
C:\Users\Zhou\.m2\repository\org\apache\oodt\oodt-core\0.2\oodt-core-0.2.pom,
> line 257, column 21
> [WARNING] 'build.plugins.plugin.version' for
> org.apache.maven.plugins:maven-surefire-plugin is missing. @
> org.apache.oodt:oodt-core:0.2,
>
C:\Users\Zhou\.m2\repository\org\apache\oodt\oodt-core\0.2\oodt-core-0.2.pom,
> line 276, column 21
> [WARNING] 'build.plugins.plugin.version' for
> org.apache.maven.plugins:maven-jar-plugin is missing. @
> org.apache.oodt:oodt-core:0.2,
>
C:\Users\Zhou\.m2\repository\org\apache\oodt\oodt-core\0.2\oodt-core-0.2.pom,
> line 264, column 21
> [WARNING]
> [WARNING] Some problems were encountered while building the effective
model
> for org.apache.oodt:cas-fm-webapp:war:0.2
> [WARNING] 'build.plugins.plugin.version' for
> org.apache.maven.plugins:maven-compiler-plugin is missing. @
> org.apache.oodt:oodt-core:0.2,
> E:\workspace\578\apache-oodt-0.2-src\core\pom.xml, line 257, column 21
> [WARNING] 'build.plugins.plugin.version' for
> org.apache.maven.plugins:maven-surefire-plugin is missing. @
> org.apache.oodt:oodt-core:0.2,
> E:\workspace\578\apache-oodt-0.2-src\core\pom.xml, line 276, column 21
> [WARNING] 'build.plugins.plugin.version' for
> org.apache.maven.plugins:maven-war-plugin is missing. @ line 35, column 15
> [WARNING] 'build.plugins.plugin.version' for
> org.apache.maven.plugins:maven-jar-plugin is missing. @
> org.apache.oodt:oodt-core:0.2,
> E:\workspace\578\apache-oodt-0.2-src\core\pom.xml, line 264, column 21
> [WARNING]
> [WARNING] Some problems were encountered while building the effective
model
> for org.apache.oodt:cas-product:war:0.2
> [WARNING] 'build.plugins.plugin.version' for
> org.apache.maven.plugins:maven-compiler-plugin is missing. @
> org.apache.oodt:oodt-core:0.2,
> E:\workspace\578\apache-oodt-0.2-src\core\pom.xml, line 257, column 21
> [WARNING] 'build.plugins.plugin.version' for
> org.apache.maven.plugins:maven-war-plugin is missing. @ line 37, column 15
> [WARNING] 'build.plugins.plugin.version' for
> org.apache.maven.plugins:maven-jar-plugin is missing. @
> org.apache.oodt:oodt-core:0.2,
> E:\workspace\578\apache-oodt-0.2-src\core\pom.xml, line 264, column 21
> [WARNING]
> [WARNING] Some problems were encountered while building the effective
model
> for org.apache.oodt:cas-wm-webapp:war:0.2
> [WARNING] 'build.plugins.plugin.version' for
> org.apache.maven.plugins:maven-compiler-plugin is missing. @
> org.apache.oodt:oodt-core:0.2,
> E:\workspace\578\apache-oodt-0.2-src\core\pom.xml, line 257, column 21
> [WARNING] 'build.plugins.plugin.version' for
> org.apache.maven.plugins:maven-surefire-plugin is missing. @
> org.apache.oodt:oodt-core:0.2,
> E:\workspace\578\apache-oodt-0.2-src\core\pom.xml, line 276, column 21
> [WARNING] 'build.plugins.plugin.version' for
> org.apache.maven.plugins:maven-war-plugin is missing. @ line 35, column 15
> [WARNING] 'build.plugins.plugin.version' for
> org.apache.maven.plugins:maven-jar-plugin is missing. @
> org.apache.oodt:oodt-core:0.2,
> E:\workspace\578\apache-oodt-0.2-src\core\pom.xml, line 264, column 21
> [WARNING]
> [WARNING] Some problems were encountered while building the effective
model
> for org.apache.oodt:cas-fm-browser:jar:0.2
> [WARNING] 'build.plugins.plugin.version' for
> org.apache.maven.plugins:maven-compiler-plugin is missing. @
> org.apache.oodt:oodt-core:0.2,
> E:\workspace\578\apache-oodt-0.2-src\core\pom.xml, line 257, column 21
> [WARNING] 'build.plugins.plugin.version' for
> org.apache.maven.plugins:maven-surefire-plugin is missing. @
> org.apache.oodt:oodt-core:0.2,
> E:\workspace\578\apache-oodt-0.2-src\core\pom.xml, line 276, column 21
> [WARNING] 'build.plugins.plugin.version' for
> org.apache.maven.plugins:maven-jar-plugin is missing. @
> org.apache.oodt:oodt-core:0.2,
> E:\workspace\578\apache-oodt-0.2-src\core\pom.xml, line 264, column 21
> [WARNING]
> [WARNING] Some problems were encountered while building the effective
model
> for org.apache.oodt:oodt:pom:0.2
> [WARNING] 'build.plugins.plugin.version' for
> org.apache.maven.plugins:maven-compiler-plugin is missing. @
> org.apache.oodt:oodt-core:0.2,
> E:\workspace\578\apache-oodt-0.2-src\core\pom.xml, line 257, column 21
> [WARNING] 'build.plugins.plugin.version' for
> org.apache.maven.plugins:maven-surefire-plugin is missing. @
> org.apache.oodt:oodt-core:0.2,
> E:\workspace\578\apache-oodt-0.2-src\core\pom.xml, line 276, column 21
> [WARNING] 'build.plugins.plugin.version' for
> org.apache.maven.plugins:maven-jar-plugin is missing. @
> org.apache.oodt:oodt-core:0.2,
> E:\workspace\578\apache-oodt-0.2-src\core\pom.xml, line 264, column 21
> [WARNING]
> [WARNING] It is highly recommended to fix these problems because they
> threaten the stability of your build.
> [WARNING]
> [WARNING] For this reason, future Maven versions might no longer support
> building such malformed projects.
> [WARNING]
> [INFO]
> ------------------------------------------------------------------------
> [INFO] Reactor Build Order:
> [INFO]
> [INFO] OODT Core
> [INFO] Common Utilities
> [INFO] Process Control System Input Data Package
> [INFO] Catalog and Archive Service Generic Multi-valued Metadata Container
> [INFO] Query Expression
> [INFO] OODT Single Sign On Security Package
> [INFO] Catalog and Archive File Management Component
> [INFO] OODT CAS Virtual Catalog and Integration Service.
> [INFO] Catalog and Archive Resource Management Component
> [INFO] Catalog and Archive Workflow Management Component
> [INFO] Catalog and Archive Crawling Framework
> [INFO] CAS Curation Interface
> [INFO] CAS PGE Adaptor Framework
> [INFO] CAS Installer Maven Mojo
> [INFO] CAS Push-Pull-Framework
> [INFO] Product Service
> [INFO] Profile Service
> [INFO] OODT Web Grid
> [INFO] XML-configured, DBMS-based Product and Profile Server
> [INFO] Apache OODT Configurable OPeNDAP Profile Server
> [INFO] CAS File Manager Webapp Application
> [INFO] CAS Product Server
> [INFO] CAS Workflow Monitor Web Application
> [INFO] Catalog and Archive File Management Browser
> [INFO] Apache OODT
> [INFO]
>
> [INFO]
> ------------------------------------------------------------------------
> [INFO] Building OODT Core 0.2
> [INFO]
> ------------------------------------------------------------------------
> [INFO]
> [INFO] >>> maven-javadoc-plugin:2.7:javadoc (attach-javadocs) @ oodt-core
>>>>
> [INFO]
> [INFO] <<< maven-javadoc-plugin:2.7:javadoc (attach-javadocs) @ oodt-core
> <<<
> [INFO]
> [INFO] --- maven-javadoc-plugin:2.7:javadoc (attach-javadocs) @ oodt-core
> ---
> [INFO]
> [INFO] --- maven-install-plugin:2.3.1:install (default-install) @
oodt-core
> ---
> [INFO] Installing E:\workspace\578\apache-oodt-0.2-src\core\pom.xml to
>
C:\Users\Zhou\.m2\repository\org\apache\oodt\oodt-core\0.2\oodt-core-0.2.pom
> [INFO]
>
> [INFO]
> ------------------------------------------------------------------------
> [INFO] Building Common Utilities 0.2
> [INFO]
> ------------------------------------------------------------------------
> [INFO]
> [INFO] --- maven-resources-plugin:2.4.3:resources (default-resources) @
> oodt-commons ---
> [INFO] Using 'UTF-8' encoding to copy filtered resources.
> [INFO] Copying 1 resource to org/apache/oodt/commons
> [INFO] Copying 1 resource to org/apache/oodt/commons/util
> [INFO]
> [INFO] --- maven-compiler-plugin:2.3.2:compile (default-compile) @
> oodt-commons ---
> [INFO] Compiling 102 source files to
> E:\workspace\578\apache-oodt-0.2-src\commons\target\classes
> [INFO]
> [INFO] --- maven-resources-plugin:2.4.3:testResources
> (default-testResources) @ oodt-commons ---
> [INFO] Using 'UTF-8' encoding to copy filtered resources.
> [INFO] Copying 1 resource to org/apache/oodt/commons/util
> [INFO] Copying 1 resource to org/apache/oodt/commons
> [INFO]
> [INFO] --- maven-compiler-plugin:2.3.2:testCompile (default-testCompile) @
> oodt-commons ---
> [INFO] Compiling 29 source files to
> E:\workspace\578\apache-oodt-0.2-src\commons\target\test-classes
> [INFO]
> [INFO] --- maven-surefire-plugin:2.4:test (default-test) @ oodt-commons
---
> [INFO] Surefire report directory:
> E:\workspace\578\apache-oodt-0.2-src\commons\target\surefire-reports
>
> -------------------------------------------------------
> T E S T S
> -------------------------------------------------------
> Running org.apache.oodt.commons.util.LDAPTest
> Tests run: 1, Failures: 0, Errors: 0, Skipped: 0, Time elapsed: 0.044 sec
> Running
org.apache.oodt.commons.option.handler.TestCmdLineOptionBeanHandler
> Tests run: 1, Failures: 0, Errors: 0, Skipped: 0, Time elapsed: 0.031 sec
> Running org.apache.oodt.commons.io.FixedBufferOutputStreamTest
> Tests run: 3, Failures: 0, Errors: 0, Skipped: 0, Time elapsed: 0.05 sec
> Running org.apache.oodt.commons.activity.ActivityStoppedTest
> Tests run: 1, Failures: 0, Errors: 0, Skipped: 0, Time elapsed: 0.139 sec
> Running org.apache.oodt.commons.ConfiguredTestCaseTest
> Tests run: 2, Failures: 0, Errors: 0, Skipped: 0, Time elapsed: 0.541 sec
> Running org.apache.oodt.commons.NaughtyTest
> Tests run: 1, Failures: 0, Errors: 0, Skipped: 0, Time elapsed: 0.024 sec
> Running org.apache.oodt.commons.net.NetTest
> Tests run: 2, Failures: 0, Errors: 0, Skipped: 0, Time elapsed: 0.042 sec
> Running org.apache.oodt.commons.util.Base64Test
> Tests run: 1, Failures: 0, Errors: 0, Skipped: 0, Time elapsed: 0.029 sec
> Running org.apache.oodt.commons.ConfigurationTest
> Tests run: 1, Failures: 0, Errors: 0, Skipped: 0, Time elapsed: 0.261 sec
> Running org.apache.oodt.commons.util.EnterpriseEntityResolverTest
> Tests run: 4, Failures: 0, Errors: 0, Skipped: 0, Time elapsed: 0.213 sec
> Running
org.apache.oodt.commons.activity.DatagramLoggingActivityFactoryTest
> Tests run: 2, Failures: 0, Errors: 0, Skipped: 0, Time elapsed: 0.143 sec
> Running org.apache.oodt.commons.activity.ActivityTrackerTest
> Tests run: 1, Failures: 0, Errors: 0, Skipped: 0, Time elapsed: 0.066 sec
> Running org.apache.oodt.commons.util.XMLTest
> Tests run: 9, Failures: 1, Errors: 0, Skipped: 0, Time elapsed: 0.245 sec
> <<< FAILURE!
> Running org.apache.oodt.commons.activity.ActivityTest
> Tests run: 1, Failures: 0, Errors: 0, Skipped: 0, Time elapsed: 0.061 sec
> Running org.apache.oodt.commons.filter.TestTimeEventWeightedHash
> Tests run: 1, Failures: 0, Errors: 0, Skipped: 0, Time elapsed: 0.045 sec
> Running org.apache.oodt.commons.activity.CompositeActivityTest
> Tests run: 1, Failures: 0, Errors: 0, Skipped: 0, Time elapsed: 0.062 sec
> Running org.apache.oodt.commons.object.jndi.ObjectContextTest
> Tests run: 1, Failures: 0, Errors: 0, Skipped: 0, Time elapsed: 0.122 sec
> Running org.apache.oodt.commons.util.CacheMapTest
> Tests run: 5, Failures: 0, Errors: 0, Skipped: 0, Time elapsed: 0.027 sec
> Running org.apache.oodt.commons.util.UtilityTest
> Tests run: 1, Failures: 0, Errors: 0, Skipped: 0, Time elapsed: 0.123 sec
> Running org.apache.oodt.commons.MultiServerTest
> Tests run: 1, Failures: 0, Errors: 0, Skipped: 0, Time elapsed: 0.28 sec
> Running org.apache.oodt.commons.io.NullInputStreamTest
> Tests run: 2, Failures: 0, Errors: 0, Skipped: 0, Time elapsed: 0.027 sec
> Running org.apache.oodt.commons.exec.TestEnvUtilities
> Tests run: 1, Failures: 0, Errors: 0, Skipped: 0, Time elapsed: 0.03 sec
> Running org.apache.oodt.commons.AppTest
> Tests run: 1, Failures: 0, Errors: 0, Skipped: 0, Time elapsed: 0.024 sec
> Running org.apache.oodt.commons.object.jndi.TestContextTest
> Tests run: 1, Failures: 0, Errors: 0, Skipped: 0, Time elapsed: 0.026 sec
> Running org.apache.oodt.commons.io.NullOutputStreamTest
> Tests run: 3, Failures: 0, Errors: 0, Skipped: 0, Time elapsed: 0.027 sec
> Running org.apache.oodt.commons.activity.IncidentTest
> Tests run: 2, Failures: 0, Errors: 0, Skipped: 0, Time elapsed: 0.044 sec
> Running org.apache.oodt.commons.activity.HistoryTest
> Tests run: 5, Failures: 0, Errors: 0, Skipped: 0, Time elapsed: 3.847 sec
>
> Results :
>
> Failed tests:
>
> Tests run: 55, Failures: 1, Errors: 0, Skipped: 0
>
> [INFO]
> ------------------------------------------------------------------------
> [INFO] Reactor Summary:
> [INFO]
> [INFO] OODT Core ......................................... SUCCESS
[5.302s]
> [INFO] Common Utilities .................................. FAILURE
[27.573s]
> [INFO] Process Control System Input Data Package ......... SKIPPED
> [INFO] Catalog and Archive Service Generic Multi-valued Metadata Container
> SKIPPED
> [INFO] Query Expression .................................. SKIPPED
> [INFO] OODT Single Sign On Security Package .............. SKIPPED
> [INFO] Catalog and Archive File Management Component ..... SKIPPED
> [INFO] OODT CAS Virtual Catalog and Integration Service. . SKIPPED
> [INFO] Catalog and Archive Resource Management Component . SKIPPED
> [INFO] Catalog and Archive Workflow Management Component . SKIPPED
> [INFO] Catalog and Archive Crawling Framework ............ SKIPPED
> [INFO] CAS Curation Interface ............................ SKIPPED
> [INFO] CAS PGE Adaptor Framework ......................... SKIPPED
> [INFO] CAS Installer Maven Mojo .......................... SKIPPED
> [INFO] CAS Push-Pull-Framework ........................... SKIPPED
> [INFO] Product Service ................................... SKIPPED
> [INFO] Profile Service ................................... SKIPPED
> [INFO] OODT Web Grid ..................................... SKIPPED
> [INFO] XML-configured, DBMS-based Product and Profile Server SKIPPED
> [INFO] Apache OODT Configurable OPeNDAP Profile Server ... SKIPPED
> [INFO] CAS File Manager Webapp Application ............... SKIPPED
> [INFO] CAS Product Server ................................ SKIPPED
> [INFO] CAS Workflow Monitor Web Application .............. SKIPPED
> [INFO] Catalog and Archive File Management Browser ....... SKIPPED
> [INFO] Apache OODT ....................................... SKIPPED
> [INFO]
> ------------------------------------------------------------------------
> [INFO] BUILD FAILURE
> [INFO]
> ------------------------------------------------------------------------
> [INFO] Total time: 33.397s
> [INFO] Finished at: Sat Mar 26 18:30:55 PDT 2011
> [INFO] Final Memory: 20M/149M
> [INFO]
> ------------------------------------------------------------------------
> [ERROR] Failed to execute goal
> org.apache.maven.plugins:maven-surefire-plugin:2.4:test (default-test) on
> project oodt-commons: There are test failures.
> [ERROR]
> [ERROR] Please refer to
> E:\workspace\578\apache-oodt-0.2-src\commons\target\surefire-reports for
the
> individual test results.
> [ERROR] -> [Help 1]
> [ERROR]
> [ERROR] To see the full stack trace of the errors, re-run Maven with the
-e
> switch.
> [ERROR] Re-run Maven using the -X switch to enable full debug logging.
> [ERROR]
> [ERROR] For more information about the errors and possible solutions,
please
> read the following articles:
> [ERROR] [Help 1]
> http://cwiki.apache.org/confluence/display/MAVEN/MojoFailureException
> [ERROR]
> [ERROR] After correcting the problems, you can resume the build with the
> command
> [ERROR] mvn <goals> -rf :oodt-commons

Mime
  • Unnamed multipart/alternative (inline, None, 0 bytes)
View raw message