oltu-dev mailing list archives

Site index · List index
Message view « Date » · « Thread »
Top « Date » · « Thread »
From Apache Jenkins Server <jenk...@builds.apache.org>
Subject Build failed in Jenkins: Oltu-OpenID-Conect #689
Date Thu, 06 Jul 2017 15:11:22 GMT
See <https://builds.apache.org/job/Oltu-OpenID-Conect/689/display/redirect>

------------------------------------------
[...truncated 225.03 KB...]
[INFO] Downloading: https://repo.maven.apache.org/maven2/org/codehaus/plexus/plexus-compiler/2.2/plexus-compiler-2.2.pom
[INFO] Downloaded: https://repo.maven.apache.org/maven2/org/codehaus/plexus/plexus-compiler/2.2/plexus-compiler-2.2.pom
(3.6 kB at 278 kB/s)
[INFO] Downloading: https://repo.maven.apache.org/maven2/org/codehaus/plexus/plexus-components/1.3.1/plexus-components-1.3.1.pom
[INFO] Downloaded: https://repo.maven.apache.org/maven2/org/codehaus/plexus/plexus-components/1.3.1/plexus-components-1.3.1.pom
(3.1 kB at 255 kB/s)
[INFO] Downloading: https://repo.maven.apache.org/maven2/org/codehaus/plexus/plexus-utils/3.0.8/plexus-utils-3.0.8.pom
[INFO] Downloaded: https://repo.maven.apache.org/maven2/org/codehaus/plexus/plexus-utils/3.0.8/plexus-utils-3.0.8.pom
(3.1 kB at 262 kB/s)
[INFO] Downloading: https://repo.maven.apache.org/maven2/org/codehaus/plexus/plexus-compiler-manager/2.2/plexus-compiler-manager-2.2.pom
[INFO] Downloaded: https://repo.maven.apache.org/maven2/org/codehaus/plexus/plexus-compiler-manager/2.2/plexus-compiler-manager-2.2.pom
(690 B at 58 kB/s)
[INFO] Downloading: https://repo.maven.apache.org/maven2/org/codehaus/plexus/plexus-compiler-javac/2.2/plexus-compiler-javac-2.2.pom
[INFO] Downloaded: https://repo.maven.apache.org/maven2/org/codehaus/plexus/plexus-compiler-javac/2.2/plexus-compiler-javac-2.2.pom
(769 B at 64 kB/s)
[INFO] Downloading: https://repo.maven.apache.org/maven2/org/codehaus/plexus/plexus-compilers/2.2/plexus-compilers-2.2.pom
[INFO] Downloaded: https://repo.maven.apache.org/maven2/org/codehaus/plexus/plexus-compilers/2.2/plexus-compilers-2.2.pom
(1.2 kB at 103 kB/s)
[INFO] Downloading: https://repo.maven.apache.org/maven2/org/codehaus/plexus/plexus-utils/1.5.1/plexus-utils-1.5.1.jar
[INFO] Downloading: https://repo.maven.apache.org/maven2/org/apache/maven/maven-toolchain/1.0/maven-toolchain-1.0.jar
[INFO] Downloading: https://repo.maven.apache.org/maven2/org/apache/maven/shared/maven-shared-utils/0.1/maven-shared-utils-0.1.jar
[INFO] Downloading: https://repo.maven.apache.org/maven2/org/apache/maven/shared/maven-shared-incremental/1.1/maven-shared-incremental-1.1.jar
[INFO] Downloading: https://repo.maven.apache.org/maven2/org/codehaus/plexus/plexus-compiler-api/2.2/plexus-compiler-api-2.2.jar
[INFO] Downloaded: https://repo.maven.apache.org/maven2/org/apache/maven/maven-toolchain/1.0/maven-toolchain-1.0.jar
(33 kB at 1.8 MB/s)
[INFO] Downloaded: https://repo.maven.apache.org/maven2/org/apache/maven/shared/maven-shared-incremental/1.1/maven-shared-incremental-1.1.jar
(14 kB at 796 kB/s)
[INFO] Downloading: https://repo.maven.apache.org/maven2/org/codehaus/plexus/plexus-compiler-manager/2.2/plexus-compiler-manager-2.2.jar
[INFO] Downloading: https://repo.maven.apache.org/maven2/org/codehaus/plexus/plexus-compiler-javac/2.2/plexus-compiler-javac-2.2.jar
[INFO] Downloaded: https://repo.maven.apache.org/maven2/org/codehaus/plexus/plexus-compiler-api/2.2/plexus-compiler-api-2.2.jar
(25 kB at 1.2 MB/s)
[INFO] Downloading: https://repo.maven.apache.org/maven2/org/codehaus/plexus/plexus-container-default/1.5.5/plexus-container-default-1.5.5.jar
[INFO] Downloaded: https://repo.maven.apache.org/maven2/org/codehaus/plexus/plexus-utils/1.5.1/plexus-utils-1.5.1.jar
(211 kB at 7.8 MB/s)
[INFO] Downloading: https://repo.maven.apache.org/maven2/org/codehaus/plexus/plexus-classworlds/2.2.2/plexus-classworlds-2.2.2.jar
[INFO] Downloaded: https://repo.maven.apache.org/maven2/org/apache/maven/shared/maven-shared-utils/0.1/maven-shared-utils-0.1.jar
(155 kB at 5.5 MB/s)
[INFO] Downloading: https://repo.maven.apache.org/maven2/org/apache/xbean/xbean-reflect/3.4/xbean-reflect-3.4.jar
[INFO] Downloaded: https://repo.maven.apache.org/maven2/org/codehaus/plexus/plexus-compiler-manager/2.2/plexus-compiler-manager-2.2.jar
(4.6 kB at 152 kB/s)
[INFO] Downloading: https://repo.maven.apache.org/maven2/log4j/log4j/1.2.12/log4j-1.2.12.jar
[INFO] Downloaded: https://repo.maven.apache.org/maven2/org/codehaus/plexus/plexus-compiler-javac/2.2/plexus-compiler-javac-2.2.jar
(19 kB at 678 kB/s)
[INFO] Downloading: https://repo.maven.apache.org/maven2/commons-logging/commons-logging-api/1.1/commons-logging-api-1.1.jar
[INFO] Downloaded: https://repo.maven.apache.org/maven2/org/codehaus/plexus/plexus-classworlds/2.2.2/plexus-classworlds-2.2.2.jar
(46 kB at 1.2 MB/s)
[INFO] Downloading: https://repo.maven.apache.org/maven2/com/google/collections/google-collections/1.0/google-collections-1.0.jar
[INFO] Downloaded: https://repo.maven.apache.org/maven2/org/codehaus/plexus/plexus-container-default/1.5.5/plexus-container-default-1.5.5.jar
(217 kB at 5.6 MB/s)
[INFO] Downloading: https://repo.maven.apache.org/maven2/junit/junit/3.8.2/junit-3.8.2.jar
[INFO] Downloaded: https://repo.maven.apache.org/maven2/org/apache/xbean/xbean-reflect/3.4/xbean-reflect-3.4.jar
(134 kB at 3.2 MB/s)
[INFO] Downloaded: https://repo.maven.apache.org/maven2/commons-logging/commons-logging-api/1.1/commons-logging-api-1.1.jar
(45 kB at 1.0 MB/s)
[INFO] Downloaded: https://repo.maven.apache.org/maven2/log4j/log4j/1.2.12/log4j-1.2.12.jar
(358 kB at 6.4 MB/s)
[INFO] Downloaded: https://repo.maven.apache.org/maven2/junit/junit/3.8.2/junit-3.8.2.jar
(121 kB at 2.2 MB/s)
[INFO] Downloaded: https://repo.maven.apache.org/maven2/com/google/collections/google-collections/1.0/google-collections-1.0.jar
(640 kB at 9.1 MB/s)
[INFO] Nothing to compile - all classes are up to date
[INFO] 
[INFO] --- maven-resources-plugin:2.6:testResources (default-testResources) @ org.apache.oltu.openidconnect.common
---
[INFO] Using 'UTF-8' encoding to copy filtered resources.
[INFO] skip non existing resourceDirectory <https://builds.apache.org/job/Oltu-OpenID-Conect/ws/trunk/openid-connect/common/src/test/resources>
[INFO] Copying 3 resources
[INFO] 
[INFO] --- maven-compiler-plugin:3.1:testCompile (default-testCompile) @ org.apache.oltu.openidconnect.common
---
[INFO] Nothing to compile - all classes are up to date
[INFO] 
[INFO] --- maven-surefire-plugin:2.16:test (default-test) @ org.apache.oltu.openidconnect.common
---
[INFO] Downloading: https://repo.maven.apache.org/maven2/org/apache/maven/surefire/maven-surefire-common/2.16/maven-surefire-common-2.16.pom
[INFO] Downloaded: https://repo.maven.apache.org/maven2/org/apache/maven/surefire/maven-surefire-common/2.16/maven-surefire-common-2.16.pom
(6.1 kB at 469 kB/s)
[INFO] Downloading: https://repo.maven.apache.org/maven2/org/apache/maven/plugin-tools/maven-plugin-annotations/3.2/maven-plugin-annotations-3.2.pom
[INFO] Downloaded: https://repo.maven.apache.org/maven2/org/apache/maven/plugin-tools/maven-plugin-annotations/3.2/maven-plugin-annotations-3.2.pom
(1.6 kB at 125 kB/s)
[INFO] Downloading: https://repo.maven.apache.org/maven2/org/apache/maven/plugin-tools/maven-plugin-tools/3.2/maven-plugin-tools-3.2.pom
[INFO] Downloaded: https://repo.maven.apache.org/maven2/org/apache/maven/plugin-tools/maven-plugin-tools/3.2/maven-plugin-tools-3.2.pom
(17 kB at 1.3 MB/s)
[INFO] Downloading: https://repo.maven.apache.org/maven2/org/apache/maven/surefire/surefire-api/2.16/surefire-api-2.16.pom
[INFO] Downloaded: https://repo.maven.apache.org/maven2/org/apache/maven/surefire/surefire-api/2.16/surefire-api-2.16.pom
(2.3 kB at 176 kB/s)
[INFO] Downloading: https://repo.maven.apache.org/maven2/org/apache/maven/surefire/surefire-booter/2.16/surefire-booter-2.16.pom
[INFO] Downloaded: https://repo.maven.apache.org/maven2/org/apache/maven/surefire/surefire-booter/2.16/surefire-booter-2.16.pom
(2.8 kB at 218 kB/s)
[INFO] Downloading: https://repo.maven.apache.org/maven2/org/apache/maven/maven-toolchain/2.0.9/maven-toolchain-2.0.9.pom
[INFO] Downloaded: https://repo.maven.apache.org/maven2/org/apache/maven/maven-toolchain/2.0.9/maven-toolchain-2.0.9.pom
(3.5 kB at 290 kB/s)
[INFO] Downloading: https://repo.maven.apache.org/maven2/org/apache/commons/commons-lang3/3.1/commons-lang3-3.1.pom
[INFO] Downloaded: https://repo.maven.apache.org/maven2/org/apache/commons/commons-lang3/3.1/commons-lang3-3.1.pom
(17 kB at 1.4 MB/s)
[INFO] Downloading: https://repo.maven.apache.org/maven2/org/apache/maven/surefire/maven-surefire-common/2.16/maven-surefire-common-2.16.jar
[INFO] Downloading: https://repo.maven.apache.org/maven2/org/apache/maven/surefire/surefire-booter/2.16/surefire-booter-2.16.jar
[INFO] Downloading: https://repo.maven.apache.org/maven2/org/apache/commons/commons-lang3/3.1/commons-lang3-3.1.jar
[INFO] Downloading: https://repo.maven.apache.org/maven2/org/apache/maven/surefire/surefire-api/2.16/surefire-api-2.16.jar
[INFO] Downloading: https://repo.maven.apache.org/maven2/org/apache/maven/maven-toolchain/2.0.9/maven-toolchain-2.0.9.jar
[INFO] Downloaded: https://repo.maven.apache.org/maven2/org/apache/maven/maven-toolchain/2.0.9/maven-toolchain-2.0.9.jar
(38 kB at 2.5 MB/s)
[INFO] Downloading: https://repo.maven.apache.org/maven2/org/apache/maven/plugin-tools/maven-plugin-annotations/3.2/maven-plugin-annotations-3.2.jar
[INFO] Downloaded: https://repo.maven.apache.org/maven2/org/apache/maven/surefire/surefire-booter/2.16/surefire-booter-2.16.jar
(40 kB at 2.1 MB/s)
[INFO] Downloaded: https://repo.maven.apache.org/maven2/org/apache/maven/surefire/surefire-api/2.16/surefire-api-2.16.jar
(149 kB at 6.2 MB/s)
[INFO] Downloaded: https://repo.maven.apache.org/maven2/org/apache/maven/surefire/maven-surefire-common/2.16/maven-surefire-common-2.16.jar
(264 kB at 10 MB/s)
[INFO] Downloaded: https://repo.maven.apache.org/maven2/org/apache/maven/plugin-tools/maven-plugin-annotations/3.2/maven-plugin-annotations-3.2.jar
(15 kB at 520 kB/s)
[INFO] Downloaded: https://repo.maven.apache.org/maven2/org/apache/commons/commons-lang3/3.1/commons-lang3-3.1.jar
(316 kB at 9.9 MB/s)
[JENKINS] Recording test results[INFO] 
[INFO] --- maven-bundle-plugin:2.3.7:bundle (default-bundle) @ org.apache.oltu.openidconnect.common
---

[WARNING] Bundle org.apache.oltu.openidconnect:org.apache.oltu.openidconnect.common:bundle:0.0.1-SNAPSHOT
: Instructions in Export-Package that are never used: org\.apache\.oltu\.openidconnect\..*|org\.apache\.oltu\.openidconnect
Classpath: Jar:.

[WARNING] Bundle org.apache.oltu.openidconnect:org.apache.oltu.openidconnect.common:bundle:0.0.1-SNAPSHOT
: Superfluous export-package instructions: [org.apache.oltu.openidconnect.*]
[INFO] 
[INFO] --- maven-site-plugin:3.4:attach-descriptor (attach-descriptor) @ org.apache.oltu.openidconnect.common
---
[INFO] 
[INFO] --- maven-install-plugin:2.5.1:install (default-install) @ org.apache.oltu.openidconnect.common
---
[INFO] Installing <https://builds.apache.org/job/Oltu-OpenID-Conect/ws/trunk/openid-connect/common/target/org.apache.oltu.openidconnect.common-0.0.1-SNAPSHOT.jar>
to <https://builds.apache.org/job/Oltu-OpenID-Conect/ws/.repository/org/apache/oltu/openidconnect/org.apache.oltu.openidconnect.common/0.0.1-SNAPSHOT/org.apache.oltu.openidconnect.common-0.0.1-SNAPSHOT.jar>
[INFO] Installing <https://builds.apache.org/job/Oltu-OpenID-Conect/ws/trunk/openid-connect/common/pom.xml>
to <https://builds.apache.org/job/Oltu-OpenID-Conect/ws/.repository/org/apache/oltu/openidconnect/org.apache.oltu.openidconnect.common/0.0.1-SNAPSHOT/org.apache.oltu.openidconnect.common-0.0.1-SNAPSHOT.pom>
[INFO] 
[INFO] --- maven-bundle-plugin:2.3.7:install (default-install) @ org.apache.oltu.openidconnect.common
---
[INFO] Writing OBR metadata
[INFO] Installing org/apache/oltu/openidconnect/org.apache.oltu.openidconnect.common/0.0.1-SNAPSHOT/org.apache.oltu.openidconnect.common-0.0.1-SNAPSHOT.jar
[INFO] Writing OBR metadata
[INFO] 
[INFO] --- maven-deploy-plugin:2.8.1:deploy (default-deploy) @ org.apache.oltu.openidconnect.common
---
[INFO] Downloading: https://repository.apache.org/content/repositories/snapshots/org/apache/oltu/openidconnect/org.apache.oltu.openidconnect.common/0.0.1-SNAPSHOT/maven-metadata.xml
[INFO] Downloaded: https://repository.apache.org/content/repositories/snapshots/org/apache/oltu/openidconnect/org.apache.oltu.openidconnect.common/0.0.1-SNAPSHOT/maven-metadata.xml
(818 B at 1.5 kB/s)
[INFO] Uploading: https://repository.apache.org/content/repositories/snapshots/org/apache/oltu/openidconnect/org.apache.oltu.openidconnect.common/0.0.1-SNAPSHOT/org.apache.oltu.openidconnect.common-0.0.1-20170706.151054-70.jar
[INFO] Uploaded: https://repository.apache.org/content/repositories/snapshots/org/apache/oltu/openidconnect/org.apache.oltu.openidconnect.common/0.0.1-SNAPSHOT/org.apache.oltu.openidconnect.common-0.0.1-20170706.151054-70.jar
(7.4 kB at 6.8 kB/s)
[INFO] Uploading: https://repository.apache.org/content/repositories/snapshots/org/apache/oltu/openidconnect/org.apache.oltu.openidconnect.common/0.0.1-SNAPSHOT/org.apache.oltu.openidconnect.common-0.0.1-20170706.151054-70.pom
[INFO] Uploaded: https://repository.apache.org/content/repositories/snapshots/org/apache/oltu/openidconnect/org.apache.oltu.openidconnect.common/0.0.1-SNAPSHOT/org.apache.oltu.openidconnect.common-0.0.1-20170706.151054-70.pom
(1.8 kB at 1.7 kB/s)
[INFO] Downloading: https://repository.apache.org/content/repositories/snapshots/org/apache/oltu/openidconnect/org.apache.oltu.openidconnect.common/maven-metadata.xml
[INFO] Downloaded: https://repository.apache.org/content/repositories/snapshots/org/apache/oltu/openidconnect/org.apache.oltu.openidconnect.common/maven-metadata.xml
(421 B at 762 B/s)
[INFO] Uploading: https://repository.apache.org/content/repositories/snapshots/org/apache/oltu/openidconnect/org.apache.oltu.openidconnect.common/0.0.1-SNAPSHOT/maven-metadata.xml
[INFO] Uploaded: https://repository.apache.org/content/repositories/snapshots/org/apache/oltu/openidconnect/org.apache.oltu.openidconnect.common/0.0.1-SNAPSHOT/maven-metadata.xml
(818 B at 758 B/s)
[INFO] Uploading: https://repository.apache.org/content/repositories/snapshots/org/apache/oltu/openidconnect/org.apache.oltu.openidconnect.common/maven-metadata.xml
[INFO] Uploaded: https://repository.apache.org/content/repositories/snapshots/org/apache/oltu/openidconnect/org.apache.oltu.openidconnect.common/maven-metadata.xml
(421 B at 385 B/s)
[INFO] 
[INFO] --- maven-bundle-plugin:2.3.7:deploy (default-deploy) @ org.apache.oltu.openidconnect.common
---
[INFO] Remote OBR update disabled (enable with -DremoteOBR)
[INFO] 
[INFO] ------------------------------------------------------------------------
[INFO] Building Apache Oltu - OpenId Connect - Client 0.0.1-SNAPSHOT
[INFO] ------------------------------------------------------------------------
[INFO] Downloading: http://repository.apache.org/snapshots/org/apache/oltu/oauth2/org.apache.oltu.oauth2.client/1.0.3-SNAPSHOT/maven-metadata.xml
[INFO] Downloaded: http://repository.apache.org/snapshots/org/apache/oltu/oauth2/org.apache.oltu.oauth2.client/1.0.3-SNAPSHOT/maven-metadata.xml
(1.2 kB at 3.1 kB/s)
[INFO] Downloading: http://repository.apache.org/snapshots/org/apache/oltu/oauth2/org.apache.oltu.oauth2.client/1.0.3-SNAPSHOT/org.apache.oltu.oauth2.client-1.0.3-20170706.075951-11.pom
[INFO] Downloaded: http://repository.apache.org/snapshots/org/apache/oltu/oauth2/org.apache.oltu.oauth2.client/1.0.3-SNAPSHOT/org.apache.oltu.oauth2.client-1.0.3-20170706.075951-11.pom
(3.0 kB at 8.3 kB/s)
[INFO] Downloading: http://repository.apache.org/snapshots/org/apache/oltu/oauth2/org.apache.oltu.oauth2.parent/1.0.3-SNAPSHOT/maven-metadata.xml
[INFO] Downloaded: http://repository.apache.org/snapshots/org/apache/oltu/oauth2/org.apache.oltu.oauth2.parent/1.0.3-SNAPSHOT/maven-metadata.xml
(630 B at 1.6 kB/s)
[INFO] Downloading: http://repository.apache.org/snapshots/org/apache/oltu/oauth2/org.apache.oltu.oauth2.parent/1.0.3-SNAPSHOT/org.apache.oltu.oauth2.parent-1.0.3-20170706.075917-11.pom
[INFO] Downloaded: http://repository.apache.org/snapshots/org/apache/oltu/oauth2/org.apache.oltu.oauth2.parent/1.0.3-SNAPSHOT/org.apache.oltu.oauth2.parent-1.0.3-20170706.075917-11.pom
(5.6 kB at 15 kB/s)
[INFO] Downloading: http://repository.apache.org/snapshots/org/apache/oltu/oauth2/org.apache.oltu.oauth2.common/1.0.3-SNAPSHOT/maven-metadata.xml
[INFO] Downloaded: http://repository.apache.org/snapshots/org/apache/oltu/oauth2/org.apache.oltu.oauth2.common/1.0.3-SNAPSHOT/maven-metadata.xml
(804 B at 2.2 kB/s)
[INFO] Downloading: http://repository.apache.org/snapshots/org/apache/oltu/oauth2/org.apache.oltu.oauth2.common/1.0.3-SNAPSHOT/org.apache.oltu.oauth2.common-1.0.3-20170706.075937-11.pom
[INFO] Downloaded: http://repository.apache.org/snapshots/org/apache/oltu/oauth2/org.apache.oltu.oauth2.common/1.0.3-SNAPSHOT/org.apache.oltu.oauth2.common-1.0.3-20170706.075937-11.pom
(2.8 kB at 7.9 kB/s)
[INFO] Downloading: https://repo.maven.apache.org/maven2/org/json/json/20140107/json-20140107.pom
[INFO] Downloaded: https://repo.maven.apache.org/maven2/org/json/json/20140107/json-20140107.pom
(4.2 kB at 144 kB/s)
[INFO] Downloading: https://repo.maven.apache.org/maven2/org/sonatype/oss/oss-parent/7/oss-parent-7.pom
[INFO] Downloaded: https://repo.maven.apache.org/maven2/org/sonatype/oss/oss-parent/7/oss-parent-7.pom
(4.8 kB at 371 kB/s)
[INFO] Downloading: https://repo.maven.apache.org/maven2/commons-codec/commons-codec/1.9/commons-codec-1.9.pom
[INFO] Downloaded: https://repo.maven.apache.org/maven2/commons-codec/commons-codec/1.9/commons-codec-1.9.pom
(12 kB at 824 kB/s)
[INFO] Downloading: https://repo.maven.apache.org/maven2/org/apache/commons/commons-parent/32/commons-parent-32.pom
[INFO] Downloaded: https://repo.maven.apache.org/maven2/org/apache/commons/commons-parent/32/commons-parent-32.pom
(53 kB at 3.3 MB/s)
[INFO] Downloading: https://repo.maven.apache.org/maven2/org/slf4j/slf4j-api/1.7.7/slf4j-api-1.7.7.pom
[INFO] Downloaded: https://repo.maven.apache.org/maven2/org/slf4j/slf4j-api/1.7.7/slf4j-api-1.7.7.pom
(2.7 kB at 207 kB/s)
[INFO] Downloading: https://repo.maven.apache.org/maven2/org/slf4j/slf4j-parent/1.7.7/slf4j-parent-1.7.7.pom
[INFO] Downloaded: https://repo.maven.apache.org/maven2/org/slf4j/slf4j-parent/1.7.7/slf4j-parent-1.7.7.pom
(12 kB at 916 kB/s)
[INFO] Downloading: http://repository.apache.org/snapshots/org/apache/oltu/oauth2/org.apache.oltu.oauth2.jwt/1.0.3-SNAPSHOT/maven-metadata.xml
[INFO] Downloading: http://repository.apache.org/snapshots/org/apache/oltu/oauth2/org.apache.oltu.oauth2.jwt/1.0.3-SNAPSHOT/org.apache.oltu.oauth2.jwt-1.0.3-SNAPSHOT.pom
[WARNING] The POM for org.apache.oltu.oauth2:org.apache.oltu.oauth2.jwt:jar:1.0.3-SNAPSHOT
is missing, no dependency information available
[INFO] Downloading: https://repo.maven.apache.org/maven2/junit-addons/junit-addons/1.4/junit-addons-1.4.pom
[INFO] Downloaded: https://repo.maven.apache.org/maven2/junit-addons/junit-addons/1.4/junit-addons-1.4.pom
(626 B at 45 kB/s)
[INFO] Downloading: https://repo.maven.apache.org/maven2/xerces/xercesImpl/2.6.2/xercesImpl-2.6.2.pom
[INFO] Downloaded: https://repo.maven.apache.org/maven2/xerces/xercesImpl/2.6.2/xercesImpl-2.6.2.pom
(150 B at 12 kB/s)
[INFO] Downloading: https://repo.maven.apache.org/maven2/xerces/xmlParserAPIs/2.6.2/xmlParserAPIs-2.6.2.pom
[INFO] Downloaded: https://repo.maven.apache.org/maven2/xerces/xmlParserAPIs/2.6.2/xmlParserAPIs-2.6.2.pom
(153 B at 12 kB/s)
[INFO] Downloading: http://repository.apache.org/snapshots/org/apache/oltu/oauth2/org.apache.oltu.oauth2.client/1.0.3-SNAPSHOT/org.apache.oltu.oauth2.client-1.0.3-20170706.075951-11.jar
[INFO] Downloading: http://repository.apache.org/snapshots/org/apache/oltu/oauth2/org.apache.oltu.oauth2.common/1.0.3-SNAPSHOT/org.apache.oltu.oauth2.common-1.0.3-20170706.075937-11.jar
[INFO] Downloading: http://repository.apache.org/snapshots/org/apache/oltu/oauth2/org.apache.oltu.oauth2.jwt/1.0.3-SNAPSHOT/org.apache.oltu.oauth2.jwt-1.0.3-SNAPSHOT.jar
[INFO] Downloaded: http://repository.apache.org/snapshots/org/apache/oltu/oauth2/org.apache.oltu.oauth2.common/1.0.3-SNAPSHOT/org.apache.oltu.oauth2.common-1.0.3-20170706.075937-11.jar
(53 kB at 99 kB/s)
[INFO] Downloaded: http://repository.apache.org/snapshots/org/apache/oltu/oauth2/org.apache.oltu.oauth2.client/1.0.3-SNAPSHOT/org.apache.oltu.oauth2.client-1.0.3-20170706.075951-11.jar
(79 kB at 146 kB/s)
[INFO] Downloading: https://repo.maven.apache.org/maven2/org/json/json/20140107/json-20140107.jar
[INFO] Downloading: https://repo.maven.apache.org/maven2/commons-codec/commons-codec/1.9/commons-codec-1.9.jar
[INFO] Downloading: https://repo.maven.apache.org/maven2/org/slf4j/slf4j-api/1.7.7/slf4j-api-1.7.7.jar
[INFO] Downloading: https://repo.maven.apache.org/maven2/junit-addons/junit-addons/1.4/junit-addons-1.4.jar
[INFO] Downloading: https://repo.maven.apache.org/maven2/xerces/xercesImpl/2.6.2/xercesImpl-2.6.2.jar
[INFO] Downloaded: https://repo.maven.apache.org/maven2/org/json/json/20140107/json-20140107.jar
(65 kB at 3.8 MB/s)
[INFO] Downloading: https://repo.maven.apache.org/maven2/xerces/xmlParserAPIs/2.6.2/xmlParserAPIs-2.6.2.jar
[INFO] Downloaded: https://repo.maven.apache.org/maven2/org/slf4j/slf4j-api/1.7.7/slf4j-api-1.7.7.jar
(29 kB at 1.5 MB/s)
[INFO] Downloaded: https://repo.maven.apache.org/maven2/junit-addons/junit-addons/1.4/junit-addons-1.4.jar
(54 kB at 2.4 MB/s)
[INFO] Downloaded: https://repo.maven.apache.org/maven2/commons-codec/commons-codec/1.9/commons-codec-1.9.jar
(264 kB at 8.5 MB/s)
[INFO] Downloaded: https://repo.maven.apache.org/maven2/xerces/xmlParserAPIs/2.6.2/xmlParserAPIs-2.6.2.jar
(125 kB at 3.7 MB/s)
[INFO] Downloaded: https://repo.maven.apache.org/maven2/xerces/xercesImpl/2.6.2/xercesImpl-2.6.2.jar
(1.0 MB at 17 MB/s)
[INFO] ------------------------------------------------------------------------
[INFO] Reactor Summary:
[INFO] 
[INFO] Apache Oltu - OpenId Connect ....................... SUCCESS [ 15.199 s]
[INFO] Apache Oltu - OpenId Connect - Common .............. SUCCESS [  9.445 s]
[INFO] Apache Oltu - OpenId Connect - Client .............. FAILURE [  4.381 s]
[INFO] ------------------------------------------------------------------------
[INFO] BUILD FAILURE
[INFO] ------------------------------------------------------------------------
[INFO] Total time: 37.255 s
[INFO] Finished at: 2017-07-06T15:11:06Z
[INFO] Final Memory: 25M/480M
[INFO] ------------------------------------------------------------------------
Waiting for Jenkins to finish collecting data
[ERROR] Failed to execute goal on project org.apache.oltu.openidconnect.client: Could not
resolve dependencies for project org.apache.oltu.openidconnect:org.apache.oltu.openidconnect.client:bundle:0.0.1-SNAPSHOT:
Could not find artifact org.apache.oltu.oauth2:org.apache.oltu.oauth2.jwt:jar:1.0.3-SNAPSHOT
in Nexus (http://repository.apache.org/snapshots) -> [Help 1]
org.apache.maven.lifecycle.LifecycleExecutionException: Failed to execute goal on project
org.apache.oltu.openidconnect.client: Could not resolve dependencies for project org.apache.oltu.openidconnect:org.apache.oltu.openidconnect.client:bundle:0.0.1-SNAPSHOT:
Could not find artifact org.apache.oltu.oauth2:org.apache.oltu.oauth2.jwt:jar:1.0.3-SNAPSHOT
in Nexus (http://repository.apache.org/snapshots)
	at org.apache.maven.lifecycle.internal.LifecycleDependencyResolver.getDependencies(LifecycleDependencyResolver.java:221)
	at org.apache.maven.lifecycle.internal.LifecycleDependencyResolver.resolveProjectDependencies(LifecycleDependencyResolver.java:127)
	at org.apache.maven.lifecycle.internal.MojoExecutor.ensureDependenciesAreResolved(MojoExecutor.java:246)
	at org.apache.maven.lifecycle.internal.MojoExecutor.execute(MojoExecutor.java:200)
	at org.apache.maven.lifecycle.internal.MojoExecutor.execute(MojoExecutor.java:154)
	at org.apache.maven.lifecycle.internal.MojoExecutor.execute(MojoExecutor.java:146)
	at org.apache.maven.lifecycle.internal.LifecycleModuleBuilder.buildProject(LifecycleModuleBuilder.java:117)
	at org.apache.maven.lifecycle.internal.LifecycleModuleBuilder.buildProject(LifecycleModuleBuilder.java:81)
	at org.apache.maven.lifecycle.internal.builder.singlethreaded.SingleThreadedBuilder.build(SingleThreadedBuilder.java:51)
	at org.apache.maven.lifecycle.internal.LifecycleStarter.execute(LifecycleStarter.java:128)
	at org.apache.maven.DefaultMaven.doExecute(DefaultMaven.java:309)
	at org.apache.maven.DefaultMaven.doExecute(DefaultMaven.java:194)
	at org.apache.maven.DefaultMaven.execute(DefaultMaven.java:107)
	at org.jvnet.hudson.maven3.launcher.Maven35Launcher.main(Maven35Launcher.java:130)
	at sun.reflect.NativeMethodAccessorImpl.invoke0(Native Method)
	at sun.reflect.NativeMethodAccessorImpl.invoke(NativeMethodAccessorImpl.java:57)
	at sun.reflect.DelegatingMethodAccessorImpl.invoke(DelegatingMethodAccessorImpl.java:43)
	at java.lang.reflect.Method.invoke(Method.java:606)
	at org.codehaus.plexus.classworlds.launcher.Launcher.launchEnhanced(Launcher.java:289)
	at org.codehaus.plexus.classworlds.launcher.Launcher.launch(Launcher.java:229)
	at jenkins.maven3.agent.Maven35Main.launch(Maven35Main.java:176)
	at sun.reflect.NativeMethodAccessorImpl.invoke0(Native Method)
	at sun.reflect.NativeMethodAccessorImpl.invoke(NativeMethodAccessorImpl.java:57)
	at sun.reflect.DelegatingMethodAccessorImpl.invoke(DelegatingMethodAccessorImpl.java:43)
	at java.lang.reflect.Method.invoke(Method.java:606)
	at hudson.maven.Maven3Builder.call(Maven3Builder.java:139)
	at hudson.maven.Maven3Builder.call(Maven3Builder.java:70)
	at hudson.remoting.UserRequest.perform(UserRequest.java:153)
	at hudson.remoting.UserRequest.perform(UserRequest.java:50)
	at hudson.remoting.Request$2.run(Request.java:336)
	at hudson.remoting.InterceptingExecutorService$1.call(InterceptingExecutorService.java:68)
	at java.util.concurrent.FutureTask.run(FutureTask.java:262)
	at java.util.concurrent.ThreadPoolExecutor.runWorker(ThreadPoolExecutor.java:1145)
	at java.util.concurrent.ThreadPoolExecutor$Worker.run(ThreadPoolExecutor.java:615)
	at java.lang.Thread.run(Thread.java:745)
Caused by: org.apache.maven.project.DependencyResolutionException: Could not resolve dependencies
for project org.apache.oltu.openidconnect:org.apache.oltu.openidconnect.client:bundle:0.0.1-SNAPSHOT:
Could not find artifact org.apache.oltu.oauth2:org.apache.oltu.oauth2.jwt:jar:1.0.3-SNAPSHOT
in Nexus (http://repository.apache.org/snapshots)
	at org.apache.maven.project.DefaultProjectDependenciesResolver.resolve(DefaultProjectDependenciesResolver.java:208)
	at org.apache.maven.lifecycle.internal.LifecycleDependencyResolver.getDependencies(LifecycleDependencyResolver.java:195)
	... 34 more
Caused by: org.eclipse.aether.resolution.DependencyResolutionException: Could not find artifact
org.apache.oltu.oauth2:org.apache.oltu.oauth2.jwt:jar:1.0.3-SNAPSHOT in Nexus (http://repository.apache.org/snapshots)
	at org.eclipse.aether.internal.impl.DefaultRepositorySystem.resolveDependencies(DefaultRepositorySystem.java:393)
	at org.apache.maven.project.DefaultProjectDependenciesResolver.resolve(DefaultProjectDependenciesResolver.java:202)
	... 35 more
Caused by: org.eclipse.aether.resolution.ArtifactResolutionException: Could not find artifact
org.apache.oltu.oauth2:org.apache.oltu.oauth2.jwt:jar:1.0.3-SNAPSHOT in Nexus (http://repository.apache.org/snapshots)
	at org.eclipse.aether.internal.impl.DefaultArtifactResolver.resolve(DefaultArtifactResolver.java:453)
	at org.eclipse.aether.internal.impl.DefaultArtifactResolver.resolveArtifacts(DefaultArtifactResolver.java:255)
	at org.eclipse.aether.internal.impl.DefaultRepositorySystem.resolveDependencies(DefaultRepositorySystem.java:376)
	... 36 more
Caused by: org.eclipse.aether.transfer.ArtifactNotFoundException: Could not find artifact
org.apache.oltu.oauth2:org.apache.oltu.oauth2.jwt:jar:1.0.3-SNAPSHOT in Nexus (http://repository.apache.org/snapshots)
	at org.eclipse.aether.connector.basic.ArtifactTransportListener.transferFailed(ArtifactTransportListener.java:48)
	at org.eclipse.aether.connector.basic.BasicRepositoryConnector$TaskRunner.run(BasicRepositoryConnector.java:364)
	at org.eclipse.aether.util.concurrency.RunnableErrorForwarder$1.run(RunnableErrorForwarder.java:76)
	... 3 more
[ERROR] 
[ERROR] Re-run Maven using the -X switch to enable full debug logging.
[ERROR] 
[ERROR] For more information about the errors and possible solutions, please read the following
articles:
[ERROR] [Help 1] http://cwiki.apache.org/confluence/display/MAVEN/DependencyResolutionException
[ERROR] 
[ERROR] After correcting the problems, you can resume the build with the command
[ERROR]   mvn <goals> -rf :org.apache.oltu.openidconnect.client
[JENKINS] Archiving <https://builds.apache.org/job/Oltu-OpenID-Conect/ws/trunk/openid-connect/pom.xml>
to org.apache.oltu.openidconnect/org.apache.oltu.openidconnect.parent/1-SNAPSHOT/org.apache.oltu.openidconnect.parent-1-SNAPSHOT.pom
[JENKINS] Archiving <https://builds.apache.org/job/Oltu-OpenID-Conect/ws/trunk/openid-connect/common/pom.xml>
to org.apache.oltu.openidconnect/org.apache.oltu.openidconnect.common/0.0.1-SNAPSHOT/org.apache.oltu.openidconnect.common-0.0.1-SNAPSHOT.pom
[JENKINS] Archiving <https://builds.apache.org/job/Oltu-OpenID-Conect/ws/trunk/openid-connect/common/target/org.apache.oltu.openidconnect.common-0.0.1-SNAPSHOT.jar>
to org.apache.oltu.openidconnect/org.apache.oltu.openidconnect.common/0.0.1-20170706.151054-70/org.apache.oltu.openidconnect.common-0.0.1-20170706.151054-70.jar
[JENKINS] Archiving <https://builds.apache.org/job/Oltu-OpenID-Conect/ws/trunk/openid-connect/client/pom.xml>
to org.apache.oltu.openidconnect/org.apache.oltu.openidconnect.client/0.0.1-SNAPSHOT/org.apache.oltu.openidconnect.client-0.0.1-SNAPSHOT.pom
Sending e-mails to: dev@oltu.apache.org
channel stopped

Mime
View raw message