oltu-dev mailing list archives

Site index · List index
Message view « Date » · « Thread »
Top « Date » · « Thread »
From Apache Jenkins Server <jenk...@builds.apache.org>
Subject Build failed in Jenkins: Oltu-OAuth-2.0-windows #190
Date Wed, 08 Feb 2017 11:54:58 GMT
See <https://builds.apache.org/job/Oltu-OAuth-2.0-windows/190/changes>

Changes:

[simonetripodi] @releng increase development version number

------------------------------------------
Started by an SCM change
[EnvInject] - Loading node environment variables.
Building remotely on windows-2012-2 (Windows) in workspace <https://builds.apache.org/job/Oltu-OAuth-2.0-windows/ws/>
Updating https://svn.apache.org/repos/asf/oltu/trunk at revision '2017-02-08T11:53:01.525
+0000'
U         oauth-2.0\jwt\pom.xml
At revision 1782145

Parsing POMs
Modules changed, recalculating dependency graph
Established TCP socket on 53842
maven32-agent.jar already up to date
maven32-interceptor.jar already up to date
maven3-interceptor-commons.jar already up to date
[oauth-2.0] $ F:\\hudson\\tools\\java\\jdk1.7.0_79-unlimited-security/bin/java -da -dsa -XX:MaxPermSize=192m
-Xmx512M -cp f:\jenkins\jenkins-slave\maven32-agent.jar;f:\jenkins\tools\maven\latest\boot\plexus-classworlds-2.5.2.jar;f:\jenkins\tools\maven\latest/conf/logging
jenkins.maven3.agent.Maven32Main f:\jenkins\tools\maven\latest F:\jenkins\jenkins-slave\slave.jar
f:\jenkins\jenkins-slave\maven32-interceptor.jar f:\jenkins\jenkins-slave\maven3-interceptor-commons.jar
53842
<===[JENKINS REMOTING CAPACITY]===>   channel started
Executing Maven:  -B -f <https://builds.apache.org/job/Oltu-OAuth-2.0-windows/ws/trunk\oauth-2.0\pom.xml>
-Dmaven.repo.local=f:\jenkins\jenkins-slave\maven-repositories\1 -B -e clean deploy
[INFO] Error stacktraces are turned on.
[INFO] Scanning for projects...
[INFO] ------------------------------------------------------------------------
[INFO] Reactor Build Order:
[INFO] 
[INFO] Apache Oltu - OAuth 2.0
[INFO] Apache Oltu - OAuth 2.0 - Common
[INFO] Apache Oltu - OAuth 2.0 - Client
[INFO] Apache Oltu - OAuth 2.0 - HttpClient
[INFO] Apache Oltu - OAuth 2.0 - Dynamic Registration Common
[INFO] Apache Oltu - OAuth 2.0 - Dynamic Registration Client
[INFO] Apache Oltu - OAuth 2.0 - Authorization Server
[INFO] Apache Oltu - OAuth 2.0 - Resource Server
[INFO] Apache Oltu - OAuth 2.0 - Resource Server Filter
[INFO] Apache Oltu - OAuth 2.0 - Test Utils
[INFO] Apache Oltu - OAuth 2.0 - Dynamic Registration Server
[INFO] Apache Oltu - OAuth 2.0 - Integration Tests
[INFO] Apache Oltu - OAuth 2.0 - JWT
[INFO]                                                                         
[INFO] ------------------------------------------------------------------------
[INFO] Building Apache Oltu - OAuth 2.0 1.0.3-SNAPSHOT
[INFO] ------------------------------------------------------------------------
[INFO] 
[INFO] --- maven-clean-plugin:2.5:clean (default-clean) @ org.apache.oltu.oauth2.parent ---
[INFO] Deleting <https://builds.apache.org/job/Oltu-OAuth-2.0-windows/ws/trunk\oauth-2.0\target>
[INFO] 
[INFO] --- maven-enforcer-plugin:1.3.1:enforce (enforce-java) @ org.apache.oltu.oauth2.parent
---
[INFO] 
[INFO] --- buildnumber-maven-plugin:1.2:create (default) @ org.apache.oltu.oauth2.parent ---
[INFO] Checking for local modifications: skipped.
[INFO] Updating project files from SCM: skipped.
[INFO] Executing: cmd.exe /X /C "svn --non-interactive info"
[INFO] Working directory: <https://builds.apache.org/job/Oltu-OAuth-2.0-windows/ws/trunk\oauth-2.0>
[INFO] Storing buildNumber: 1782136 at timestamp: 1486554866597
[INFO] Executing: cmd.exe /X /C "svn --non-interactive info"
[INFO] Working directory: <https://builds.apache.org/job/Oltu-OAuth-2.0-windows/ws/trunk\oauth-2.0>
[INFO] Storing buildScmBranch: trunk
[INFO] 
[INFO] --- maven-remote-resources-plugin:1.5:process (default) @ org.apache.oltu.oauth2.parent
---
[INFO] 
[INFO] --- maven-site-plugin:3.4:attach-descriptor (attach-descriptor) @ org.apache.oltu.oauth2.parent
---
[INFO] 
[INFO] --- maven-install-plugin:2.5.1:install (default-install) @ org.apache.oltu.oauth2.parent
---
[INFO] Installing <https://builds.apache.org/job/Oltu-OAuth-2.0-windows/ws/trunk\oauth-2.0\pom.xml>
to f:\jenkins\jenkins-slave\maven-repositories\1\org\apache\oltu\oauth2\org.apache.oltu.oauth2.parent\1.0.3-SNAPSHOT\org.apache.oltu.oauth2.parent-1.0.3-SNAPSHOT.pom
[INFO] 
[INFO] --- maven-deploy-plugin:2.8.1:deploy (default-deploy) @ org.apache.oltu.oauth2.parent
---
[INFO] Downloading: https://repository.apache.org/content/repositories/snapshots/org/apache/oltu/oauth2/org.apache.oltu.oauth2.parent/1.0.3-SNAPSHOT/maven-metadata.xml
[INFO] Downloaded: https://repository.apache.org/content/repositories/snapshots/org/apache/oltu/oauth2/org.apache.oltu.oauth2.parent/1.0.3-SNAPSHOT/maven-metadata.xml
(630 B at 0.5 KB/sec)
[INFO] Uploading: https://repository.apache.org/content/repositories/snapshots/org/apache/oltu/oauth2/org.apache.oltu.oauth2.parent/1.0.3-SNAPSHOT/org.apache.oltu.oauth2.parent-1.0.3-20170208.115431-11.pom
[INFO] ------------------------------------------------------------------------
[INFO] Reactor Summary:
[INFO] 
[INFO] Apache Oltu - OAuth 2.0 ............................ FAILURE [  8.360 s]
[INFO] Apache Oltu - OAuth 2.0 - Common ................... SKIPPED
[INFO] Apache Oltu - OAuth 2.0 - Client ................... SKIPPED
[INFO] Apache Oltu - OAuth 2.0 - HttpClient ............... SKIPPED
[INFO] Apache Oltu - OAuth 2.0 - Dynamic Registration Common SKIPPED
[INFO] Apache Oltu - OAuth 2.0 - Dynamic Registration Client SKIPPED
[INFO] Apache Oltu - OAuth 2.0 - Authorization Server ..... SKIPPED
[INFO] Apache Oltu - OAuth 2.0 - Resource Server .......... SKIPPED
[INFO] Apache Oltu - OAuth 2.0 - Resource Server Filter ... SKIPPED
[INFO] Apache Oltu - OAuth 2.0 - Test Utils ............... SKIPPED
[INFO] Apache Oltu - OAuth 2.0 - Dynamic Registration Server SKIPPED
[INFO] Apache Oltu - OAuth 2.0 - Integration Tests ........ SKIPPED
[INFO] Apache Oltu - OAuth 2.0 - JWT ...................... SKIPPED
[INFO] ------------------------------------------------------------------------
[INFO] BUILD FAILURE
[INFO] ------------------------------------------------------------------------
[INFO] Total time: 22.826 s
[INFO] Finished at: 2017-02-08T11:54:44+00:00
[INFO] Final Memory: 25M/368M
[INFO] ------------------------------------------------------------------------
Waiting for Jenkins to finish collecting data
[ERROR] Failed to execute goal org.apache.maven.plugins:maven-deploy-plugin:2.8.1:deploy (default-deploy)
on project org.apache.oltu.oauth2.parent: Failed to deploy artifacts: Could not transfer artifact
org.apache.oltu.oauth2:org.apache.oltu.oauth2.parent:pom:1.0.3-20170208.115431-11 from/to
apache.snapshots.https (https://repository.apache.org/content/repositories/snapshots): Failed
to transfer file: https://repository.apache.org/content/repositories/snapshots/org/apache/oltu/oauth2/org.apache.oltu.oauth2.parent/1.0.3-SNAPSHOT/org.apache.oltu.oauth2.parent-1.0.3-20170208.115431-11.pom.
Return code is: 401, ReasonPhrase: Unauthorized. -> [Help 1]
org.apache.maven.lifecycle.LifecycleExecutionException: Failed to execute goal org.apache.maven.plugins:maven-deploy-plugin:2.8.1:deploy
(default-deploy) on project org.apache.oltu.oauth2.parent: Failed to deploy artifacts: Could
not transfer artifact org.apache.oltu.oauth2:org.apache.oltu.oauth2.parent:pom:1.0.3-20170208.115431-11
from/to apache.snapshots.https (https://repository.apache.org/content/repositories/snapshots):
Failed to transfer file: https://repository.apache.org/content/repositories/snapshots/org/apache/oltu/oauth2/org.apache.oltu.oauth2.parent/1.0.3-SNAPSHOT/org.apache.oltu.oauth2.parent-1.0.3-20170208.115431-11.pom.
Return code is: 401, ReasonPhrase: Unauthorized.
	at org.apache.maven.lifecycle.internal.MojoExecutor.execute(MojoExecutor.java:212)
	at org.apache.maven.lifecycle.internal.MojoExecutor.execute(MojoExecutor.java:153)
	at org.apache.maven.lifecycle.internal.MojoExecutor.execute(MojoExecutor.java:145)
	at org.apache.maven.lifecycle.internal.LifecycleModuleBuilder.buildProject(LifecycleModuleBuilder.java:116)
	at org.apache.maven.lifecycle.internal.LifecycleModuleBuilder.buildProject(LifecycleModuleBuilder.java:80)
	at org.apache.maven.lifecycle.internal.builder.singlethreaded.SingleThreadedBuilder.build(SingleThreadedBuilder.java:51)
	at org.apache.maven.lifecycle.internal.LifecycleStarter.execute(LifecycleStarter.java:128)
	at org.apache.maven.DefaultMaven.doExecute(DefaultMaven.java:307)
	at org.apache.maven.DefaultMaven.doExecute(DefaultMaven.java:193)
	at org.apache.maven.DefaultMaven.execute(DefaultMaven.java:106)
	at org.jvnet.hudson.maven3.launcher.Maven32Launcher.main(Maven32Launcher.java:132)
	at sun.reflect.NativeMethodAccessorImpl.invoke0(Native Method)
	at sun.reflect.NativeMethodAccessorImpl.invoke(NativeMethodAccessorImpl.java:57)
	at sun.reflect.DelegatingMethodAccessorImpl.invoke(DelegatingMethodAccessorImpl.java:43)
	at java.lang.reflect.Method.invoke(Method.java:606)
	at org.codehaus.plexus.classworlds.launcher.Launcher.launchStandard(Launcher.java:330)
	at org.codehaus.plexus.classworlds.launcher.Launcher.launch(Launcher.java:238)
	at jenkins.maven3.agent.Maven32Main.launch(Maven32Main.java:186)
	at sun.reflect.NativeMethodAccessorImpl.invoke0(Native Method)
	at sun.reflect.NativeMethodAccessorImpl.invoke(NativeMethodAccessorImpl.java:57)
	at sun.reflect.DelegatingMethodAccessorImpl.invoke(DelegatingMethodAccessorImpl.java:43)
	at java.lang.reflect.Method.invoke(Method.java:606)
	at hudson.maven.Maven3Builder.call(Maven3Builder.java:136)
	at hudson.maven.Maven3Builder.call(Maven3Builder.java:71)
	at hudson.remoting.UserRequest.perform(UserRequest.java:120)
	at hudson.remoting.UserRequest.perform(UserRequest.java:48)
	at hudson.remoting.Request$2.run(Request.java:326)
	at hudson.remoting.InterceptingExecutorService$1.call(InterceptingExecutorService.java:68)
	at java.util.concurrent.FutureTask.run(FutureTask.java:262)
	at java.util.concurrent.ThreadPoolExecutor.runWorker(ThreadPoolExecutor.java:1145)
	at java.util.concurrent.ThreadPoolExecutor$Worker.run(ThreadPoolExecutor.java:615)
	at java.lang.Thread.run(Thread.java:745)
Caused by: org.apache.maven.plugin.MojoExecutionException: Failed to deploy artifacts: Could
not transfer artifact org.apache.oltu.oauth2:org.apache.oltu.oauth2.parent:pom:1.0.3-20170208.115431-11
from/to apache.snapshots.https (https://repository.apache.org/content/repositories/snapshots):
Failed to transfer file: https://repository.apache.org/content/repositories/snapshots/org/apache/oltu/oauth2/org.apache.oltu.oauth2.parent/1.0.3-SNAPSHOT/org.apache.oltu.oauth2.parent-1.0.3-20170208.115431-11.pom.
Return code is: 401, ReasonPhrase: Unauthorized.
	at org.apache.maven.plugin.deploy.DeployMojo.deployProject(DeployMojo.java:282)
	at org.apache.maven.plugin.deploy.DeployMojo.execute(DeployMojo.java:169)
	at org.apache.maven.plugin.DefaultBuildPluginManager.executeMojo(DefaultBuildPluginManager.java:134)
	at org.apache.maven.lifecycle.internal.MojoExecutor.execute(MojoExecutor.java:207)
	... 31 more
Caused by: org.apache.maven.artifact.deployer.ArtifactDeploymentException: Failed to deploy
artifacts: Could not transfer artifact org.apache.oltu.oauth2:org.apache.oltu.oauth2.parent:pom:1.0.3-20170208.115431-11
from/to apache.snapshots.https (https://repository.apache.org/content/repositories/snapshots):
Failed to transfer file: https://repository.apache.org/content/repositories/snapshots/org/apache/oltu/oauth2/org.apache.oltu.oauth2.parent/1.0.3-SNAPSHOT/org.apache.oltu.oauth2.parent-1.0.3-20170208.115431-11.pom.
Return code is: 401, ReasonPhrase: Unauthorized.
	at org.apache.maven.artifact.deployer.DefaultArtifactDeployer.deploy(DefaultArtifactDeployer.java:143)
	at org.apache.maven.plugin.deploy.AbstractDeployMojo.deploy(AbstractDeployMojo.java:171)
	at org.apache.maven.plugin.deploy.DeployMojo.deployProject(DeployMojo.java:240)
	... 34 more
Caused by: org.eclipse.aether.deployment.DeploymentException: Failed to deploy artifacts:
Could not transfer artifact org.apache.oltu.oauth2:org.apache.oltu.oauth2.parent:pom:1.0.3-20170208.115431-11
from/to apache.snapshots.https (https://repository.apache.org/content/repositories/snapshots):
Failed to transfer file: https://repository.apache.org/content/repositories/snapshots/org/apache/oltu/oauth2/org.apache.oltu.oauth2.parent/1.0.3-SNAPSHOT/org.apache.oltu.oauth2.parent-1.0.3-20170208.115431-11.pom.
Return code is: 401, ReasonPhrase: Unauthorized.
	at org.eclipse.aether.internal.impl.DefaultDeployer.deploy(DefaultDeployer.java:317)
	at org.eclipse.aether.internal.impl.DefaultDeployer.deploy(DefaultDeployer.java:245)
	at org.eclipse.aether.internal.impl.DefaultRepositorySystem.deploy(DefaultRepositorySystem.java:413)
	at org.apache.maven.artifact.deployer.DefaultArtifactDeployer.deploy(DefaultArtifactDeployer.java:139)
	... 36 more
Caused by: org.eclipse.aether.transfer.ArtifactTransferException: Could not transfer artifact
org.apache.oltu.oauth2:org.apache.oltu.oauth2.parent:pom:1.0.3-20170208.115431-11 from/to
apache.snapshots.https (https://repository.apache.org/content/repositories/snapshots): Failed
to transfer file: https://repository.apache.org/content/repositories/snapshots/org/apache/oltu/oauth2/org.apache.oltu.oauth2.parent/1.0.3-SNAPSHOT/org.apache.oltu.oauth2.parent-1.0.3-20170208.115431-11.pom.
Return code is: 401, ReasonPhrase: Unauthorized.
	at org.eclipse.aether.connector.basic.ArtifactTransportListener.transferFailed(ArtifactTransportListener.java:43)
	at org.eclipse.aether.connector.basic.BasicRepositoryConnector$TaskRunner.run(BasicRepositoryConnector.java:355)
	at org.eclipse.aether.connector.basic.BasicRepositoryConnector.put(BasicRepositoryConnector.java:274)
	at org.eclipse.aether.internal.impl.DefaultDeployer.deploy(DefaultDeployer.java:311)
	... 39 more
Caused by: org.apache.maven.wagon.TransferFailedException: Failed to transfer file: https://repository.apache.org/content/repositories/snapshots/org/apache/oltu/oauth2/org.apache.oltu.oauth2.parent/1.0.3-SNAPSHOT/org.apache.oltu.oauth2.parent-1.0.3-20170208.115431-11.pom.
Return code is: 401, ReasonPhrase: Unauthorized.
	at org.apache.maven.wagon.providers.http.AbstractHttpClientWagon.put(AbstractHttpClientWagon.java:627)
	at org.apache.maven.wagon.providers.http.AbstractHttpClientWagon.put(AbstractHttpClientWagon.java:541)
	at org.apache.maven.wagon.providers.http.AbstractHttpClientWagon.put(AbstractHttpClientWagon.java:523)
	at org.apache.maven.wagon.providers.http.AbstractHttpClientWagon.put(AbstractHttpClientWagon.java:517)
	at org.apache.maven.wagon.providers.http.AbstractHttpClientWagon.put(AbstractHttpClientWagon.java:497)
	at org.eclipse.aether.transport.wagon.WagonTransporter$PutTaskRunner.run(WagonTransporter.java:644)
	at org.eclipse.aether.transport.wagon.WagonTransporter.execute(WagonTransporter.java:427)
	at org.eclipse.aether.transport.wagon.WagonTransporter.put(WagonTransporter.java:410)
	at org.eclipse.aether.connector.basic.BasicRepositoryConnector$PutTaskRunner.runTask(BasicRepositoryConnector.java:510)
	at org.eclipse.aether.connector.basic.BasicRepositoryConnector$TaskRunner.run(BasicRepositoryConnector.java:350)
	... 41 more
[ERROR] 
[ERROR] Re-run Maven using the -X switch to enable full debug logging.
[ERROR] 
[ERROR] For more information about the errors and possible solutions, please read the following
articles:
[ERROR] [Help 1] http://cwiki.apache.org/confluence/display/MAVEN/MojoExecutionException
[JENKINS] Archiving F:\jenkins\jenkins-slave\workspace\Oltu-OAuth-2.0-windows\trunk\oauth-2.0\httpclient4\pom.xml
to org.apache.oltu.oauth2/org.apache.oltu.oauth2.httpclient4/1.0.3-SNAPSHOT/org.apache.oltu.oauth2.httpclient4-1.0.3-SNAPSHOT.pom
[JENKINS] Archiving F:\jenkins\jenkins-slave\workspace\Oltu-OAuth-2.0-windows\trunk\oauth-2.0\dynamicreg-client\pom.xml
to org.apache.oltu.oauth2/org.apache.oltu.oauth2.dynamicreg.client/1.0.3-SNAPSHOT/org.apache.oltu.oauth2.dynamicreg.client-1.0.3-SNAPSHOT.pom
[JENKINS] Archiving F:\jenkins\jenkins-slave\workspace\Oltu-OAuth-2.0-windows\trunk\oauth-2.0\test-utils\pom.xml
to org.apache.oltu.oauth2/org.apache.oltu.oauth2.test-utils/1.0.3-SNAPSHOT/org.apache.oltu.oauth2.test-utils-1.0.3-SNAPSHOT.pom
[JENKINS] Archiving <https://builds.apache.org/job/Oltu-OAuth-2.0-windows/ws/trunk\oauth-2.0\pom.xml>
to org.apache.oltu.oauth2/org.apache.oltu.oauth2.parent/1.0.3-SNAPSHOT/org.apache.oltu.oauth2.parent-1.0.3-SNAPSHOT.pom
[JENKINS] Archiving F:\jenkins\jenkins-slave\workspace\Oltu-OAuth-2.0-windows\trunk\oauth-2.0\authzserver\pom.xml
to org.apache.oltu.oauth2/org.apache.oltu.oauth2.authzserver/1.0.3-SNAPSHOT/org.apache.oltu.oauth2.authzserver-1.0.3-SNAPSHOT.pom
[JENKINS] Archiving F:\jenkins\jenkins-slave\workspace\Oltu-OAuth-2.0-windows\trunk\oauth-2.0\dynamicreg-server\pom.xml
to org.apache.oltu.oauth2/org.apache.oltu.oauth2.dynamicreg.server/1.0.3-SNAPSHOT/org.apache.oltu.oauth2.dynamicreg.server-1.0.3-SNAPSHOT.pom
[JENKINS] Archiving F:\jenkins\jenkins-slave\workspace\Oltu-OAuth-2.0-windows\trunk\oauth-2.0\common\pom.xml
to org.apache.oltu.oauth2/org.apache.oltu.oauth2.common/1.0.3-SNAPSHOT/org.apache.oltu.oauth2.common-1.0.3-SNAPSHOT.pom
[JENKINS] Archiving F:\jenkins\jenkins-slave\workspace\Oltu-OAuth-2.0-windows\trunk\oauth-2.0\jwt\pom.xml
to org.apache.oltu.oauth2/org.apache.oltu.oauth2.jwt/1.0.4-SNAPSHOT/org.apache.oltu.oauth2.jwt-1.0.4-SNAPSHOT.pom
[JENKINS] Archiving F:\jenkins\jenkins-slave\workspace\Oltu-OAuth-2.0-windows\trunk\oauth-2.0\integration-tests\pom.xml
to org.apache.oltu.oauth2/org.apache.oltu.oauth2.integration-tests/1.0.3-SNAPSHOT/org.apache.oltu.oauth2.integration-tests-1.0.3-SNAPSHOT.pom
[JENKINS] Archiving F:\jenkins\jenkins-slave\workspace\Oltu-OAuth-2.0-windows\trunk\oauth-2.0\dynamicreg-common\pom.xml
to org.apache.oltu.oauth2/org.apache.oltu.oauth2.dynamicreg.common/1.0.3-SNAPSHOT/org.apache.oltu.oauth2.dynamicreg.common-1.0.3-SNAPSHOT.pom
[JENKINS] Archiving F:\jenkins\jenkins-slave\workspace\Oltu-OAuth-2.0-windows\trunk\oauth-2.0\resourceserver\pom.xml
to org.apache.oltu.oauth2/org.apache.oltu.oauth2.resourceserver/1.0.3-SNAPSHOT/org.apache.oltu.oauth2.resourceserver-1.0.3-SNAPSHOT.pom
[JENKINS] Archiving F:\jenkins\jenkins-slave\workspace\Oltu-OAuth-2.0-windows\trunk\oauth-2.0\resourceserver-filter\pom.xml
to org.apache.oltu.oauth2/org.apache.oltu.oauth2.resourceserver-filter/1.0.3-SNAPSHOT/org.apache.oltu.oauth2.resourceserver-filter-1.0.3-SNAPSHOT.pom
[JENKINS] Archiving F:\jenkins\jenkins-slave\workspace\Oltu-OAuth-2.0-windows\trunk\oauth-2.0\client\pom.xml
to org.apache.oltu.oauth2/org.apache.oltu.oauth2.client/1.0.3-SNAPSHOT/org.apache.oltu.oauth2.client-1.0.3-SNAPSHOT.pom
Sending e-mails to: dev@oltu.apache.org
channel stopped

Mime
View raw message