oltu-dev mailing list archives

Site index · List index
Message view « Date » · « Thread »
Top « Date » · « Thread »
From Jasha Joachimsthal <ja...@apache.org>
Subject Re: Build failed in Jenkins: Oltu #143
Date Wed, 24 Feb 2016 07:35:25 GMT
On 24 February 2016 at 08:10, Konrad Windszus <konrad_w@gmx.de> wrote:

> Since the build is failing for quite some time now due to the ciphers
> being provided by snapshots.apache.org are not compatible with Java 6u45
> (see https://www.ssllabs.com/ssltest/analyze.html?d=repository.apache.org
> and https://issues.apache.org/jira/browse/INFRA-10298) I would recommend
> doing the build only with Java 7 or 8. We can still set the source level to
> Java 6 and use animal-sniffer to detect any non Java6 API usage.
> WDYT?
> Who can change the build settings in Jenkins?
> Thanks,
> Konrad
>

We can also use the Maven toolchains plugin to trigger the build (and
deployment) with Java 7 or 8, but do the actual compilation in Java 6.
Unfortunately I don't have sufficient rights to change the Jenkins jobs.

Jasha


>
> > Am 24.02.2016 um 03:12 schrieb Apache Jenkins Server <
> jenkins@builds.apache.org>:
> >
> > See <https://builds.apache.org/job/Oltu/143/changes>
> >
> > Changes:
> >
> > [asanso] OLTU-80 - Implement JWE support for JWT
> >
> > [stein] OLTU-178 Add the response code when the validateErrorResponse
> method is called which triggers an OAuthProblemException
> >
> > [stein] OLTU-185 Revert accidental commit
> >
> > [stein] OLTU-185 Fix tests.. Make sure that the validators are set, also
> when using the new init method
> >
> > ------------------------------------------
> > [...truncated 4 lines...]
> > U
>  oauth-2.0/client/src/test/java/org/apache/oltu/oauth2/client/validator/CodeTokenValidatorTest.java
> > A
>  oauth-2.0/client/src/test/java/org/apache/oltu/oauth2/client/validator/OAuthClientValidatorTest.java
> > U
>  oauth-2.0/client/src/test/java/org/apache/oltu/oauth2/client/response/OAuthClientResponseFactoryTest.java
> > U
>  oauth-2.0/client/src/main/java/org/apache/oltu/oauth2/client/validator/OAuthClientValidator.java
> > U
>  oauth-2.0/client/src/main/java/org/apache/oltu/oauth2/client/response/OAuthAccessTokenResponse.java
> > U
>  oauth-2.0/client/src/main/java/org/apache/oltu/oauth2/client/response/OAuthClientResponseFactory.java
> > U
>  oauth-2.0/client/src/main/java/org/apache/oltu/oauth2/client/response/OAuthClientResponse.java
> > U
>  oauth-2.0/dynamicreg-client/src/main/java/org/apache/oltu/oauth2/ext/dynamicreg/client/response/OAuthClientRegistrationResponse.java
> > U         jose/jwe/src/main/java/org/apache/oltu/jose/jwe/JWE.java
> > D
>  jose/jwe/src/main/java/org/apache/oltu/jose/jwe/io/JWEReader.java
> > D
>  jose/jwe/src/main/java/org/apache/oltu/jose/jwe/io/JWEWriter.java
> > U
>  jose/jwe/src/main/java/org/apache/oltu/jose/jwe/encryption/KeyEncryptMethod.java
> > U
>  jose/jwe/src/main/java/org/apache/oltu/jose/jwe/encryption/ContentEncryptMethod.java
> > At revision 1732009
> > Parsing POMs
> > Established TCP socket on 43286
> > maven3-agent.jar already up to date
> > maven3-interceptor.jar already up to date
> > maven3-interceptor-commons.jar already up to date
> > [trunk] $ /home/jenkins/tools/java/latest1.6/bin/java -da -dsa
> -XX:MaxPermSize=192m -Xmx512M -cp
> /home/jenkins/jenkins-slave/maven3-agent.jar:/home/jenkins/jenkins-slave/tools/hudson.tasks.Maven_MavenInstallation/Maven_3.0.3/boot/plexus-classworlds-2.4.jar
> org.jvnet.hudson.maven3.agent.Maven3Main
> /home/jenkins/jenkins-slave/tools/hudson.tasks.Maven_MavenInstallation/Maven_3.0.3
> /home/jenkins/jenkins-slave/slave.jar
> /home/jenkins/jenkins-slave/maven3-interceptor.jar
> /home/jenkins/jenkins-slave/maven3-interceptor-commons.jar 43286
> > <===[JENKINS REMOTING CAPACITY]===>   channel started
> > Executing Maven:  -B -f <
> https://builds.apache.org/job/Oltu/ws/trunk/pom.xml> -Dmaven.repo.local=<
> https://builds.apache.org/job/Oltu/ws/.repository> -U -B -e clean deploy
> > [INFO] Error stacktraces are turned on.
> > [INFO] Scanning for projects...
> > [INFO]
> ------------------------------------------------------------------------
> > [INFO] Reactor Build Order:
> > [INFO]
> > [INFO] Apache Oltu - Parent
> > [INFO] Apache Oltu - Commons
> > [INFO] Apache Oltu - Commons - Encoded Token
> > [INFO] Apache Oltu - Commons - JSON
> > [INFO] Apache Oltu - OAuth 2.0
> > [INFO] Apache Oltu - OAuth 2.0 - Common
> > [INFO] Apache Oltu - OAuth 2.0 - Client
> > [INFO] Apache Oltu - OAuth 2.0 - HttpClient
> > [INFO] Apache Oltu - OAuth 2.0 - Dynamic Registration Common
> > [INFO] Apache Oltu - OAuth 2.0 - Dynamic Registration Client
> > [INFO] Apache Oltu - OAuth 2.0 - Authorization Server
> > [INFO] Apache Oltu - OAuth 2.0 - Resource Server
> > [INFO] Apache Oltu - OAuth 2.0 - Resource Server Filter
> > [INFO] Apache Oltu - OAuth 2.0 - Test Utils
> > [INFO] Apache Oltu - OAuth 2.0 - Dynamic Registration Server
> > [INFO] Apache Oltu - OAuth 2.0 - Integration Tests
> > [INFO] Apache Oltu - OAuth 2.0 - JWT
> > [INFO] Apache Oltu - OpenId Connect
> > [INFO] Apache Oltu - OpenId Connect - Common
> > [INFO] Apache Oltu - OpenId Connect - Client
> > [INFO] Apache Oltu - JOSE
> > [INFO] Apache Oltu - JOSE - JWS
> > [INFO] Apache Oltu - Demos - Parent
> > [INFO] Apache Oltu - Demos - Client
> > [INFO] Apache Oltu - Reactor
> > [INFO]
> > [INFO]
> ------------------------------------------------------------------------
> > [INFO] Building Apache Oltu - Parent 4-SNAPSHOT
> > [INFO]
> ------------------------------------------------------------------------
> > [INFO]
> > [INFO] --- maven-clean-plugin:2.5:clean (default-clean) @
> org.apache.oltu.parent ---
> > [INFO] Deleting <
> https://builds.apache.org/job/Oltu/ws/trunk/parent/target>
> > [INFO]
> > [INFO] --- maven-enforcer-plugin:1.3.1:enforce (enforce-java) @
> org.apache.oltu.parent ---
> > [INFO]
> > [INFO] --- buildnumber-maven-plugin:1.2:create (default) @
> org.apache.oltu.parent ---
> > [INFO] Checking for local modifications: skipped.
> > [INFO] Updating project files from SCM: skipped.
> > [INFO] Executing: /bin/sh -c cd <
> https://builds.apache.org/job/Oltu/ws/trunk/parent> && svn
> --non-interactive info
> > [INFO] Working directory: <
> https://builds.apache.org/job/Oltu/ws/trunk/parent>
> > [INFO] Storing buildNumber: 1731745 at timestamp: 1456279926352
> > [INFO] Executing: /bin/sh -c cd <
> https://builds.apache.org/job/Oltu/ws/trunk/parent> && svn
> --non-interactive info
> > [INFO] Working directory: <
> https://builds.apache.org/job/Oltu/ws/trunk/parent>
> > [INFO] Storing buildScmBranch: trunk
> > [INFO]
> > [INFO] --- maven-remote-resources-plugin:1.5:process (default) @
> org.apache.oltu.parent ---
> > [INFO]
> > [INFO] --- maven-site-plugin:3.4:attach-descriptor (attach-descriptor) @
> org.apache.oltu.parent ---
> > [INFO]
> > [INFO] --- maven-install-plugin:2.5.1:install (default-install) @
> org.apache.oltu.parent ---
> > [INFO] Installing <
> https://builds.apache.org/job/Oltu/ws/trunk/parent/pom.xml> to <
> https://builds.apache.org/job/Oltu/ws/.repository/org/apache/oltu/org.apache.oltu.parent/4-SNAPSHOT/org.apache.oltu.parent-4-SNAPSHOT.pom
> >
> > [INFO] Installing <
> https://builds.apache.org/job/Oltu/ws/trunk/parent/target/org.apache.oltu.parent-4-SNAPSHOT-site.xml>
> to <
> https://builds.apache.org/job/Oltu/ws/.repository/org/apache/oltu/org.apache.oltu.parent/4-SNAPSHOT/org.apache.oltu.parent-4-SNAPSHOT-site.xml
> >
> > [INFO]
> > [INFO] --- maven-deploy-plugin:2.8.1:deploy (default-deploy) @
> org.apache.oltu.parent ---
> > Downloading:
> https://repository.apache.org/content/repositories/snapshots/org/apache/oltu/org.apache.oltu.parent/4-SNAPSHOT/maven-metadata.xml
> > [WARNING] Could not transfer metadata
> org.apache.oltu:org.apache.oltu.parent:4-SNAPSHOT/maven-metadata.xml
> from/to apache.snapshots.https (
> https://repository.apache.org/content/repositories/snapshots): Error
> transferring file: java.lang.RuntimeException: Could not generate DH keypair
> > [INFO]
> ------------------------------------------------------------------------
> > [INFO] Reactor Summary:
> > [INFO]
> > [INFO] Apache Oltu - Parent .............................. FAILURE
> [8.080s]
> > [INFO] Apache Oltu - Commons ............................. SKIPPED
> > [INFO] Apache Oltu - Commons - Encoded Token ............. SKIPPED
> > [INFO] Apache Oltu - Commons - JSON ...................... SKIPPED
> > [INFO] Apache Oltu - OAuth 2.0 ........................... SKIPPED
> > [INFO] Apache Oltu - OAuth 2.0 - Common .................. SKIPPED
> > [INFO] Apache Oltu - OAuth 2.0 - Client .................. SKIPPED
> > [INFO] Apache Oltu - OAuth 2.0 - HttpClient .............. SKIPPED
> > [INFO] Apache Oltu - OAuth 2.0 - Dynamic Registration Common  SKIPPED
> > [INFO] Apache Oltu - OAuth 2.0 - Dynamic Registration Client  SKIPPED
> > [INFO] Apache Oltu - OAuth 2.0 - Authorization Server .... SKIPPED
> > [INFO] Apache Oltu - OAuth 2.0 - Resource Server ......... SKIPPED
> > [INFO] Apache Oltu - OAuth 2.0 - Resource Server Filter .. SKIPPED
> > [INFO] Apache Oltu - OAuth 2.0 - Test Utils .............. SKIPPED
> > [INFO] Apache Oltu - OAuth 2.0 - Dynamic Registration Server  SKIPPED
> > [INFO] Apache Oltu - OAuth 2.0 - Integration Tests ....... SKIPPED
> > [INFO] Apache Oltu - OAuth 2.0 - JWT ..................... SKIPPED
> > [INFO] Apache Oltu - OpenId Connect ...................... SKIPPED
> > [INFO] Apache Oltu - OpenId Connect - Common ............. SKIPPED
> > [INFO] Apache Oltu - OpenId Connect - Client ............. SKIPPED
> > [INFO] Apache Oltu - JOSE ................................ SKIPPED
> > [INFO] Apache Oltu - JOSE - JWS .......................... SKIPPED
> > [INFO] Apache Oltu - Demos - Parent ...................... SKIPPED
> > [INFO] Apache Oltu - Demos - Client ...................... SKIPPED
> > [INFO] Apache Oltu - Reactor ............................. SKIPPED
> > [INFO]
> ------------------------------------------------------------------------
> > [INFO] BUILD FAILURE
> > [INFO]
> ------------------------------------------------------------------------
> > [INFO] Total time: 10.644s
> > [INFO] Finished at: Wed Feb 24 02:12:12 UTC 2016
> > [INFO] Final Memory: 19M/142M
> > [INFO]
> ------------------------------------------------------------------------
> > Waiting for Jenkins to finish collecting data
> > [ERROR] Failed to execute goal
> org.apache.maven.plugins:maven-deploy-plugin:2.8.1:deploy (default-deploy)
> on project org.apache.oltu.parent: Failed to retrieve remote metadata
> org.apache.oltu:org.apache.oltu.parent:4-SNAPSHOT/maven-metadata.xml: Could
> not transfer metadata
> org.apache.oltu:org.apache.oltu.parent:4-SNAPSHOT/maven-metadata.xml
> from/to apache.snapshots.https (
> https://repository.apache.org/content/repositories/snapshots): Error
> transferring file: java.lang.RuntimeException: Could not generate DH
> keypair: Prime size must be multiple of 64, and can only range from 512 to
> 1024 (inclusive) -> [Help 1]
> > org.apache.maven.lifecycle.LifecycleExecutionException: Failed to
> execute goal org.apache.maven.plugins:maven-deploy-plugin:2.8.1:deploy
> (default-deploy) on project org.apache.oltu.parent: Failed to retrieve
> remote metadata
> org.apache.oltu:org.apache.oltu.parent:4-SNAPSHOT/maven-metadata.xml: Could
> not transfer metadata
> org.apache.oltu:org.apache.oltu.parent:4-SNAPSHOT/maven-metadata.xml
> from/to apache.snapshots.https (
> https://repository.apache.org/content/repositories/snapshots): Error
> transferring file: java.lang.RuntimeException: Could not generate DH keypair
> >       at
> org.apache.maven.lifecycle.internal.MojoExecutor.execute(MojoExecutor.java:217)
> >       at
> org.apache.maven.lifecycle.internal.MojoExecutor.execute(MojoExecutor.java:153)
> >       at
> org.apache.maven.lifecycle.internal.MojoExecutor.execute(MojoExecutor.java:145)
> >       at
> org.apache.maven.lifecycle.internal.LifecycleModuleBuilder.buildProject(LifecycleModuleBuilder.java:84)
> >       at
> org.apache.maven.lifecycle.internal.LifecycleModuleBuilder.buildProject(LifecycleModuleBuilder.java:59)
> >       at
> org.apache.maven.lifecycle.internal.LifecycleStarter.singleThreadedBuild(LifecycleStarter.java:183)
> >       at
> org.apache.maven.lifecycle.internal.LifecycleStarter.execute(LifecycleStarter.java:161)
> >       at org.apache.maven.DefaultMaven.doExecute(DefaultMaven.java:319)
> >       at org.apache.maven.DefaultMaven.execute(DefaultMaven.java:156)
> >       at
> org.jvnet.hudson.maven3.launcher.Maven3Launcher.main(Maven3Launcher.java:117)
> >       at sun.reflect.NativeMethodAccessorImpl.invoke0(Native Method)
> >       at
> sun.reflect.NativeMethodAccessorImpl.invoke(NativeMethodAccessorImpl.java:39)
> >       at
> sun.reflect.DelegatingMethodAccessorImpl.invoke(DelegatingMethodAccessorImpl.java:25)
> >       at java.lang.reflect.Method.invoke(Method.java:597)
> >       at
> org.codehaus.plexus.classworlds.launcher.Launcher.launchStandard(Launcher.java:329)
> >       at
> org.codehaus.plexus.classworlds.launcher.Launcher.launch(Launcher.java:239)
> >       at
> org.jvnet.hudson.maven3.agent.Maven3Main.launch(Maven3Main.java:181)
> >       at sun.reflect.NativeMethodAccessorImpl.invoke0(Native Method)
> >       at
> sun.reflect.NativeMethodAccessorImpl.invoke(NativeMethodAccessorImpl.java:39)
> >       at
> sun.reflect.DelegatingMethodAccessorImpl.invoke(DelegatingMethodAccessorImpl.java:25)
> >       at java.lang.reflect.Method.invoke(Method.java:597)
> >       at hudson.maven.Maven3Builder.call(Maven3Builder.java:136)
> >       at hudson.maven.Maven3Builder.call(Maven3Builder.java:71)
> >       at hudson.remoting.UserRequest.perform(UserRequest.java:121)
> >       at hudson.remoting.UserRequest.perform(UserRequest.java:49)
> >       at hudson.remoting.Request$2.run(Request.java:326)
> >       at
> hudson.remoting.InterceptingExecutorService$1.call(InterceptingExecutorService.java:68)
> >       at
> java.util.concurrent.FutureTask$Sync.innerRun(FutureTask.java:303)
> >       at java.util.concurrent.FutureTask.run(FutureTask.java:138)
> >       at
> java.util.concurrent.ThreadPoolExecutor$Worker.runTask(ThreadPoolExecutor.java:895)
> >       at
> java.util.concurrent.ThreadPoolExecutor$Worker.run(ThreadPoolExecutor.java:918)
> >       at java.lang.Thread.run(Thread.java:662)
> > Caused by: org.apache.maven.plugin.MojoExecutionException: Failed to
> retrieve remote metadata
> org.apache.oltu:org.apache.oltu.parent:4-SNAPSHOT/maven-metadata.xml: Could
> not transfer metadata
> org.apache.oltu:org.apache.oltu.parent:4-SNAPSHOT/maven-metadata.xml
> from/to apache.snapshots.https (
> https://repository.apache.org/content/repositories/snapshots): Error
> transferring file: java.lang.RuntimeException: Could not generate DH keypair
> >       at
> org.apache.maven.plugin.deploy.DeployMojo.deployProject(DeployMojo.java:282)
> >       at
> org.apache.maven.plugin.deploy.DeployMojo.execute(DeployMojo.java:169)
> >       at
> org.apache.maven.plugin.DefaultBuildPluginManager.executeMojo(DefaultBuildPluginManager.java:101)
> >       at
> org.apache.maven.lifecycle.internal.MojoExecutor.execute(MojoExecutor.java:209)
> >       ... 31 more
> > Caused by:
> org.apache.maven.artifact.deployer.ArtifactDeploymentException: Failed to
> retrieve remote metadata
> org.apache.oltu:org.apache.oltu.parent:4-SNAPSHOT/maven-metadata.xml: Could
> not transfer metadata
> org.apache.oltu:org.apache.oltu.parent:4-SNAPSHOT/maven-metadata.xml
> from/to apache.snapshots.https (
> https://repository.apache.org/content/repositories/snapshots): Error
> transferring file: java.lang.RuntimeException: Could not generate DH keypair
> >       at
> org.apache.maven.artifact.deployer.DefaultArtifactDeployer.deploy(DefaultArtifactDeployer.java:141)
> >       at
> org.apache.maven.plugin.deploy.AbstractDeployMojo.deploy(AbstractDeployMojo.java:171)
> >       at
> org.apache.maven.plugin.deploy.DeployMojo.deployProject(DeployMojo.java:240)
> >       ... 34 more
> > Caused by: org.sonatype.aether.deployment.DeploymentException: Failed to
> retrieve remote metadata
> org.apache.oltu:org.apache.oltu.parent:4-SNAPSHOT/maven-metadata.xml: Could
> not transfer metadata
> org.apache.oltu:org.apache.oltu.parent:4-SNAPSHOT/maven-metadata.xml
> from/to apache.snapshots.https (
> https://repository.apache.org/content/repositories/snapshots): Error
> transferring file: java.lang.RuntimeException: Could not generate DH keypair
> >       at
> org.sonatype.aether.impl.internal.DefaultDeployer.upload(DefaultDeployer.java:407)
> >       at
> org.sonatype.aether.impl.internal.DefaultDeployer.deploy(DefaultDeployer.java:260)
> >       at
> org.sonatype.aether.impl.internal.DefaultDeployer.deploy(DefaultDeployer.java:215)
> >       at
> org.sonatype.aether.impl.internal.DefaultRepositorySystem.deploy(DefaultRepositorySystem.java:480)
> >       at
> org.apache.maven.artifact.deployer.DefaultArtifactDeployer.deploy(DefaultArtifactDeployer.java:137)
> >       ... 36 more
> > Caused by: org.sonatype.aether.transfer.MetadataTransferException: Could
> not transfer metadata
> org.apache.oltu:org.apache.oltu.parent:4-SNAPSHOT/maven-metadata.xml
> from/to apache.snapshots.https (
> https://repository.apache.org/content/repositories/snapshots): Error
> transferring file: java.lang.RuntimeException: Could not generate DH keypair
> >       at
> org.sonatype.aether.connector.wagon.WagonRepositoryConnector$3.wrap(WagonRepositoryConnector.java:932)
> >       at
> org.sonatype.aether.connector.wagon.WagonRepositoryConnector$3.wrap(WagonRepositoryConnector.java:923)
> >       at
> org.sonatype.aether.connector.wagon.WagonRepositoryConnector$GetTask.flush(WagonRepositoryConnector.java:695)
> >       at
> org.sonatype.aether.connector.wagon.WagonRepositoryConnector$GetTask.flush(WagonRepositoryConnector.java:689)
> >       at
> org.sonatype.aether.connector.wagon.WagonRepositoryConnector.get(WagonRepositoryConnector.java:445)
> >       at
> org.sonatype.aether.impl.internal.DefaultDeployer.upload(DefaultDeployer.java:379)
> >       ... 40 more
> > Caused by: org.apache.maven.wagon.TransferFailedException: Error
> transferring file: java.lang.RuntimeException: Could not generate DH keypair
> >       at
> org.apache.maven.wagon.providers.http.LightweightHttpWagon.fillInputData(LightweightHttpWagon.java:143)
> >       at
> org.apache.maven.wagon.StreamWagon.getInputStream(StreamWagon.java:116)
> >       at
> org.apache.maven.wagon.StreamWagon.getIfNewer(StreamWagon.java:88)
> >       at org.apache.maven.wagon.StreamWagon.get(StreamWagon.java:61)
> >       at
> org.sonatype.aether.connector.wagon.WagonRepositoryConnector$GetTask.run(WagonRepositoryConnector.java:608)
> >       at
> org.sonatype.aether.util.concurrency.RunnableErrorForwarder$1.run(RunnableErrorForwarder.java:64)
> >       ... 3 more
> > Caused by: javax.net.ssl.SSLException: java.lang.RuntimeException: Could
> not generate DH keypair
> >       at
> com.sun.net.ssl.internal.ssl.Alerts.getSSLException(Alerts.java:190)
> >       at
> com.sun.net.ssl.internal.ssl.SSLSocketImpl.fatal(SSLSocketImpl.java:1747)
> >       at
> com.sun.net.ssl.internal.ssl.SSLSocketImpl.fatal(SSLSocketImpl.java:1708)
> >       at
> com.sun.net.ssl.internal.ssl.SSLSocketImpl.handleException(SSLSocketImpl.java:1691)
> >       at
> com.sun.net.ssl.internal.ssl.SSLSocketImpl.startHandshake(SSLSocketImpl.java:1222)
> >       at
> com.sun.net.ssl.internal.ssl.SSLSocketImpl.startHandshake(SSLSocketImpl.java:1199)
> >       at
> sun.net.www.protocol.https.HttpsClient.afterConnect(HttpsClient.java:434)
> >       at
> sun.net.www.protocol.https.AbstractDelegateHttpsURLConnection.connect(AbstractDelegateHttpsURLConnection.java:166)
> >       at
> sun.net.www.protocol.http.HttpURLConnection.getInputStream(HttpURLConnection.java:1195)
> >       at
> java.net.HttpURLConnection.getResponseCode(HttpURLConnection.java:379)
> >       at
> sun.net.www.protocol.https.HttpsURLConnectionImpl.getResponseCode(HttpsURLConnectionImpl.java:318)
> >       at
> org.apache.maven.wagon.providers.http.LightweightHttpWagon.fillInputData(LightweightHttpWagon.java:115)
> >       ... 8 more
> > Caused by: java.lang.RuntimeException: Could not generate DH keypair
> >       at com.sun.net.ssl.internal.ssl.DHCrypt.<init>(DHCrypt.java:114)
> >       at
> com.sun.net.ssl.internal.ssl.ClientHandshaker.serverKeyExchange(ClientHandshaker.java:559)
> >       at
> com.sun.net.ssl.internal.ssl.ClientHandshaker.processMessage(ClientHandshaker.java:186)
> >       at
> com.sun.net.ssl.internal.ssl.Handshaker.processLoop(Handshaker.java:593)
> >       at
> com.sun.net.ssl.internal.ssl.Handshaker.process_record(Handshaker.java:529)
> >       at
> com.sun.net.ssl.internal.ssl.SSLSocketImpl.readRecord(SSLSocketImpl.java:943)
> >       at
> com.sun.net.ssl.internal.ssl.SSLSocketImpl.performInitialHandshake(SSLSocketImpl.java:1188)
> >       at
> com.sun.net.ssl.internal.ssl.SSLSocketImpl.startHandshake(SSLSocketImpl.java:1215)
> >       ... 15 more
> > Caused by: java.security.InvalidAlgorithmParameterException: Prime size
> must be multiple of 64, and can only range from 512 to 1024 (inclusive)
> >       at
> com.sun.crypto.provider.DHKeyPairGenerator.initialize(DashoA13*..)
> >       at
> java.security.KeyPairGenerator$Delegate.initialize(KeyPairGenerator.java:627)
> >       at com.sun.net.ssl.internal.ssl.DHCrypt.<init>(DHCrypt.java:107)
> >       ... 22 more
> > [ERROR]
> > [ERROR] Re-run Maven using the -X switch to enable full debug logging.
> > [ERROR]
> > [ERROR] For more information about the errors and possible solutions,
> please read the following articles:
> > [ERROR] [Help 1]
> http://cwiki.apache.org/confluence/display/MAVEN/MojoExecutionException
> > [JENKINS] Archiving <
> https://builds.apache.org/job/Oltu/ws/trunk/oauth-2.0/integration-tests/pom.xml>
> to
> org.apache.oltu.oauth2/org.apache.oltu.oauth2.integration-tests/1.0.2-SNAPSHOT/org.apache.oltu.oauth2.integration-tests-1.0.2-SNAPSHOT.pom
> > [JENKINS] Archiving <
> https://builds.apache.org/job/Oltu/ws/trunk/parent/pom.xml> to
> org.apache.oltu/org.apache.oltu.parent/4-SNAPSHOT/org.apache.oltu.parent-4-SNAPSHOT.pom
> > [JENKINS] Archiving <
> https://builds.apache.org/job/Oltu/ws/trunk/parent/target/org.apache.oltu.parent-4-SNAPSHOT-site.xml>
> to
> org.apache.oltu/org.apache.oltu.parent/4-SNAPSHOT/org.apache.oltu.parent-4-SNAPSHOT-site.xml
> > [JENKINS] Archiving <
> https://builds.apache.org/job/Oltu/ws/trunk/oauth-2.0/authzserver/pom.xml>
> to
> org.apache.oltu.oauth2/org.apache.oltu.oauth2.authzserver/1.0.2-SNAPSHOT/org.apache.oltu.oauth2.authzserver-1.0.2-SNAPSHOT.pom
> > [JENKINS] Archiving <
> https://builds.apache.org/job/Oltu/ws/trunk/oauth-2.0/jwt/pom.xml> to
> org.apache.oltu.oauth2/org.apache.oltu.oauth2.jwt/1.0.2-SNAPSHOT/org.apache.oltu.oauth2.jwt-1.0.2-SNAPSHOT.pom
> > [JENKINS] Archiving <
> https://builds.apache.org/job/Oltu/ws/trunk/oauth-2.0/resourceserver-filter/pom.xml>
> to
> org.apache.oltu.oauth2/org.apache.oltu.oauth2.resourceserver-filter/1.0.2-SNAPSHOT/org.apache.oltu.oauth2.resourceserver-filter-1.0.2-SNAPSHOT.pom
> > [JENKINS] Archiving <
> https://builds.apache.org/job/Oltu/ws/trunk/oauth-2.0/dynamicreg-client/pom.xml>
> to
> org.apache.oltu.oauth2/org.apache.oltu.oauth2.dynamicreg.client/1.0.2-SNAPSHOT/org.apache.oltu.oauth2.dynamicreg.client-1.0.2-SNAPSHOT.pom
> > [JENKINS] Archiving <
> https://builds.apache.org/job/Oltu/ws/trunk/commons/encodedtoken/pom.xml>
> to
> org.apache.oltu.commons/org.apache.oltu.commons.encodedtoken/1.0.1-SNAPSHOT/org.apache.oltu.commons.encodedtoken-1.0.1-SNAPSHOT.pom
> > [JENKINS] Archiving <
> https://builds.apache.org/job/Oltu/ws/trunk/commons/json/pom.xml> to
> org.apache.oltu.commons/org.apache.oltu.commons.json/1.0.1-SNAPSHOT/org.apache.oltu.commons.json-1.0.1-SNAPSHOT.pom
> > [JENKINS] Archiving <
> https://builds.apache.org/job/Oltu/ws/trunk/demos/client-demo/pom.xml> to
> org.apache.oltu.demos/org.apache.oltu.demos.client/1-SNAPSHOT/org.apache.oltu.demos.client-1-SNAPSHOT.pom
> > [JENKINS] Archiving <
> https://builds.apache.org/job/Oltu/ws/trunk/oauth-2.0/httpclient4/pom.xml>
> to
> org.apache.oltu.oauth2/org.apache.oltu.oauth2.httpclient4/1.0.2-SNAPSHOT/org.apache.oltu.oauth2.httpclient4-1.0.2-SNAPSHOT.pom
> > [JENKINS] Archiving <
> https://builds.apache.org/job/Oltu/ws/trunk/oauth-2.0/dynamicreg-common/pom.xml>
> to
> org.apache.oltu.oauth2/org.apache.oltu.oauth2.dynamicreg.common/1.0.2-SNAPSHOT/org.apache.oltu.oauth2.dynamicreg.common-1.0.2-SNAPSHOT.pom
> > [JENKINS] Archiving <
> https://builds.apache.org/job/Oltu/ws/trunk/oauth-2.0/resourceserver/pom.xml>
> to
> org.apache.oltu.oauth2/org.apache.oltu.oauth2.resourceserver/1.0.2-SNAPSHOT/org.apache.oltu.oauth2.resourceserver-1.0.2-SNAPSHOT.pom
> > [JENKINS] Archiving <
> https://builds.apache.org/job/Oltu/ws/trunk/oauth-2.0/client/pom.xml> to
> org.apache.oltu.oauth2/org.apache.oltu.oauth2.client/1.0.2-SNAPSHOT/org.apache.oltu.oauth2.client-1.0.2-SNAPSHOT.pom
> > [JENKINS] Archiving <
> https://builds.apache.org/job/Oltu/ws/trunk/openid-connect/pom.xml> to
> org.apache.oltu.openidconnect/org.apache.oltu.openidconnect.parent/1-SNAPSHOT/org.apache.oltu.openidconnect.parent-1-SNAPSHOT.pom
> > [JENKINS] Archiving <
> https://builds.apache.org/job/Oltu/ws/trunk/jose/pom.xml> to
> org.apache.oltu.jose/org.apache.oltu.jose.parent/2-SNAPSHOT/org.apache.oltu.jose.parent-2-SNAPSHOT.pom
> > [JENKINS] Archiving <
> https://builds.apache.org/job/Oltu/ws/trunk/openid-connect/common/pom.xml>
> to
> org.apache.oltu.openidconnect/org.apache.oltu.openidconnect.common/0.0.1-SNAPSHOT/org.apache.oltu.openidconnect.common-0.0.1-SNAPSHOT.pom
> > [JENKINS] Archiving <
> https://builds.apache.org/job/Oltu/ws/trunk/oauth-2.0/dynamicreg-server/pom.xml>
> to
> org.apache.oltu.oauth2/org.apache.oltu.oauth2.dynamicreg.server/1.0.2-SNAPSHOT/org.apache.oltu.oauth2.dynamicreg.server-1.0.2-SNAPSHOT.pom
> > [JENKINS] Archiving <
> https://builds.apache.org/job/Oltu/ws/trunk/demos/pom.xml> to
> org.apache.oltu.demos/org.apache.oltu.demos.parent/1-SNAPSHOT/org.apache.oltu.demos.parent-1-SNAPSHOT.pom
> > [JENKINS] Archiving <
> https://builds.apache.org/job/Oltu/ws/trunk/jose/jws/pom.xml> to
> org.apache.oltu.jose/org.apache.oltu.jose.jws/1.0.1-SNAPSHOT/org.apache.oltu.jose.jws-1.0.1-SNAPSHOT.pom
> > [JENKINS] Archiving <
> https://builds.apache.org/job/Oltu/ws/trunk/oauth-2.0/pom.xml> to
> org.apache.oltu.oauth2/org.apache.oltu.oauth2.parent/1.0.2-SNAPSHOT/org.apache.oltu.oauth2.parent-1.0.2-SNAPSHOT.pom
> > [JENKINS] Archiving <
> https://builds.apache.org/job/Oltu/ws/trunk/commons/pom.xml> to
> org.apache.oltu.commons/org.apache.oltu.commons.parent/2-SNAPSHOT/org.apache.oltu.commons.parent-2-SNAPSHOT.pom
> > [JENKINS] Archiving <
> https://builds.apache.org/job/Oltu/ws/trunk/openid-connect/client/pom.xml>
> to
> org.apache.oltu.openidconnect/org.apache.oltu.openidconnect.client/0.0.1-SNAPSHOT/org.apache.oltu.openidconnect.client-0.0.1-SNAPSHOT.pom
> > [JENKINS] Archiving <https://builds.apache.org/job/Oltu/ws/trunk/pom.xml>
> to
> org.apache.oltu/org.apache.oltu.reactor/1-SNAPSHOT/org.apache.oltu.reactor-1-SNAPSHOT.pom
> > [JENKINS] Archiving <
> https://builds.apache.org/job/Oltu/ws/trunk/oauth-2.0/test-utils/pom.xml>
> to
> org.apache.oltu.oauth2/org.apache.oltu.oauth2.test-utils/1.0.2-SNAPSHOT/org.apache.oltu.oauth2.test-utils-1.0.2-SNAPSHOT.pom
> > [JENKINS] Archiving <
> https://builds.apache.org/job/Oltu/ws/trunk/oauth-2.0/common/pom.xml> to
> org.apache.oltu.oauth2/org.apache.oltu.oauth2.common/1.0.2-SNAPSHOT/org.apache.oltu.oauth2.common-1.0.2-SNAPSHOT.pom
> > Sending e-mails to: dev@oltu.apache.org
> > channel stopped
>
>

Mime
  • Unnamed multipart/alternative (inline, None, 0 bytes)
View raw message