oltu-dev mailing list archives

Site index · List index
Message view « Date » · « Thread »
Top « Date » · « Thread »
From Apache Jenkins Server <jenk...@builds.apache.org>
Subject Build failed in Jenkins: Oltu #142
Date Tue, 23 Feb 2016 01:33:37 GMT
See <https://builds.apache.org/job/Oltu/142/changes>

Changes:

[stein] Update committer info

[stein] OLTU-185 Allow access to the response headers in a resource request

[Jasha Joachimsthal] OLTU-182 Password can contain colon : characters. Thanks Adam Campbell
for the initial patch.

[Jasha Joachimsthal] OLTU-156 Add latest releases to download page and update to latest skin

[Jasha Joachimsthal] OLTU-187 Update to latest apache parent in root. Use site plugin version
from Apache parent pom. Fix parent reference in site.

[asanso] OLTU-80 - Implement JWE support for JWT

[asanso] OLTU-80 - Implement JWE support for JWT

------------------------------------------
[...truncated 1779 lines...]
Downloaded: http://repo1.maven.org/maven2/org/apache/maven/doxia/doxia-module-apt/1.6/doxia-module-apt-1.6.jar
(52 KB at 780.5 KB/sec)
Downloading: http://repo1.maven.org/maven2/org/parboiled/parboiled-core/1.1.4/parboiled-core-1.1.4.jar
Downloaded: http://repo1.maven.org/maven2/org/apache/maven/doxia/doxia-module-markdown/1.6/doxia-module-markdown-1.6.jar
(15 KB at 305.3 KB/sec)
Downloading: http://repo1.maven.org/maven2/org/ow2/asm/asm/4.1/asm-4.1.jar
Downloaded: http://repo1.maven.org/maven2/org/apache/maven/doxia/doxia-module-fml/1.6/doxia-module-fml-1.6.jar
(38 KB at 544.6 KB/sec)
Downloading: http://repo1.maven.org/maven2/org/ow2/asm/asm-tree/4.1/asm-tree-4.1.jar
Downloaded: http://repo1.maven.org/maven2/org/pegdown/pegdown/1.2.1/pegdown-1.2.1.jar (58
KB at 854.3 KB/sec)
Downloading: http://repo1.maven.org/maven2/org/ow2/asm/asm-analysis/4.1/asm-analysis-4.1.jar
Downloaded: http://repo1.maven.org/maven2/org/parboiled/parboiled-java/1.1.4/parboiled-java-1.1.4.jar
(72 KB at 1066.6 KB/sec)
Downloading: http://repo1.maven.org/maven2/org/ow2/asm/asm-util/4.1/asm-util-4.1.jar
Downloaded: http://repo1.maven.org/maven2/org/ow2/asm/asm/4.1/asm-4.1.jar (47 KB at 984.0
KB/sec)
Downloading: http://repo1.maven.org/maven2/javax/servlet/servlet-api/2.5/servlet-api-2.5.jar
Downloaded: http://repo1.maven.org/maven2/org/parboiled/parboiled-core/1.1.4/parboiled-core-1.1.4.jar
(181 KB at 1861.9 KB/sec)
Downloading: http://repo1.maven.org/maven2/org/apache/maven/doxia/doxia-decoration-model/1.6/doxia-decoration-model-1.6.jar
Downloaded: http://repo1.maven.org/maven2/org/ow2/asm/asm-tree/4.1/asm-tree-4.1.jar (22 KB
at 327.9 KB/sec)
Downloading: http://repo1.maven.org/maven2/org/apache/maven/doxia/doxia-site-renderer/1.6/doxia-site-renderer-1.6.jar
Downloaded: http://repo1.maven.org/maven2/org/ow2/asm/asm-analysis/4.1/asm-analysis-4.1.jar
(20 KB at 293.1 KB/sec)
Downloading: http://repo1.maven.org/maven2/org/apache/velocity/velocity-tools/2.0/velocity-tools-2.0.jar
Downloaded: http://repo1.maven.org/maven2/org/ow2/asm/asm-util/4.1/asm-util-4.1.jar (37 KB
at 510.0 KB/sec)
Downloading: http://repo1.maven.org/maven2/commons-beanutils/commons-beanutils/1.7.0/commons-beanutils-1.7.0.jar
Downloaded: http://repo1.maven.org/maven2/javax/servlet/servlet-api/2.5/servlet-api-2.5.jar
(103 KB at 1487.7 KB/sec)
Downloading: http://repo1.maven.org/maven2/commons-digester/commons-digester/1.8/commons-digester-1.8.jar
Downloaded: http://repo1.maven.org/maven2/org/apache/maven/doxia/doxia-decoration-model/1.6/doxia-decoration-model-1.6.jar
(56 KB at 841.1 KB/sec)
Downloading: http://repo1.maven.org/maven2/commons-chain/commons-chain/1.1/commons-chain-1.1.jar
Downloaded: http://repo1.maven.org/maven2/org/apache/maven/doxia/doxia-site-renderer/1.6/doxia-site-renderer-1.6.jar
(56 KB at 798.3 KB/sec)
Downloading: http://repo1.maven.org/maven2/commons-validator/commons-validator/1.3.1/commons-validator-1.3.1.jar
Downloaded: http://repo1.maven.org/maven2/commons-beanutils/commons-beanutils/1.7.0/commons-beanutils-1.7.0.jar
(185 KB at 2424.3 KB/sec)
Downloading: http://repo1.maven.org/maven2/dom4j/dom4j/1.1/dom4j-1.1.jar
Downloaded: http://repo1.maven.org/maven2/commons-digester/commons-digester/1.8/commons-digester-1.8.jar
(141 KB at 1975.2 KB/sec)
Downloading: http://repo1.maven.org/maven2/sslext/sslext/1.2-0/sslext-1.2-0.jar
Downloaded: http://repo1.maven.org/maven2/commons-chain/commons-chain/1.1/commons-chain-1.1.jar
(88 KB at 1220.7 KB/sec)
Downloading: http://repo1.maven.org/maven2/org/apache/struts/struts-core/1.3.8/struts-core-1.3.8.jar
Downloaded: http://repo1.maven.org/maven2/org/apache/velocity/velocity-tools/2.0/velocity-tools-2.0.jar
(339 KB at 3021.9 KB/sec)
Downloading: http://repo1.maven.org/maven2/antlr/antlr/2.7.2/antlr-2.7.2.jar
Downloaded: http://repo1.maven.org/maven2/commons-validator/commons-validator/1.3.1/commons-validator-1.3.1.jar
(136 KB at 1858.9 KB/sec)
Downloading: http://repo1.maven.org/maven2/org/apache/struts/struts-taglib/1.3.8/struts-taglib-1.3.8.jar
Downloaded: http://repo1.maven.org/maven2/sslext/sslext/1.2-0/sslext-1.2-0.jar (26 KB at 371.0
KB/sec)
Downloading: http://repo1.maven.org/maven2/org/apache/struts/struts-tiles/1.3.8/struts-tiles-1.3.8.jar
Downloaded: http://repo1.maven.org/maven2/antlr/antlr/2.7.2/antlr-2.7.2.jar (350 KB at 3534.1
KB/sec)
Downloading: http://repo1.maven.org/maven2/org/apache/maven/doxia/doxia-integration-tools/1.6/doxia-integration-tools-1.6.jar
Downloaded: http://repo1.maven.org/maven2/org/apache/struts/struts-core/1.3.8/struts-core-1.3.8.jar
(322 KB at 2946.7 KB/sec)
Downloading: http://repo1.maven.org/maven2/org/codehaus/plexus/plexus-i18n/1.0-beta-7/plexus-i18n-1.0-beta-7.jar
Downloaded: http://repo1.maven.org/maven2/org/apache/struts/struts-taglib/1.3.8/struts-taglib-1.3.8.jar
(246 KB at 2532.2 KB/sec)
Downloading: http://repo1.maven.org/maven2/org/apache/velocity/velocity/1.5/velocity-1.5.jar
Downloaded: http://repo1.maven.org/maven2/org/apache/struts/struts-tiles/1.3.8/struts-tiles-1.3.8.jar
(117 KB at 1744.0 KB/sec)
Downloading: http://repo1.maven.org/maven2/oro/oro/2.0.8/oro-2.0.8.jar
Downloaded: http://repo1.maven.org/maven2/dom4j/dom4j/1.1/dom4j-1.1.jar (447 KB at 2704.3
KB/sec)
Downloading: http://repo1.maven.org/maven2/org/codehaus/plexus/plexus-velocity/1.1.8/plexus-velocity-1.1.8.jar
Downloaded: http://repo1.maven.org/maven2/org/apache/maven/doxia/doxia-integration-tools/1.6/doxia-integration-tools-1.6.jar
(44 KB at 650.5 KB/sec)
Downloading: http://repo1.maven.org/maven2/org/codehaus/plexus/plexus-utils/3.0.15/plexus-utils-3.0.15.jar
Downloaded: http://repo1.maven.org/maven2/org/codehaus/plexus/plexus-i18n/1.0-beta-7/plexus-i18n-1.0-beta-7.jar
(11 KB at 146.6 KB/sec)
Downloading: http://repo1.maven.org/maven2/org/mortbay/jetty/jetty/6.1.25/jetty-6.1.25.jar
Downloaded: http://repo1.maven.org/maven2/oro/oro/2.0.8/oro-2.0.8.jar (64 KB at 980.5 KB/sec)
Downloading: http://repo1.maven.org/maven2/org/mortbay/jetty/servlet-api/2.5-20081211/servlet-api-2.5-20081211.jar
Downloaded: http://repo1.maven.org/maven2/org/codehaus/plexus/plexus-velocity/1.1.8/plexus-velocity-1.1.8.jar
(8 KB at 114.9 KB/sec)
Downloading: http://repo1.maven.org/maven2/org/mortbay/jetty/jetty-util/6.1.25/jetty-util-6.1.25.jar
Downloaded: http://repo1.maven.org/maven2/org/apache/velocity/velocity/1.5/velocity-1.5.jar
(383 KB at 3272.9 KB/sec)
Downloading: http://repo1.maven.org/maven2/commons-lang/commons-lang/2.5/commons-lang-2.5.jar
Downloaded: http://repo1.maven.org/maven2/org/codehaus/plexus/plexus-utils/3.0.15/plexus-utils-3.0.15.jar
(234 KB at 3381.9 KB/sec)
Downloading: http://repo1.maven.org/maven2/commons-io/commons-io/1.4/commons-io-1.4.jar
Downloaded: http://repo1.maven.org/maven2/org/mortbay/jetty/servlet-api/2.5-20081211/servlet-api-2.5-20081211.jar
(131 KB at 1955.1 KB/sec)
Downloaded: http://repo1.maven.org/maven2/org/mortbay/jetty/jetty-util/6.1.25/jetty-util-6.1.25.jar
(174 KB at 2436.9 KB/sec)
Downloaded: http://repo1.maven.org/maven2/org/mortbay/jetty/jetty/6.1.25/jetty-6.1.25.jar
(526 KB at 5009.1 KB/sec)
Downloaded: http://repo1.maven.org/maven2/commons-io/commons-io/1.4/commons-io-1.4.jar (107
KB at 1566.0 KB/sec)
Downloaded: http://repo1.maven.org/maven2/commons-lang/commons-lang/2.5/commons-lang-2.5.jar
(273 KB at 2840.1 KB/sec)
[INFO] 
[INFO] --- maven-install-plugin:2.5.1:install (default-install) @ org.apache.oltu.parent ---
Downloading: http://repo1.maven.org/maven2/commons-codec/commons-codec/1.6/commons-codec-1.6.pom
Downloaded: http://repo1.maven.org/maven2/commons-codec/commons-codec/1.6/commons-codec-1.6.pom
(11 KB at 227.0 KB/sec)
Downloading: http://repo1.maven.org/maven2/org/apache/commons/commons-parent/22/commons-parent-22.pom
Downloaded: http://repo1.maven.org/maven2/org/apache/commons/commons-parent/22/commons-parent-22.pom
(41 KB at 787.2 KB/sec)
Downloading: http://repo1.maven.org/maven2/org/apache/maven/shared/maven-shared-utils/0.4/maven-shared-utils-0.4.pom
Downloaded: http://repo1.maven.org/maven2/org/apache/maven/shared/maven-shared-utils/0.4/maven-shared-utils-0.4.pom
(4 KB at 82.3 KB/sec)
Downloading: http://repo1.maven.org/maven2/commons-codec/commons-codec/1.6/commons-codec-1.6.jar
Downloading: http://repo1.maven.org/maven2/org/apache/maven/shared/maven-shared-utils/0.4/maven-shared-utils-0.4.jar
Downloaded: http://repo1.maven.org/maven2/commons-codec/commons-codec/1.6/commons-codec-1.6.jar
(228 KB at 3113.9 KB/sec)
Downloaded: http://repo1.maven.org/maven2/org/apache/maven/shared/maven-shared-utils/0.4/maven-shared-utils-0.4.jar
(152 KB at 2051.5 KB/sec)
[INFO] Installing <https://builds.apache.org/job/Oltu/ws/trunk/parent/pom.xml> to <https://builds.apache.org/job/Oltu/ws/.repository/org/apache/oltu/org.apache.oltu.parent/4-SNAPSHOT/org.apache.oltu.parent-4-SNAPSHOT.pom>
[INFO] Installing <https://builds.apache.org/job/Oltu/ws/trunk/parent/target/org.apache.oltu.parent-4-SNAPSHOT-site.xml>
to <https://builds.apache.org/job/Oltu/ws/.repository/org/apache/oltu/org.apache.oltu.parent/4-SNAPSHOT/org.apache.oltu.parent-4-SNAPSHOT-site.xml>
[INFO] 
[INFO] --- maven-deploy-plugin:2.8.1:deploy (default-deploy) @ org.apache.oltu.parent ---
Downloading: https://repository.apache.org/content/repositories/snapshots/org/apache/oltu/org.apache.oltu.parent/4-SNAPSHOT/maven-metadata.xml
[WARNING] Could not transfer metadata org.apache.oltu:org.apache.oltu.parent:4-SNAPSHOT/maven-metadata.xml
from/to apache.snapshots.https (https://repository.apache.org/content/repositories/snapshots):
Error transferring file: java.lang.RuntimeException: Could not generate DH keypair
[INFO] ------------------------------------------------------------------------
[INFO] Reactor Summary:
[INFO] 
[INFO] Apache Oltu - Parent .............................. FAILURE [26.704s]
[INFO] Apache Oltu - Commons ............................. SKIPPED
[INFO] Apache Oltu - Commons - Encoded Token ............. SKIPPED
[INFO] Apache Oltu - Commons - JSON ...................... SKIPPED
[INFO] Apache Oltu - OAuth 2.0 ........................... SKIPPED
[INFO] Apache Oltu - OAuth 2.0 - Common .................. SKIPPED
[INFO] Apache Oltu - OAuth 2.0 - Client .................. SKIPPED
[INFO] Apache Oltu - OAuth 2.0 - HttpClient .............. SKIPPED
[INFO] Apache Oltu - OAuth 2.0 - Dynamic Registration Common  SKIPPED
[INFO] Apache Oltu - OAuth 2.0 - Dynamic Registration Client  SKIPPED
[INFO] Apache Oltu - OAuth 2.0 - Authorization Server .... SKIPPED
[INFO] Apache Oltu - OAuth 2.0 - Resource Server ......... SKIPPED
[INFO] Apache Oltu - OAuth 2.0 - Resource Server Filter .. SKIPPED
[INFO] Apache Oltu - OAuth 2.0 - Test Utils .............. SKIPPED
[INFO] Apache Oltu - OAuth 2.0 - Dynamic Registration Server  SKIPPED
[INFO] Apache Oltu - OAuth 2.0 - Integration Tests ....... SKIPPED
[INFO] Apache Oltu - OAuth 2.0 - JWT ..................... SKIPPED
[INFO] Apache Oltu - OpenId Connect ...................... SKIPPED
[INFO] Apache Oltu - OpenId Connect - Common ............. SKIPPED
[INFO] Apache Oltu - OpenId Connect - Client ............. SKIPPED
[INFO] Apache Oltu - JOSE ................................ SKIPPED
[INFO] Apache Oltu - JOSE - JWS .......................... SKIPPED
[INFO] Apache Oltu - Demos - Parent ...................... SKIPPED
[INFO] Apache Oltu - Demos - Client ...................... SKIPPED
[INFO] Apache Oltu - Reactor ............................. SKIPPED
[INFO] ------------------------------------------------------------------------
[INFO] BUILD FAILURE
[INFO] ------------------------------------------------------------------------
[INFO] Total time: 34.550s
[INFO] Finished at: Tue Feb 23 01:33:30 UTC 2016
[INFO] Final Memory: 19M/200M
[INFO] ------------------------------------------------------------------------
Waiting for Jenkins to finish collecting data[ERROR] Failed to execute goal org.apache.maven.plugins:maven-deploy-plugin:2.8.1:deploy
(default-deploy) on project org.apache.oltu.parent: Failed to retrieve remote metadata org.apache.oltu:org.apache.oltu.parent:4-SNAPSHOT/maven-metadata.xml:
Could not transfer metadata org.apache.oltu:org.apache.oltu.parent:4-SNAPSHOT/maven-metadata.xml
from/to apache.snapshots.https (https://repository.apache.org/content/repositories/snapshots):
Error transferring file: java.lang.RuntimeException: Could not generate DH keypair: Prime
size must be multiple of 64, and can only range from 512 to 1024 (inclusive) -> [Help 1]
org.apache.maven.lifecycle.LifecycleExecutionException: Failed to execute goal org.apache.maven.plugins:maven-deploy-plugin:2.8.1:deploy
(default-deploy) on project org.apache.oltu.parent: Failed to retrieve remote metadata org.apache.oltu:org.apache.oltu.parent:4-SNAPSHOT/maven-metadata.xml:
Could not transfer metadata org.apache.oltu:org.apache.oltu.parent:4-SNAPSHOT/maven-metadata.xml
from/to apache.snapshots.https (https://repository.apache.org/content/repositories/snapshots):
Error transferring file: java.lang.RuntimeException: Could not generate DH keypair
	at org.apache.maven.lifecycle.internal.MojoExecutor.execute(MojoExecutor.java:217)
	at org.apache.maven.lifecycle.internal.MojoExecutor.execute(MojoExecutor.java:153)
	at org.apache.maven.lifecycle.internal.MojoExecutor.execute(MojoExecutor.java:145)
	at org.apache.maven.lifecycle.internal.LifecycleModuleBuilder.buildProject(LifecycleModuleBuilder.java:84)
	at org.apache.maven.lifecycle.internal.LifecycleModuleBuilder.buildProject(LifecycleModuleBuilder.java:59)
	at org.apache.maven.lifecycle.internal.LifecycleStarter.singleThreadedBuild(LifecycleStarter.java:183)
	at org.apache.maven.lifecycle.internal.LifecycleStarter.execute(LifecycleStarter.java:161)
	at org.apache.maven.DefaultMaven.doExecute(DefaultMaven.java:319)
	at org.apache.maven.DefaultMaven.execute(DefaultMaven.java:156)
	at org.jvnet.hudson.maven3.launcher.Maven3Launcher.main(Maven3Launcher.java:117)
	at sun.reflect.NativeMethodAccessorImpl.invoke0(Native Method)
	at sun.reflect.NativeMethodAccessorImpl.invoke(NativeMethodAccessorImpl.java:39)
	at sun.reflect.DelegatingMethodAccessorImpl.invoke(DelegatingMethodAccessorImpl.java:25)
	at java.lang.reflect.Method.invoke(Method.java:597)
	at org.codehaus.plexus.classworlds.launcher.Launcher.launchStandard(Launcher.java:329)
	at org.codehaus.plexus.classworlds.launcher.Launcher.launch(Launcher.java:239)
	at org.jvnet.hudson.maven3.agent.Maven3Main.launch(Maven3Main.java:181)
	at sun.reflect.NativeMethodAccessorImpl.invoke0(Native Method)
	at sun.reflect.NativeMethodAccessorImpl.invoke(NativeMethodAccessorImpl.java:39)
	at sun.reflect.DelegatingMethodAccessorImpl.invoke(DelegatingMethodAccessorImpl.java:25)
	at java.lang.reflect.Method.invoke(Method.java:597)
	at hudson.maven.Maven3Builder.call(Maven3Builder.java:136)
	at hudson.maven.Maven3Builder.call(Maven3Builder.java:71)
	at hudson.remoting.UserRequest.perform(UserRequest.java:121)
	at hudson.remoting.UserRequest.perform(UserRequest.java:49)
	at hudson.remoting.Request$2.run(Request.java:326)
	at hudson.remoting.InterceptingExecutorService$1.call(InterceptingExecutorService.java:68)
	at java.util.concurrent.FutureTask$Sync.innerRun(FutureTask.java:303)
	at java.util.concurrent.FutureTask.run(FutureTask.java:138)
	at java.util.concurrent.ThreadPoolExecutor$Worker.runTask(ThreadPoolExecutor.java:895)
	at java.util.concurrent.ThreadPoolExecutor$Worker.run(ThreadPoolExecutor.java:918)
	at java.lang.Thread.run(Thread.java:662)
Caused by: org.apache.maven.plugin.MojoExecutionException: Failed to retrieve remote metadata
org.apache.oltu:org.apache.oltu.parent:4-SNAPSHOT/maven-metadata.xml: Could not transfer metadata
org.apache.oltu:org.apache.oltu.parent:4-SNAPSHOT/maven-metadata.xml from/to apache.snapshots.https
(https://repository.apache.org/content/repositories/snapshots): Error transferring file: java.lang.RuntimeException:
Could not generate DH keypair
	at org.apache.maven.plugin.deploy.DeployMojo.deployProject(DeployMojo.java:282)
	at org.apache.maven.plugin.deploy.DeployMojo.execute(DeployMojo.java:169)
	at org.apache.maven.plugin.DefaultBuildPluginManager.executeMojo(DefaultBuildPluginManager.java:101)
	at org.apache.maven.lifecycle.internal.MojoExecutor.execute(MojoExecutor.java:209)
	... 31 more
Caused by: org.apache.maven.artifact.deployer.ArtifactDeploymentException: Failed to retrieve
remote metadata org.apache.oltu:org.apache.oltu.parent:4-SNAPSHOT/maven-metadata.xml: Could
not transfer metadata org.apache.oltu:org.apache.oltu.parent:4-SNAPSHOT/maven-metadata.xml
from/to apache.snapshots.https (https://repository.apache.org/content/repositories/snapshots):
Error transferring file: java.lang.RuntimeException: Could not generate DH keypair
	at org.apache.maven.artifact.deployer.DefaultArtifactDeployer.deploy(DefaultArtifactDeployer.java:141)
	at org.apache.maven.plugin.deploy.AbstractDeployMojo.deploy(AbstractDeployMojo.java:171)
	at org.apache.maven.plugin.deploy.DeployMojo.deployProject(DeployMojo.java:240)
	... 34 more
Caused by: org.sonatype.aether.deployment.DeploymentException: Failed to retrieve remote metadata
org.apache.oltu:org.apache.oltu.parent:4-SNAPSHOT/maven-metadata.xml: Could not transfer metadata
org.apache.oltu:org.apache.oltu.parent:4-SNAPSHOT/maven-metadata.xml from/to apache.snapshots.https
(https://repository.apache.org/content/repositories/snapshots): Error transferring file: java.lang.RuntimeException:
Could not generate DH keypair
	at org.sonatype.aether.impl.internal.DefaultDeployer.upload(DefaultDeployer.java:407)
	at org.sonatype.aether.impl.internal.DefaultDeployer.deploy(DefaultDeployer.java:260)
	at org.sonatype.aether.impl.internal.DefaultDeployer.deploy(DefaultDeployer.java:215)
	at org.sonatype.aether.impl.internal.DefaultRepositorySystem.deploy(DefaultRepositorySystem.java:480)
	at org.apache.maven.artifact.deployer.DefaultArtifactDeployer.deploy(DefaultArtifactDeployer.java:137)
	... 36 more
Caused by: org.sonatype.aether.transfer.MetadataTransferException: Could not transfer metadata
org.apache.oltu:org.apache.oltu.parent:4-SNAPSHOT/maven-metadata.xml from/to apache.snapshots.https
(https://repository.apache.org/content/repositories/snapshots): Error transferring file: java.lang.RuntimeException:
Could not generate DH keypair
	at org.sonatype.aether.connector.wagon.WagonRepositoryConnector$3.wrap(WagonRepositoryConnector.java:932)
	at org.sonatype.aether.connector.wagon.WagonRepositoryConnector$3.wrap(WagonRepositoryConnector.java:923)
	at org.sonatype.aether.connector.wagon.WagonRepositoryConnector$GetTask.flush(WagonRepositoryConnector.java:695)
	at org.sonatype.aether.connector.wagon.WagonRepositoryConnector$GetTask.flush(WagonRepositoryConnector.java:689)
	at org.sonatype.aether.connector.wagon.WagonRepositoryConnector.get(WagonRepositoryConnector.java:445)
	at org.sonatype.aether.impl.internal.DefaultDeployer.upload(DefaultDeployer.java:379)
	... 40 more
Caused by: org.apache.maven.wagon.TransferFailedException: Error transferring file: java.lang.RuntimeException:
Could not generate DH keypair
	at org.apache.maven.wagon.providers.http.LightweightHttpWagon.fillInputData(LightweightHttpWagon.java:143)
	at org.apache.maven.wagon.StreamWagon.getInputStream(StreamWagon.java:116)
	at org.apache.maven.wagon.StreamWagon.getIfNewer(StreamWagon.java:88)
	at org.apache.maven.wagon.StreamWagon.get(StreamWagon.java:61)
	at org.sonatype.aether.connector.wagon.WagonRepositoryConnector$GetTask.run(WagonRepositoryConnector.java:608)
	at org.sonatype.aether.util.concurrency.RunnableErrorForwarder$1.run(RunnableErrorForwarder.java:64)
	... 3 more
Caused by: javax.net.ssl.SSLException: java.lang.RuntimeException: Could not generate DH keypair
	at com.sun.net.ssl.internal.ssl.Alerts.getSSLException(Alerts.java:190)
	at com.sun.net.ssl.internal.ssl.SSLSocketImpl.fatal(SSLSocketImpl.java:1747)
	at com.sun.net.ssl.internal.ssl.SSLSocketImpl.fatal(SSLSocketImpl.java:1708)
	at com.sun.net.ssl.internal.ssl.SSLSocketImpl.handleException(SSLSocketImpl.java:1691)
	at com.sun.net.ssl.internal.ssl.SSLSocketImpl.startHandshake(SSLSocketImpl.java:1222)
	at com.sun.net.ssl.internal.ssl.SSLSocketImpl.startHandshake(SSLSocketImpl.java:1199)
	at sun.net.www.protocol.https.HttpsClient.afterConnect(HttpsClient.java:434)
	at sun.net.www.protocol.https.AbstractDelegateHttpsURLConnection.connect(AbstractDelegateHttpsURLConnection.java:166)
	at sun.net.www.protocol.http.HttpURLConnection.getInputStream(HttpURLConnection.java:1195)
	at java.net.HttpURLConnection.getResponseCode(HttpURLConnection.java:379)
	at sun.net.www.protocol.https.HttpsURLConnectionImpl.getResponseCode(HttpsURLConnectionImpl.java:318)
	at org.apache.maven.wagon.providers.http.LightweightHttpWagon.fillInputData(LightweightHttpWagon.java:115)
	... 8 more
Caused by: java.lang.RuntimeException: Could not generate DH keypair
	at com.sun.net.ssl.internal.ssl.DHCrypt.<init>(DHCrypt.java:114)
	at com.sun.net.ssl.internal.ssl.ClientHandshaker.serverKeyExchange(ClientHandshaker.java:559)
	at com.sun.net.ssl.internal.ssl.ClientHandshaker.processMessage(ClientHandshaker.java:186)
	at com.sun.net.ssl.internal.ssl.Handshaker.processLoop(Handshaker.java:593)
	at com.sun.net.ssl.internal.ssl.Handshaker.process_record(Handshaker.java:529)
	at com.sun.net.ssl.internal.ssl.SSLSocketImpl.readRecord(SSLSocketImpl.java:943)
	at com.sun.net.ssl.internal.ssl.SSLSocketImpl.performInitialHandshake(SSLSocketImpl.java:1188)
	at com.sun.net.ssl.internal.ssl.SSLSocketImpl.startHandshake(SSLSocketImpl.java:1215)
	... 15 more
Caused by: java.security.InvalidAlgorithmParameterException: Prime size must be multiple of
64, and can only range from 512 to 1024 (inclusive)
	at com.sun.crypto.provider.DHKeyPairGenerator.initialize(DashoA13*..)
	at java.security.KeyPairGenerator$Delegate.initialize(KeyPairGenerator.java:627)
	at com.sun.net.ssl.internal.ssl.DHCrypt.<init>(DHCrypt.java:107)
	... 22 more
[ERROR] 
[ERROR] Re-run Maven using the -X switch to enable full debug logging.
[ERROR] 
[ERROR] For more information about the errors and possible solutions, please read the following
articles:
[ERROR] [Help 1] http://cwiki.apache.org/confluence/display/MAVEN/MojoExecutionException

[JENKINS] Archiving <https://builds.apache.org/job/Oltu/ws/trunk/oauth-2.0/integration-tests/pom.xml>
to org.apache.oltu.oauth2/org.apache.oltu.oauth2.integration-tests/1.0.2-SNAPSHOT/org.apache.oltu.oauth2.integration-tests-1.0.2-SNAPSHOT.pom
[JENKINS] Archiving <https://builds.apache.org/job/Oltu/ws/trunk/parent/pom.xml> to
org.apache.oltu/org.apache.oltu.parent/4-SNAPSHOT/org.apache.oltu.parent-4-SNAPSHOT.pom
[JENKINS] Archiving <https://builds.apache.org/job/Oltu/ws/trunk/parent/target/org.apache.oltu.parent-4-SNAPSHOT-site.xml>
to org.apache.oltu/org.apache.oltu.parent/4-SNAPSHOT/org.apache.oltu.parent-4-SNAPSHOT-site.xml
[JENKINS] Archiving <https://builds.apache.org/job/Oltu/ws/trunk/oauth-2.0/authzserver/pom.xml>
to org.apache.oltu.oauth2/org.apache.oltu.oauth2.authzserver/1.0.2-SNAPSHOT/org.apache.oltu.oauth2.authzserver-1.0.2-SNAPSHOT.pom
[JENKINS] Archiving <https://builds.apache.org/job/Oltu/ws/trunk/oauth-2.0/jwt/pom.xml>
to org.apache.oltu.oauth2/org.apache.oltu.oauth2.jwt/1.0.2-SNAPSHOT/org.apache.oltu.oauth2.jwt-1.0.2-SNAPSHOT.pom
[JENKINS] Archiving <https://builds.apache.org/job/Oltu/ws/trunk/oauth-2.0/resourceserver-filter/pom.xml>
to org.apache.oltu.oauth2/org.apache.oltu.oauth2.resourceserver-filter/1.0.2-SNAPSHOT/org.apache.oltu.oauth2.resourceserver-filter-1.0.2-SNAPSHOT.pom
[JENKINS] Archiving <https://builds.apache.org/job/Oltu/ws/trunk/oauth-2.0/dynamicreg-client/pom.xml>
to org.apache.oltu.oauth2/org.apache.oltu.oauth2.dynamicreg.client/1.0.2-SNAPSHOT/org.apache.oltu.oauth2.dynamicreg.client-1.0.2-SNAPSHOT.pom
[JENKINS] Archiving <https://builds.apache.org/job/Oltu/ws/trunk/commons/encodedtoken/pom.xml>
to org.apache.oltu.commons/org.apache.oltu.commons.encodedtoken/1.0.1-SNAPSHOT/org.apache.oltu.commons.encodedtoken-1.0.1-SNAPSHOT.pom
[JENKINS] Archiving <https://builds.apache.org/job/Oltu/ws/trunk/commons/json/pom.xml>
to org.apache.oltu.commons/org.apache.oltu.commons.json/1.0.1-SNAPSHOT/org.apache.oltu.commons.json-1.0.1-SNAPSHOT.pom
[JENKINS] Archiving <https://builds.apache.org/job/Oltu/ws/trunk/demos/client-demo/pom.xml>
to org.apache.oltu.demos/org.apache.oltu.demos.client/1-SNAPSHOT/org.apache.oltu.demos.client-1-SNAPSHOT.pom
[JENKINS] Archiving <https://builds.apache.org/job/Oltu/ws/trunk/oauth-2.0/httpclient4/pom.xml>
to org.apache.oltu.oauth2/org.apache.oltu.oauth2.httpclient4/1.0.2-SNAPSHOT/org.apache.oltu.oauth2.httpclient4-1.0.2-SNAPSHOT.pom
[JENKINS] Archiving <https://builds.apache.org/job/Oltu/ws/trunk/oauth-2.0/dynamicreg-common/pom.xml>
to org.apache.oltu.oauth2/org.apache.oltu.oauth2.dynamicreg.common/1.0.2-SNAPSHOT/org.apache.oltu.oauth2.dynamicreg.common-1.0.2-SNAPSHOT.pom
[JENKINS] Archiving <https://builds.apache.org/job/Oltu/ws/trunk/oauth-2.0/resourceserver/pom.xml>
to org.apache.oltu.oauth2/org.apache.oltu.oauth2.resourceserver/1.0.2-SNAPSHOT/org.apache.oltu.oauth2.resourceserver-1.0.2-SNAPSHOT.pom
[JENKINS] Archiving <https://builds.apache.org/job/Oltu/ws/trunk/oauth-2.0/client/pom.xml>
to org.apache.oltu.oauth2/org.apache.oltu.oauth2.client/1.0.2-SNAPSHOT/org.apache.oltu.oauth2.client-1.0.2-SNAPSHOT.pom
[JENKINS] Archiving <https://builds.apache.org/job/Oltu/ws/trunk/openid-connect/pom.xml>
to org.apache.oltu.openidconnect/org.apache.oltu.openidconnect.parent/1-SNAPSHOT/org.apache.oltu.openidconnect.parent-1-SNAPSHOT.pom
[JENKINS] Archiving <https://builds.apache.org/job/Oltu/ws/trunk/jose/pom.xml> to org.apache.oltu.jose/org.apache.oltu.jose.parent/2-SNAPSHOT/org.apache.oltu.jose.parent-2-SNAPSHOT.pom
[JENKINS] Archiving <https://builds.apache.org/job/Oltu/ws/trunk/openid-connect/common/pom.xml>
to org.apache.oltu.openidconnect/org.apache.oltu.openidconnect.common/0.0.1-SNAPSHOT/org.apache.oltu.openidconnect.common-0.0.1-SNAPSHOT.pom
[JENKINS] Archiving <https://builds.apache.org/job/Oltu/ws/trunk/oauth-2.0/dynamicreg-server/pom.xml>
to org.apache.oltu.oauth2/org.apache.oltu.oauth2.dynamicreg.server/1.0.2-SNAPSHOT/org.apache.oltu.oauth2.dynamicreg.server-1.0.2-SNAPSHOT.pom
[JENKINS] Archiving <https://builds.apache.org/job/Oltu/ws/trunk/demos/pom.xml> to org.apache.oltu.demos/org.apache.oltu.demos.parent/1-SNAPSHOT/org.apache.oltu.demos.parent-1-SNAPSHOT.pom
[JENKINS] Archiving <https://builds.apache.org/job/Oltu/ws/trunk/jose/jws/pom.xml> to
org.apache.oltu.jose/org.apache.oltu.jose.jws/1.0.1-SNAPSHOT/org.apache.oltu.jose.jws-1.0.1-SNAPSHOT.pom
[JENKINS] Archiving <https://builds.apache.org/job/Oltu/ws/trunk/oauth-2.0/pom.xml>
to org.apache.oltu.oauth2/org.apache.oltu.oauth2.parent/1.0.2-SNAPSHOT/org.apache.oltu.oauth2.parent-1.0.2-SNAPSHOT.pom
[JENKINS] Archiving <https://builds.apache.org/job/Oltu/ws/trunk/commons/pom.xml> to
org.apache.oltu.commons/org.apache.oltu.commons.parent/2-SNAPSHOT/org.apache.oltu.commons.parent-2-SNAPSHOT.pom
[JENKINS] Archiving <https://builds.apache.org/job/Oltu/ws/trunk/openid-connect/client/pom.xml>
to org.apache.oltu.openidconnect/org.apache.oltu.openidconnect.client/0.0.1-SNAPSHOT/org.apache.oltu.openidconnect.client-0.0.1-SNAPSHOT.pom
[JENKINS] Archiving <https://builds.apache.org/job/Oltu/ws/trunk/pom.xml> to org.apache.oltu/org.apache.oltu.reactor/1-SNAPSHOT/org.apache.oltu.reactor-1-SNAPSHOT.pom
[JENKINS] Archiving <https://builds.apache.org/job/Oltu/ws/trunk/oauth-2.0/test-utils/pom.xml>
to org.apache.oltu.oauth2/org.apache.oltu.oauth2.test-utils/1.0.2-SNAPSHOT/org.apache.oltu.oauth2.test-utils-1.0.2-SNAPSHOT.pom
[JENKINS] Archiving <https://builds.apache.org/job/Oltu/ws/trunk/oauth-2.0/common/pom.xml>
to org.apache.oltu.oauth2/org.apache.oltu.oauth2.common/1.0.2-SNAPSHOT/org.apache.oltu.oauth2.common-1.0.2-SNAPSHOT.pom
Sending e-mails to: dev@oltu.apache.org
channel stopped

Mime
View raw message