oltu-dev mailing list archives

Site index · List index
Message view « Date » · « Thread »
Top « Date » · « Thread »
From Apache Jenkins Server <jenk...@builds.apache.org>
Subject Build failed in Jenkins: Oltu-OpenID-Conect » Apache Oltu - OpenId Connect #106
Date Mon, 15 Feb 2016 11:12:09 GMT
See <https://builds.apache.org/job/Oltu-OpenID-Conect/org.apache.oltu.openidconnect$org.apache.oltu.openidconnect.parent/106/>

------------------------------------------
[...truncated 229 lines...]
Downloading: http://repo1.maven.org/maven2/avalon-framework/avalon-framework/4.1.3/avalon-framework-4.1.3.pom
Downloaded: http://repo1.maven.org/maven2/avalon-framework/avalon-framework/4.1.3/avalon-framework-4.1.3.pom
(167 B at 2.4 KB/sec)
Downloading: http://repo1.maven.org/maven2/javax/servlet/servlet-api/2.3/servlet-api-2.3.pom
Downloaded: http://repo1.maven.org/maven2/javax/servlet/servlet-api/2.3/servlet-api-2.3.pom
(156 B at 2.3 KB/sec)
Downloading: http://repo1.maven.org/maven2/commons-chain/commons-chain/1.1/commons-chain-1.1.pom
Downloaded: http://repo1.maven.org/maven2/commons-chain/commons-chain/1.1/commons-chain-1.1.pom
(6 KB at 89.0 KB/sec)
Downloading: http://repo1.maven.org/maven2/commons-digester/commons-digester/1.6/commons-digester-1.6.pom
Downloaded: http://repo1.maven.org/maven2/commons-digester/commons-digester/1.6/commons-digester-1.6.pom
(974 B at 14.2 KB/sec)
Downloading: http://repo1.maven.org/maven2/commons-beanutils/commons-beanutils/1.6/commons-beanutils-1.6.pom
Downloaded: http://repo1.maven.org/maven2/commons-beanutils/commons-beanutils/1.6/commons-beanutils-1.6.pom
(3 KB at 34.2 KB/sec)
Downloading: http://repo1.maven.org/maven2/commons-logging/commons-logging/1.0/commons-logging-1.0.pom
Downloaded: http://repo1.maven.org/maven2/commons-logging/commons-logging/1.0/commons-logging-1.0.pom
(163 B at 2.4 KB/sec)
Downloading: http://repo1.maven.org/maven2/commons-collections/commons-collections/2.0/commons-collections-2.0.pom
Downloaded: http://repo1.maven.org/maven2/commons-collections/commons-collections/2.0/commons-collections-2.0.pom
(171 B at 2.5 KB/sec)
Downloading: http://repo1.maven.org/maven2/commons-collections/commons-collections/2.1/commons-collections-2.1.pom
Downloaded: http://repo1.maven.org/maven2/commons-collections/commons-collections/2.1/commons-collections-2.1.pom
(4 KB at 48.6 KB/sec)
Downloading: http://repo1.maven.org/maven2/xml-apis/xml-apis/1.0.b2/xml-apis-1.0.b2.pom
Downloaded: http://repo1.maven.org/maven2/xml-apis/xml-apis/1.0.b2/xml-apis-1.0.b2.pom (3
KB at 33.3 KB/sec)
Downloading: http://repo1.maven.org/maven2/commons-collections/commons-collections/3.2/commons-collections-3.2.pom
Downloaded: http://repo1.maven.org/maven2/commons-collections/commons-collections/3.2/commons-collections-3.2.pom
(11 KB at 158.5 KB/sec)
Downloading: http://repo1.maven.org/maven2/commons-validator/commons-validator/1.3.1/commons-validator-1.3.1.pom
Downloaded: http://repo1.maven.org/maven2/commons-validator/commons-validator/1.3.1/commons-validator-1.3.1.pom
(9 KB at 129.6 KB/sec)
Downloading: http://repo1.maven.org/maven2/commons-logging/commons-logging/1.0.4/commons-logging-1.0.4.pom
Downloaded: http://repo1.maven.org/maven2/commons-logging/commons-logging/1.0.4/commons-logging-1.0.4.pom
(6 KB at 76.7 KB/sec)
Downloading: http://repo1.maven.org/maven2/dom4j/dom4j/1.1/dom4j-1.1.pom
Downloaded: http://repo1.maven.org/maven2/dom4j/dom4j/1.1/dom4j-1.1.pom (142 B at 2.1 KB/sec)
Downloading: http://repo1.maven.org/maven2/sslext/sslext/1.2-0/sslext-1.2-0.pom
Downloaded: http://repo1.maven.org/maven2/sslext/sslext/1.2-0/sslext-1.2-0.pom (653 B at 9.7
KB/sec)
Downloading: http://repo1.maven.org/maven2/org/apache/struts/struts-core/1.3.8/struts-core-1.3.8.pom
Downloaded: http://repo1.maven.org/maven2/org/apache/struts/struts-core/1.3.8/struts-core-1.3.8.pom
(5 KB at 62.8 KB/sec)
Downloading: http://repo1.maven.org/maven2/org/apache/struts/struts-parent/1.3.8/struts-parent-1.3.8.pom
Downloaded: http://repo1.maven.org/maven2/org/apache/struts/struts-parent/1.3.8/struts-parent-1.3.8.pom
(10 KB at 143.4 KB/sec)
Downloading: http://repo1.maven.org/maven2/org/apache/struts/struts-master/4/struts-master-4.pom
Downloaded: http://repo1.maven.org/maven2/org/apache/struts/struts-master/4/struts-master-4.pom
(12 KB at 172.4 KB/sec)
Downloading: http://repo1.maven.org/maven2/org/apache/apache/2/apache-2.pom
Downloaded: http://repo1.maven.org/maven2/org/apache/apache/2/apache-2.pom (4 KB at 50.4 KB/sec)
Downloading: http://repo1.maven.org/maven2/antlr/antlr/2.7.2/antlr-2.7.2.pom
Downloaded: http://repo1.maven.org/maven2/antlr/antlr/2.7.2/antlr-2.7.2.pom (145 B at 2.1
KB/sec)
Downloading: http://repo1.maven.org/maven2/org/apache/struts/struts-taglib/1.3.8/struts-taglib-1.3.8.pom
Downloaded: http://repo1.maven.org/maven2/org/apache/struts/struts-taglib/1.3.8/struts-taglib-1.3.8.pom
(4 KB at 44.8 KB/sec)
Downloading: http://repo1.maven.org/maven2/org/apache/struts/struts-tiles/1.3.8/struts-tiles-1.3.8.pom
Downloaded: http://repo1.maven.org/maven2/org/apache/struts/struts-tiles/1.3.8/struts-tiles-1.3.8.pom
(3 KB at 43.0 KB/sec)
Downloading: http://repo1.maven.org/maven2/org/apache/velocity/velocity/1.6.2/velocity-1.6.2.pom
Downloaded: http://repo1.maven.org/maven2/org/apache/velocity/velocity/1.6.2/velocity-1.6.2.pom
(11 KB at 154.8 KB/sec)
Downloading: http://repo1.maven.org/maven2/org/apache/maven/doxia/doxia-integration-tools/1.6/doxia-integration-tools-1.6.pom
Downloaded: http://repo1.maven.org/maven2/org/apache/maven/doxia/doxia-integration-tools/1.6/doxia-integration-tools-1.6.pom
(7 KB at 101.4 KB/sec)
Downloading: http://repo1.maven.org/maven2/org/apache/maven/doxia/doxia-tools/3/doxia-tools-3.pom
Downloaded: http://repo1.maven.org/maven2/org/apache/maven/doxia/doxia-tools/3/doxia-tools-3.pom
(10 KB at 146.9 KB/sec)
Downloading: http://repo1.maven.org/maven2/org/apache/maven/maven-archiver/2.5/maven-archiver-2.5.jar
Downloading: http://repo1.maven.org/maven2/org/codehaus/plexus/plexus-interpolation/1.15/plexus-interpolation-1.15.jar
Downloading: http://repo1.maven.org/maven2/org/apache/commons/commons-compress/1.5/commons-compress-1.5.jar
Downloading: http://repo1.maven.org/maven2/org/codehaus/plexus/plexus-io/2.0.10/plexus-io-2.0.10.jar
Downloading: http://repo1.maven.org/maven2/org/codehaus/plexus/plexus-archiver/2.4.4/plexus-archiver-2.4.4.jar
Downloaded: http://repo1.maven.org/maven2/org/apache/maven/maven-archiver/2.5/maven-archiver-2.5.jar
(22 KB at 287.9 KB/sec)
Downloading: http://repo1.maven.org/maven2/org/tukaani/xz/1.2/xz-1.2.jar
Downloaded: http://repo1.maven.org/maven2/org/tukaani/xz/1.2/xz-1.2.jar (93 KB at 1341.9 KB/sec)
Downloading: http://repo1.maven.org/maven2/org/apache/maven/doxia/doxia-core/1.6/doxia-core-1.6.jar
Downloaded: http://repo1.maven.org/maven2/org/codehaus/plexus/plexus-io/2.0.10/plexus-io-2.0.10.jar
(58 KB at 365.6 KB/sec)
Downloading: http://repo1.maven.org/maven2/commons-logging/commons-logging/1.1.1/commons-logging-1.1.1.jar
Downloaded: http://repo1.maven.org/maven2/org/codehaus/plexus/plexus-interpolation/1.15/plexus-interpolation-1.15.jar
(60 KB at 366.8 KB/sec)
Downloading: http://repo1.maven.org/maven2/xmlunit/xmlunit/1.5/xmlunit-1.5.jar
Downloaded: http://repo1.maven.org/maven2/org/apache/maven/doxia/doxia-core/1.6/doxia-core-1.6.jar
(159 KB at 2229.4 KB/sec)
Downloading: http://repo1.maven.org/maven2/org/apache/maven/reporting/maven-reporting-exec/1.2/maven-reporting-exec-1.2.jar
Downloaded: http://repo1.maven.org/maven2/org/codehaus/plexus/plexus-archiver/2.4.4/plexus-archiver-2.4.4.jar
(161 KB at 829.6 KB/sec)
Downloading: http://repo1.maven.org/maven2/org/apache/maven/shared/maven-shared-utils/0.3/maven-shared-utils-0.3.jar
Downloaded: http://repo1.maven.org/maven2/org/apache/commons/commons-compress/1.5/commons-compress-1.5.jar
(251 KB at 1102.4 KB/sec)
Downloading: http://repo1.maven.org/maven2/org/apache/maven/doxia/doxia-sink-api/1.6/doxia-sink-api-1.6.jar
Downloaded: http://repo1.maven.org/maven2/org/apache/maven/reporting/maven-reporting-exec/1.2/maven-reporting-exec-1.2.jar
(27 KB at 395.7 KB/sec)
Downloading: http://repo1.maven.org/maven2/org/apache/maven/doxia/doxia-logging-api/1.6/doxia-logging-api-1.6.jar
Downloaded: http://repo1.maven.org/maven2/commons-logging/commons-logging/1.1.1/commons-logging-1.1.1.jar
(60 KB at 617.3 KB/sec)
Downloaded: http://repo1.maven.org/maven2/xmlunit/xmlunit/1.5/xmlunit-1.5.jar (96 KB at 1014.6
KB/sec)
Downloading: http://repo1.maven.org/maven2/org/apache/maven/doxia/doxia-module-xhtml/1.6/doxia-module-xhtml-1.6.jar
Downloading: http://repo1.maven.org/maven2/org/apache/maven/doxia/doxia-module-apt/1.6/doxia-module-apt-1.6.jar
Downloaded: http://repo1.maven.org/maven2/org/apache/maven/doxia/doxia-sink-api/1.6/doxia-sink-api-1.6.jar
(11 KB at 163.4 KB/sec)
Downloaded: http://repo1.maven.org/maven2/org/apache/maven/shared/maven-shared-utils/0.3/maven-shared-utils-0.3.jar
(152 KB at 1547.7 KB/sec)
Downloading: http://repo1.maven.org/maven2/org/apache/maven/doxia/doxia-module-xdoc/1.6/doxia-module-xdoc-1.6.jar
Downloading: http://repo1.maven.org/maven2/org/apache/maven/doxia/doxia-module-fml/1.6/doxia-module-fml-1.6.jar
Downloaded: http://repo1.maven.org/maven2/org/apache/maven/doxia/doxia-logging-api/1.6/doxia-logging-api-1.6.jar
(12 KB at 167.6 KB/sec)
Downloading: http://repo1.maven.org/maven2/org/apache/maven/doxia/doxia-module-markdown/1.6/doxia-module-markdown-1.6.jar
Downloaded: http://repo1.maven.org/maven2/org/apache/maven/doxia/doxia-module-xhtml/1.6/doxia-module-xhtml-1.6.jar
(16 KB at 240.7 KB/sec)
Downloading: http://repo1.maven.org/maven2/org/pegdown/pegdown/1.2.1/pegdown-1.2.1.jar
Downloaded: http://repo1.maven.org/maven2/org/apache/maven/doxia/doxia-module-apt/1.6/doxia-module-apt-1.6.jar
(52 KB at 780.5 KB/sec)
Downloading: http://repo1.maven.org/maven2/org/parboiled/parboiled-java/1.1.4/parboiled-java-1.1.4.jar
Downloaded: http://repo1.maven.org/maven2/org/apache/maven/doxia/doxia-module-xdoc/1.6/doxia-module-xdoc-1.6.jar
(37 KB at 543.7 KB/sec)
Downloading: http://repo1.maven.org/maven2/org/parboiled/parboiled-core/1.1.4/parboiled-core-1.1.4.jar
Downloaded: http://repo1.maven.org/maven2/org/apache/maven/doxia/doxia-module-fml/1.6/doxia-module-fml-1.6.jar
(38 KB at 552.6 KB/sec)
Downloading: http://repo1.maven.org/maven2/org/ow2/asm/asm/4.1/asm-4.1.jar
Downloaded: http://repo1.maven.org/maven2/org/apache/maven/doxia/doxia-module-markdown/1.6/doxia-module-markdown-1.6.jar
(15 KB at 214.1 KB/sec)
Downloading: http://repo1.maven.org/maven2/org/ow2/asm/asm-tree/4.1/asm-tree-4.1.jar
Downloaded: http://repo1.maven.org/maven2/org/parboiled/parboiled-java/1.1.4/parboiled-java-1.1.4.jar
(72 KB at 1099.5 KB/sec)
Downloaded: http://repo1.maven.org/maven2/org/pegdown/pegdown/1.2.1/pegdown-1.2.1.jar (58
KB at 867.2 KB/sec)
Downloading: http://repo1.maven.org/maven2/org/ow2/asm/asm-analysis/4.1/asm-analysis-4.1.jar
Downloading: http://repo1.maven.org/maven2/org/ow2/asm/asm-util/4.1/asm-util-4.1.jar
Downloaded: http://repo1.maven.org/maven2/org/ow2/asm/asm/4.1/asm-4.1.jar (47 KB at 680.1
KB/sec)
Downloading: http://repo1.maven.org/maven2/org/apache/maven/doxia/doxia-decoration-model/1.6/doxia-decoration-model-1.6.jar
Downloaded: http://repo1.maven.org/maven2/org/ow2/asm/asm-tree/4.1/asm-tree-4.1.jar (22 KB
at 323.0 KB/sec)
Downloading: http://repo1.maven.org/maven2/org/apache/maven/doxia/doxia-site-renderer/1.6/doxia-site-renderer-1.6.jar
Downloaded: http://repo1.maven.org/maven2/org/ow2/asm/asm-analysis/4.1/asm-analysis-4.1.jar
(20 KB at 302.3 KB/sec)
Downloading: http://repo1.maven.org/maven2/org/apache/velocity/velocity-tools/2.0/velocity-tools-2.0.jar
Downloaded: http://repo1.maven.org/maven2/org/ow2/asm/asm-util/4.1/asm-util-4.1.jar (37 KB
at 564.9 KB/sec)
Downloading: http://repo1.maven.org/maven2/commons-beanutils/commons-beanutils/1.7.0/commons-beanutils-1.7.0.jar
Downloaded: http://repo1.maven.org/maven2/org/parboiled/parboiled-core/1.1.4/parboiled-core-1.1.4.jar
(181 KB at 1861.9 KB/sec)
Downloading: http://repo1.maven.org/maven2/commons-digester/commons-digester/1.8/commons-digester-1.8.jar
Downloaded: http://repo1.maven.org/maven2/org/apache/maven/doxia/doxia-decoration-model/1.6/doxia-decoration-model-1.6.jar
(56 KB at 816.4 KB/sec)
Downloading: http://repo1.maven.org/maven2/commons-chain/commons-chain/1.1/commons-chain-1.1.jar
Downloaded: http://repo1.maven.org/maven2/org/apache/maven/doxia/doxia-site-renderer/1.6/doxia-site-renderer-1.6.jar
(56 KB at 810.0 KB/sec)
Downloading: http://repo1.maven.org/maven2/commons-validator/commons-validator/1.3.1/commons-validator-1.3.1.jar
Downloaded: http://repo1.maven.org/maven2/commons-digester/commons-digester/1.8/commons-digester-1.8.jar
(141 KB at 2032.4 KB/sec)
Downloading: http://repo1.maven.org/maven2/dom4j/dom4j/1.1/dom4j-1.1.jar
Downloaded: http://repo1.maven.org/maven2/commons-beanutils/commons-beanutils/1.7.0/commons-beanutils-1.7.0.jar
(185 KB at 1919.3 KB/sec)
Downloading: http://repo1.maven.org/maven2/sslext/sslext/1.2-0/sslext-1.2-0.jar
Downloaded: http://repo1.maven.org/maven2/commons-chain/commons-chain/1.1/commons-chain-1.1.jar
(88 KB at 1255.6 KB/sec)
Downloading: http://repo1.maven.org/maven2/org/apache/struts/struts-core/1.3.8/struts-core-1.3.8.jar
Downloaded: http://repo1.maven.org/maven2/commons-validator/commons-validator/1.3.1/commons-validator-1.3.1.jar
(136 KB at 1938.6 KB/sec)
Downloading: http://repo1.maven.org/maven2/antlr/antlr/2.7.2/antlr-2.7.2.jar
Downloaded: http://repo1.maven.org/maven2/org/apache/velocity/velocity-tools/2.0/velocity-tools-2.0.jar
(339 KB at 2583.6 KB/sec)
Downloading: http://repo1.maven.org/maven2/org/apache/struts/struts-taglib/1.3.8/struts-taglib-1.3.8.jar
Downloaded: http://repo1.maven.org/maven2/sslext/sslext/1.2-0/sslext-1.2-0.jar (26 KB at 400.0
KB/sec)
Downloading: http://repo1.maven.org/maven2/org/apache/struts/struts-tiles/1.3.8/struts-tiles-1.3.8.jar
Downloaded: http://repo1.maven.org/maven2/dom4j/dom4j/1.1/dom4j-1.1.jar (447 KB at 4374.6
KB/sec)
Downloading: http://repo1.maven.org/maven2/org/apache/maven/doxia/doxia-integration-tools/1.6/doxia-integration-tools-1.6.jar
Downloaded: http://repo1.maven.org/maven2/org/apache/struts/struts-core/1.3.8/struts-core-1.3.8.jar
(322 KB at 3088.3 KB/sec)
Downloaded: http://repo1.maven.org/maven2/org/apache/struts/struts-taglib/1.3.8/struts-taglib-1.3.8.jar
(246 KB at 2613.0 KB/sec)
Downloaded: http://repo1.maven.org/maven2/org/apache/struts/struts-tiles/1.3.8/struts-tiles-1.3.8.jar
(117 KB at 1770.4 KB/sec)
Downloaded: http://repo1.maven.org/maven2/antlr/antlr/2.7.2/antlr-2.7.2.jar (350 KB at 3464.1
KB/sec)
Downloaded: http://repo1.maven.org/maven2/org/apache/maven/doxia/doxia-integration-tools/1.6/doxia-integration-tools-1.6.jar
(44 KB at 660.4 KB/sec)
[INFO] 
[INFO] --- maven-install-plugin:2.5.1:install (default-install) @ org.apache.oltu.openidconnect.parent
---
[INFO] Installing <https://builds.apache.org/job/Oltu-OpenID-Conect/org.apache.oltu.openidconnect$org.apache.oltu.openidconnect.parent/ws/pom.xml>
to /home/jenkins/jenkins-slave/workspace/Oltu-OpenID-Conect/.repository/org/apache/oltu/openidconnect/org.apache.oltu.openidconnect.parent/1-SNAPSHOT/org.apache.oltu.openidconnect.parent-1-SNAPSHOT.pom
[INFO] 
[INFO] --- maven-deploy-plugin:2.8.1:deploy (default-deploy) @ org.apache.oltu.openidconnect.parent
---
Downloading: https://repository.apache.org/content/repositories/snapshots/org/apache/oltu/openidconnect/org.apache.oltu.openidconnect.parent/1-SNAPSHOT/maven-metadata.xml
[WARNING] Could not transfer metadata org.apache.oltu.openidconnect:org.apache.oltu.openidconnect.parent:1-SNAPSHOT/maven-metadata.xml
from/to apache.snapshots.https (https://repository.apache.org/content/repositories/snapshots):
Error transferring file: java.lang.RuntimeException: Could not generate DH keypair
[INFO] ------------------------------------------------------------------------
[INFO] Reactor Summary:
[INFO] 
[INFO] Apache Oltu - OpenId Connect ...................... FAILURE [18.277s]
[INFO] Apache Oltu - OpenId Connect - Common ............. SKIPPED
[INFO] Apache Oltu - OpenId Connect - Client ............. SKIPPED
[INFO] ------------------------------------------------------------------------
[INFO] BUILD FAILURE
[INFO] ------------------------------------------------------------------------
[INFO] Total time: 21.141s
[INFO] Finished at: Mon Feb 15 11:05:40 UTC 2016
[INFO] Final Memory: 16M/207M
[INFO] ------------------------------------------------------------------------
Waiting for Jenkins to finish collecting data[ERROR] Failed to execute goal org.apache.maven.plugins:maven-deploy-plugin:2.8.1:deploy
(default-deploy) on project org.apache.oltu.openidconnect.parent: Failed to retrieve remote
metadata org.apache.oltu.openidconnect:org.apache.oltu.openidconnect.parent:1-SNAPSHOT/maven-metadata.xml:
Could not transfer metadata org.apache.oltu.openidconnect:org.apache.oltu.openidconnect.parent:1-SNAPSHOT/maven-metadata.xml
from/to apache.snapshots.https (https://repository.apache.org/content/repositories/snapshots):
Error transferring file: java.lang.RuntimeException: Could not generate DH keypair: Prime
size must be multiple of 64, and can only range from 512 to 1024 (inclusive) -> [Help 1]
org.apache.maven.lifecycle.LifecycleExecutionException: Failed to execute goal org.apache.maven.plugins:maven-deploy-plugin:2.8.1:deploy
(default-deploy) on project org.apache.oltu.openidconnect.parent: Failed to retrieve remote
metadata org.apache.oltu.openidconnect:org.apache.oltu.openidconnect.parent:1-SNAPSHOT/maven-metadata.xml:
Could not transfer metadata org.apache.oltu.openidconnect:org.apache.oltu.openidconnect.parent:1-SNAPSHOT/maven-metadata.xml
from/to apache.snapshots.https (https://repository.apache.org/content/repositories/snapshots):
Error transferring file: java.lang.RuntimeException: Could not generate DH keypair
	at org.apache.maven.lifecycle.internal.MojoExecutor.execute(MojoExecutor.java:217)
	at org.apache.maven.lifecycle.internal.MojoExecutor.execute(MojoExecutor.java:153)
	at org.apache.maven.lifecycle.internal.MojoExecutor.execute(MojoExecutor.java:145)
	at org.apache.maven.lifecycle.internal.LifecycleModuleBuilder.buildProject(LifecycleModuleBuilder.java:84)
	at org.apache.maven.lifecycle.internal.LifecycleModuleBuilder.buildProject(LifecycleModuleBuilder.java:59)
	at org.apache.maven.lifecycle.internal.LifecycleStarter.singleThreadedBuild(LifecycleStarter.java:183)
	at org.apache.maven.lifecycle.internal.LifecycleStarter.execute(LifecycleStarter.java:161)
	at org.apache.maven.DefaultMaven.doExecute(DefaultMaven.java:319)
	at org.apache.maven.DefaultMaven.execute(DefaultMaven.java:156)
	at org.jvnet.hudson.maven3.launcher.Maven3Launcher.main(Maven3Launcher.java:117)
	at sun.reflect.NativeMethodAccessorImpl.invoke0(Native Method)
	at sun.reflect.NativeMethodAccessorImpl.invoke(NativeMethodAccessorImpl.java:39)
	at sun.reflect.DelegatingMethodAccessorImpl.invoke(DelegatingMethodAccessorImpl.java:25)
	at java.lang.reflect.Method.invoke(Method.java:597)
	at org.codehaus.plexus.classworlds.launcher.Launcher.launchStandard(Launcher.java:329)
	at org.codehaus.plexus.classworlds.launcher.Launcher.launch(Launcher.java:239)
	at org.jvnet.hudson.maven3.agent.Maven3Main.launch(Maven3Main.java:181)
	at sun.reflect.NativeMethodAccessorImpl.invoke0(Native Method)
	at sun.reflect.NativeMethodAccessorImpl.invoke(NativeMethodAccessorImpl.java:39)
	at sun.reflect.DelegatingMethodAccessorImpl.invoke(DelegatingMethodAccessorImpl.java:25)
	at java.lang.reflect.Method.invoke(Method.java:597)
	at hudson.maven.Maven3Builder.call(Maven3Builder.java:136)
	at hudson.maven.Maven3Builder.call(Maven3Builder.java:71)
	at hudson.remoting.UserRequest.perform(UserRequest.java:121)
	at hudson.remoting.UserRequest.perform(UserRequest.java:49)
	at hudson.remoting.Request$2.run(Request.java:326)
	at hudson.remoting.InterceptingExecutorService$1.call(InterceptingExecutorService.java:68)
	at java.util.concurrent.FutureTask$Sync.innerRun(FutureTask.java:303)
	at java.util.concurrent.FutureTask.run(FutureTask.java:138)
	at java.util.concurrent.ThreadPoolExecutor$Worker.runTask(ThreadPoolExecutor.java:895)
	at java.util.concurrent.ThreadPoolExecutor$Worker.run(ThreadPoolExecutor.java:918)
	at java.lang.Thread.run(Thread.java:662)
Caused by: org.apache.maven.plugin.MojoExecutionException: Failed to retrieve remote metadata
org.apache.oltu.openidconnect:org.apache.oltu.openidconnect.parent:1-SNAPSHOT/maven-metadata.xml:
Could not transfer metadata org.apache.oltu.openidconnect:org.apache.oltu.openidconnect.parent:1-SNAPSHOT/maven-metadata.xml
from/to apache.snapshots.https (https://repository.apache.org/content/repositories/snapshots):
Error transferring file: java.lang.RuntimeException: Could not generate DH keypair
	at org.apache.maven.plugin.deploy.DeployMojo.deployProject(DeployMojo.java:282)
	at org.apache.maven.plugin.deploy.DeployMojo.execute(DeployMojo.java:169)
	at org.apache.maven.plugin.DefaultBuildPluginManager.executeMojo(DefaultBuildPluginManager.java:101)
	at org.apache.maven.lifecycle.internal.MojoExecutor.execute(MojoExecutor.java:209)
	... 31 more
Caused by: org.apache.maven.artifact.deployer.ArtifactDeploymentException: Failed to retrieve
remote metadata org.apache.oltu.openidconnect:org.apache.oltu.openidconnect.parent:1-SNAPSHOT/maven-metadata.xml:
Could not transfer metadata org.apache.oltu.openidconnect:org.apache.oltu.openidconnect.parent:1-SNAPSHOT/maven-metadata.xml
from/to apache.snapshots.https (https://repository.apache.org/content/repositories/snapshots):
Error transferring file: java.lang.RuntimeException: Could not generate DH keypair
	at org.apache.maven.artifact.deployer.DefaultArtifactDeployer.deploy(DefaultArtifactDeployer.java:141)
	at org.apache.maven.plugin.deploy.AbstractDeployMojo.deploy(AbstractDeployMojo.java:171)
	at org.apache.maven.plugin.deploy.DeployMojo.deployProject(DeployMojo.java:240)
	... 34 more
Caused by: org.sonatype.aether.deployment.DeploymentException: Failed to retrieve remote metadata
org.apache.oltu.openidconnect:org.apache.oltu.openidconnect.parent:1-SNAPSHOT/maven-metadata.xml:
Could not transfer metadata org.apache.oltu.openidconnect:org.apache.oltu.openidconnect.parent:1-SNAPSHOT/maven-metadata.xml
from/to apache.snapshots.https (https://repository.apache.org/content/repositories/snapshots):
Error transferring file: java.lang.RuntimeException: Could not generate DH keypair
	at org.sonatype.aether.impl.internal.DefaultDeployer.upload(DefaultDeployer.java:407)
	at org.sonatype.aether.impl.internal.DefaultDeployer.deploy(DefaultDeployer.java:260)
	at org.sonatype.aether.impl.internal.DefaultDeployer.deploy(DefaultDeployer.java:215)
	at org.sonatype.aether.impl.internal.DefaultRepositorySystem.deploy(DefaultRepositorySystem.java:480)
	at org.apache.maven.artifact.deployer.DefaultArtifactDeployer.deploy(DefaultArtifactDeployer.java:137)
	... 36 more
Caused by: org.sonatype.aether.transfer.MetadataTransferException: Could not transfer metadata
org.apache.oltu.openidconnect:org.apache.oltu.openidconnect.parent:1-SNAPSHOT/maven-metadata.xml
from/to apache.snapshots.https (https://repository.apache.org/content/repositories/snapshots):
Error transferring file: java.lang.RuntimeException: Could not generate DH keypair
	at org.sonatype.aether.connector.wagon.WagonRepositoryConnector$3.wrap(WagonRepositoryConnector.java:932)
	at org.sonatype.aether.connector.wagon.WagonRepositoryConnector$3.wrap(WagonRepositoryConnector.java:923)
	at org.sonatype.aether.connector.wagon.WagonRepositoryConnector$GetTask.flush(WagonRepositoryConnector.java:695)
	at org.sonatype.aether.connector.wagon.WagonRepositoryConnector$GetTask.flush(WagonRepositoryConnector.java:689)
	at org.sonatype.aether.connector.wagon.WagonRepositoryConnector.get(WagonRepositoryConnector.java:445)
	at org.sonatype.aether.impl.internal.DefaultDeployer.upload(DefaultDeployer.java:379)
	... 40 more
Caused by: org.apache.maven.wagon.TransferFailedException: Error transferring file: java.lang.RuntimeException:
Could not generate DH keypair
	at org.apache.maven.wagon.providers.http.LightweightHttpWagon.fillInputData(LightweightHttpWagon.java:143)
	at org.apache.maven.wagon.StreamWagon.getInputStream(StreamWagon.java:116)
	at org.apache.maven.wagon.StreamWagon.getIfNewer(StreamWagon.java:88)
	at org.apache.maven.wagon.StreamWagon.get(StreamWagon.java:61)
	at org.sonatype.aether.connector.wagon.WagonRepositoryConnector$GetTask.run(WagonRepositoryConnector.java:608)
	at org.sonatype.aether.util.concurrency.RunnableErrorForwarder$1.run(RunnableErrorForwarder.java:64)
	... 3 more
Caused by: javax.net.ssl.SSLException: java.lang.RuntimeException: Could not generate DH keypair
	at com.sun.net.ssl.internal.ssl.Alerts.getSSLException(Alerts.java:190)
	at com.sun.net.ssl.internal.ssl.SSLSocketImpl.fatal(SSLSocketImpl.java:1747)
	at com.sun.net.ssl.internal.ssl.SSLSocketImpl.fatal(SSLSocketImpl.java:1708)
	at com.sun.net.ssl.internal.ssl.SSLSocketImpl.handleException(SSLSocketImpl.java:1691)
	at com.sun.net.ssl.internal.ssl.SSLSocketImpl.startHandshake(SSLSocketImpl.java:1222)
	at com.sun.net.ssl.internal.ssl.SSLSocketImpl.startHandshake(SSLSocketImpl.java:1199)
	at sun.net.www.protocol.https.HttpsClient.afterConnect(HttpsClient.java:434)
	at sun.net.www.protocol.https.AbstractDelegateHttpsURLConnection.connect(AbstractDelegateHttpsURLConnection.java:166)
	at sun.net.www.protocol.http.HttpURLConnection.getInputStream(HttpURLConnection.java:1195)
	at java.net.HttpURLConnection.getResponseCode(HttpURLConnection.java:379)
	at sun.net.www.protocol.https.HttpsURLConnectionImpl.getResponseCode(HttpsURLConnectionImpl.java:318)
	at org.apache.maven.wagon.providers.http.LightweightHttpWagon.fillInputData(LightweightHttpWagon.java:115)
	... 8 more
Caused by: java.lang.RuntimeException: Could not generate DH keypair
	at com.sun.net.ssl.internal.ssl.DHCrypt.<init>(DHCrypt.java:114)
	at com.sun.net.ssl.internal.ssl.ClientHandshaker.serverKeyExchange(ClientHandshaker.java:559)
	at com.sun.net.ssl.internal.ssl.ClientHandshaker.processMessage(ClientHandshaker.java:186)
	at com.sun.net.ssl.internal.ssl.Handshaker.processLoop(Handshaker.java:593)
	at com.sun.net.ssl.internal.ssl.Handshaker.process_record(Handshaker.java:529)
	at com.sun.net.ssl.internal.ssl.SSLSocketImpl.readRecord(SSLSocketImpl.java:943)
	at com.sun.net.ssl.internal.ssl.SSLSocketImpl.performInitialHandshake(SSLSocketImpl.java:1188)
	at com.sun.net.ssl.internal.ssl.SSLSocketImpl.startHandshake(SSLSocketImpl.java:1215)
	... 15 more
Caused by: java.security.InvalidAlgorithmParameterException: Prime size must be multiple of
64, and can only range from 512 to 1024 (inclusive)
	at com.sun.crypto.provider.DHKeyPairGenerator.initialize(DashoA13*..)
	at java.security.KeyPairGenerator$Delegate.initialize(KeyPairGenerator.java:627)
	at com.sun.net.ssl.internal.ssl.DHCrypt.<init>(DHCrypt.java:107)
	... 22 more
[ERROR] 
[ERROR] Re-run Maven using the -X switch to enable full debug logging.
[ERROR] 
[ERROR] For more information about the errors and possible solutions, please read the following
articles:
[ERROR] [Help 1] http://cwiki.apache.org/confluence/display/MAVEN/MojoExecutionException


Mime
View raw message