oltu-dev mailing list archives

Site index · List index
Message view « Date » · « Thread »
Top « Date » · « Thread »
From Apache Jenkins Server <jenk...@builds.apache.org>
Subject Build failed in Jenkins: Oltu-OAuth-2.0-windows #166
Date Mon, 22 Feb 2016 19:11:53 GMT
See <https://builds.apache.org/job/Oltu-OAuth-2.0-windows/166/changes>

Changes:

[Jasha Joachimsthal] OLTU-156 Add latest releases to download page and update to latest skin

[Jasha Joachimsthal] OLTU-187 Update to latest apache parent in root. Use site plugin version
from Apache parent pom. Fix parent reference in site.

------------------------------------------
Started by an SCM change
[EnvInject] - Loading node environment variables.
Building remotely on windows1 (Windows) in workspace <https://builds.apache.org/job/Oltu-OAuth-2.0-windows/ws/>
Updating https://svn.apache.org/repos/asf/oltu/trunk at revision '2016-02-22T19:11:03.806
+0000'
U         parent\pom.xml
U         pom.xml
U         oauth-2.0\pom.xml
U         site\src\site\xdoc\download.xml
U         site\src\site\site.xml
U         site\pom.xml
At revision 1731719
WARNING: clock of the subversion server appears to be out of sync. This can result in inconsistent
check out behavior.
Parsing POMs
Modules changed, recalculating dependency graph
Established TCP socket on 62326
maven32-agent.jar already up to date
maven32-interceptor.jar already up to date
maven3-interceptor-commons.jar already up to date
[oauth-2.0] $ f:\hudson\tools\java\latest-1.6-64/bin/java -da -dsa -XX:MaxPermSize=192m -Xmx512M
-cp f:\hudson\hudson-slave\maven32-agent.jar;f:\hudson\tools\maven\latest\boot\plexus-classworlds-2.5.1.jar;f:\hudson\tools\maven\latest/conf/logging
jenkins.maven3.agent.Maven32Main f:\hudson\tools\maven\latest F:\hudson\hudson-slave\slave.jar
f:\hudson\hudson-slave\maven32-interceptor.jar f:\hudson\hudson-slave\maven3-interceptor-commons.jar
62326
<===[JENKINS REMOTING CAPACITY]===>   channel started
Executing Maven:  -B -f <https://builds.apache.org/job/Oltu-OAuth-2.0-windows/ws/trunk\oauth-2.0\pom.xml>
-Dmaven.repo.local=f:\hudson\hudson-slave\maven-repositories\1 -B -e clean deploy
[INFO] Error stacktraces are turned on.
[INFO] Scanning for projects...
[INFO] ------------------------------------------------------------------------
[INFO] Reactor Build Order:
[INFO] 
[INFO] Apache Oltu - OAuth 2.0
[INFO] Apache Oltu - OAuth 2.0 - Common
[INFO] Apache Oltu - OAuth 2.0 - Client
[INFO] Apache Oltu - OAuth 2.0 - HttpClient
[INFO] Apache Oltu - OAuth 2.0 - Dynamic Registration Common
[INFO] Apache Oltu - OAuth 2.0 - Dynamic Registration Client
[INFO] Apache Oltu - OAuth 2.0 - Authorization Server
[INFO] Apache Oltu - OAuth 2.0 - Resource Server
[INFO] Apache Oltu - OAuth 2.0 - Resource Server Filter
[INFO] Apache Oltu - OAuth 2.0 - Test Utils
[INFO] Apache Oltu - OAuth 2.0 - Dynamic Registration Server
[INFO] Apache Oltu - OAuth 2.0 - Integration Tests
[INFO] Apache Oltu - OAuth 2.0 - JWT
[INFO] 
[INFO] Using the builder org.apache.maven.lifecycle.internal.builder.singlethreaded.SingleThreadedBuilder
with a thread count of 1
[INFO]                                                                         
[INFO] ------------------------------------------------------------------------
[INFO] Building Apache Oltu - OAuth 2.0 1.0.2-SNAPSHOT
[INFO] ------------------------------------------------------------------------
[INFO] 
[INFO] --- maven-clean-plugin:2.5:clean (default-clean) @ org.apache.oltu.oauth2.parent ---
[INFO] Deleting <https://builds.apache.org/job/Oltu-OAuth-2.0-windows/ws/trunk\oauth-2.0\target>
[INFO] 
[INFO] --- maven-enforcer-plugin:1.3.1:enforce (enforce-java) @ org.apache.oltu.oauth2.parent
---
[INFO] 
[INFO] --- buildnumber-maven-plugin:1.2:create (default) @ org.apache.oltu.oauth2.parent ---
[INFO] Checking for local modifications: skipped.
[INFO] Updating project files from SCM: skipped.
[INFO] Executing: cmd.exe /X /C "svn --non-interactive info"
[INFO] Working directory: <https://builds.apache.org/job/Oltu-OAuth-2.0-windows/ws/trunk\oauth-2.0>
[INFO] Storing buildNumber: 1731715 at timestamp: 1456168155784
[INFO] Executing: cmd.exe /X /C "svn --non-interactive info"
[INFO] Working directory: <https://builds.apache.org/job/Oltu-OAuth-2.0-windows/ws/trunk\oauth-2.0>
[INFO] Storing buildScmBranch: trunk
[INFO] 
[INFO] --- maven-remote-resources-plugin:1.5:process (default) @ org.apache.oltu.oauth2.parent
---
[INFO] 
[INFO] --- maven-site-plugin:3.4:attach-descriptor (attach-descriptor) @ org.apache.oltu.oauth2.parent
---
[INFO] 
[INFO] --- maven-install-plugin:2.5.1:install (default-install) @ org.apache.oltu.oauth2.parent
---
[INFO] Installing <https://builds.apache.org/job/Oltu-OAuth-2.0-windows/ws/trunk\oauth-2.0\pom.xml>
to f:\hudson\hudson-slave\maven-repositories\1\org\apache\oltu\oauth2\org.apache.oltu.oauth2.parent\1.0.2-SNAPSHOT\org.apache.oltu.oauth2.parent-1.0.2-SNAPSHOT.pom
[INFO] 
[INFO] --- maven-deploy-plugin:2.8.1:deploy (default-deploy) @ org.apache.oltu.oauth2.parent
---
[INFO] Downloading: https://repository.apache.org/content/repositories/snapshots/org/apache/oltu/oauth2/org.apache.oltu.oauth2.parent/1.0.2-SNAPSHOT/maven-metadata.xml
[WARNING] Could not transfer metadata org.apache.oltu.oauth2:org.apache.oltu.oauth2.parent:1.0.2-SNAPSHOT/maven-metadata.xml
from/to apache.snapshots.https (https://repository.apache.org/content/repositories/snapshots):
java.lang.RuntimeException: Could not generate DH keypair
[INFO] ------------------------------------------------------------------------
[INFO] Reactor Summary:
[INFO] 
[INFO] Apache Oltu - OAuth 2.0 ........................... FAILURE [  4.540 s]
[INFO] Apache Oltu - OAuth 2.0 - Common .................. SKIPPED
[INFO] Apache Oltu - OAuth 2.0 - Client .................. SKIPPED
[INFO] Apache Oltu - OAuth 2.0 - HttpClient .............. SKIPPED
[INFO] Apache Oltu - OAuth 2.0 - Dynamic Registration Common  SKIPPED
[INFO] Apache Oltu - OAuth 2.0 - Dynamic Registration Client  SKIPPED
[INFO] Apache Oltu - OAuth 2.0 - Authorization Server .... SKIPPED
[INFO] Apache Oltu - OAuth 2.0 - Resource Server ......... SKIPPED
[INFO] Apache Oltu - OAuth 2.0 - Resource Server Filter .. SKIPPED
[INFO] Apache Oltu - OAuth 2.0 - Test Utils .............. SKIPPED
[INFO] Apache Oltu - OAuth 2.0 - Dynamic Registration Server  SKIPPED
[INFO] Apache Oltu - OAuth 2.0 - Integration Tests ....... SKIPPED
[INFO] Apache Oltu - OAuth 2.0 - JWT ..................... SKIPPED
[INFO] ------------------------------------------------------------------------
[INFO] BUILD FAILURE
[INFO] ------------------------------------------------------------------------
[INFO] Total time: 6.578 s
[INFO] Finished at: 2016-02-22T19:09:19+00:00
[INFO] Final Memory: 23M/226M
[INFO] ------------------------------------------------------------------------
Waiting for Jenkins to finish collecting data
[ERROR] Failed to execute goal org.apache.maven.plugins:maven-deploy-plugin:2.8.1:deploy (default-deploy)
on project org.apache.oltu.oauth2.parent: Failed to retrieve remote metadata org.apache.oltu.oauth2:org.apache.oltu.oauth2.parent:1.0.2-SNAPSHOT/maven-metadata.xml:
Could not transfer metadata org.apache.oltu.oauth2:org.apache.oltu.oauth2.parent:1.0.2-SNAPSHOT/maven-metadata.xml
from/to apache.snapshots.https (https://repository.apache.org/content/repositories/snapshots):
java.lang.RuntimeException: Could not generate DH keypair: Prime size must be multiple of
64, and can only range from 512 to 1024 (inclusive) -> [Help 1]
org.apache.maven.lifecycle.LifecycleExecutionException: Failed to execute goal org.apache.maven.plugins:maven-deploy-plugin:2.8.1:deploy
(default-deploy) on project org.apache.oltu.oauth2.parent: Failed to retrieve remote metadata
org.apache.oltu.oauth2:org.apache.oltu.oauth2.parent:1.0.2-SNAPSHOT/maven-metadata.xml: Could
not transfer metadata org.apache.oltu.oauth2:org.apache.oltu.oauth2.parent:1.0.2-SNAPSHOT/maven-metadata.xml
from/to apache.snapshots.https (https://repository.apache.org/content/repositories/snapshots):
java.lang.RuntimeException: Could not generate DH keypair
	at org.apache.maven.lifecycle.internal.MojoExecutor.execute(MojoExecutor.java:216)
	at org.apache.maven.lifecycle.internal.MojoExecutor.execute(MojoExecutor.java:153)
	at org.apache.maven.lifecycle.internal.MojoExecutor.execute(MojoExecutor.java:145)
	at org.apache.maven.lifecycle.internal.LifecycleModuleBuilder.buildProject(LifecycleModuleBuilder.java:108)
	at org.apache.maven.lifecycle.internal.LifecycleModuleBuilder.buildProject(LifecycleModuleBuilder.java:76)
	at org.apache.maven.lifecycle.internal.builder.singlethreaded.SingleThreadedBuilder.build(SingleThreadedBuilder.java:51)
	at org.apache.maven.lifecycle.internal.LifecycleStarter.execute(LifecycleStarter.java:116)
	at org.apache.maven.DefaultMaven.doExecute(DefaultMaven.java:361)
	at org.apache.maven.DefaultMaven.execute(DefaultMaven.java:155)
	at org.jvnet.hudson.maven3.launcher.Maven32Launcher.main(Maven32Launcher.java:132)
	at sun.reflect.NativeMethodAccessorImpl.invoke0(Native Method)
	at sun.reflect.NativeMethodAccessorImpl.invoke(NativeMethodAccessorImpl.java:39)
	at sun.reflect.DelegatingMethodAccessorImpl.invoke(DelegatingMethodAccessorImpl.java:25)
	at java.lang.reflect.Method.invoke(Method.java:597)
	at org.codehaus.plexus.classworlds.launcher.Launcher.launchStandard(Launcher.java:330)
	at org.codehaus.plexus.classworlds.launcher.Launcher.launch(Launcher.java:238)
	at jenkins.maven3.agent.Maven32Main.launch(Maven32Main.java:186)
	at sun.reflect.NativeMethodAccessorImpl.invoke0(Native Method)
	at sun.reflect.NativeMethodAccessorImpl.invoke(NativeMethodAccessorImpl.java:39)
	at sun.reflect.DelegatingMethodAccessorImpl.invoke(DelegatingMethodAccessorImpl.java:25)
	at java.lang.reflect.Method.invoke(Method.java:597)
	at hudson.maven.Maven3Builder.call(Maven3Builder.java:136)
	at hudson.maven.Maven3Builder.call(Maven3Builder.java:71)
	at hudson.remoting.UserRequest.perform(UserRequest.java:118)
	at hudson.remoting.UserRequest.perform(UserRequest.java:48)
	at hudson.remoting.Request$2.run(Request.java:328)
	at hudson.remoting.InterceptingExecutorService$1.call(InterceptingExecutorService.java:72)
	at java.util.concurrent.FutureTask$Sync.innerRun(FutureTask.java:303)
	at java.util.concurrent.FutureTask.run(FutureTask.java:138)
	at java.util.concurrent.ThreadPoolExecutor$Worker.runTask(ThreadPoolExecutor.java:886)
	at java.util.concurrent.ThreadPoolExecutor$Worker.run(ThreadPoolExecutor.java:908)
	at java.lang.Thread.run(Thread.java:662)
Caused by: org.apache.maven.plugin.MojoExecutionException: Failed to retrieve remote metadata
org.apache.oltu.oauth2:org.apache.oltu.oauth2.parent:1.0.2-SNAPSHOT/maven-metadata.xml: Could
not transfer metadata org.apache.oltu.oauth2:org.apache.oltu.oauth2.parent:1.0.2-SNAPSHOT/maven-metadata.xml
from/to apache.snapshots.https (https://repository.apache.org/content/repositories/snapshots):
java.lang.RuntimeException: Could not generate DH keypair
	at org.apache.maven.plugin.deploy.DeployMojo.deployProject(DeployMojo.java:282)
	at org.apache.maven.plugin.deploy.DeployMojo.execute(DeployMojo.java:169)
	at org.apache.maven.plugin.DefaultBuildPluginManager.executeMojo(DefaultBuildPluginManager.java:133)
	at org.apache.maven.lifecycle.internal.MojoExecutor.execute(MojoExecutor.java:208)
	... 31 more
Caused by: org.apache.maven.artifact.deployer.ArtifactDeploymentException: Failed to retrieve
remote metadata org.apache.oltu.oauth2:org.apache.oltu.oauth2.parent:1.0.2-SNAPSHOT/maven-metadata.xml:
Could not transfer metadata org.apache.oltu.oauth2:org.apache.oltu.oauth2.parent:1.0.2-SNAPSHOT/maven-metadata.xml
from/to apache.snapshots.https (https://repository.apache.org/content/repositories/snapshots):
java.lang.RuntimeException: Could not generate DH keypair
	at org.apache.maven.artifact.deployer.DefaultArtifactDeployer.deploy(DefaultArtifactDeployer.java:143)
	at org.apache.maven.plugin.deploy.AbstractDeployMojo.deploy(AbstractDeployMojo.java:171)
	at org.apache.maven.plugin.deploy.DeployMojo.deployProject(DeployMojo.java:240)
	... 34 more
Caused by: org.eclipse.aether.deployment.DeploymentException: Failed to retrieve remote metadata
org.apache.oltu.oauth2:org.apache.oltu.oauth2.parent:1.0.2-SNAPSHOT/maven-metadata.xml: Could
not transfer metadata org.apache.oltu.oauth2:org.apache.oltu.oauth2.parent:1.0.2-SNAPSHOT/maven-metadata.xml
from/to apache.snapshots.https (https://repository.apache.org/content/repositories/snapshots):
java.lang.RuntimeException: Could not generate DH keypair
	at org.eclipse.aether.internal.impl.DefaultDeployer.upload(DefaultDeployer.java:463)
	at org.eclipse.aether.internal.impl.DefaultDeployer.deploy(DefaultDeployer.java:313)
	at org.eclipse.aether.internal.impl.DefaultDeployer.deploy(DefaultDeployer.java:268)
	at org.eclipse.aether.internal.impl.DefaultRepositorySystem.deploy(DefaultRepositorySystem.java:413)
	at org.apache.maven.artifact.deployer.DefaultArtifactDeployer.deploy(DefaultArtifactDeployer.java:139)
	... 36 more
Caused by: org.eclipse.aether.transfer.MetadataTransferException: Could not transfer metadata
org.apache.oltu.oauth2:org.apache.oltu.oauth2.parent:1.0.2-SNAPSHOT/maven-metadata.xml from/to
apache.snapshots.https (https://repository.apache.org/content/repositories/snapshots): java.lang.RuntimeException:
Could not generate DH keypair
	at org.eclipse.aether.connector.wagon.WagonRepositoryConnector$5.wrap(WagonRepositoryConnector.java:995)
	at org.eclipse.aether.connector.wagon.WagonRepositoryConnector$5.wrap(WagonRepositoryConnector.java:983)
	at org.eclipse.aether.connector.wagon.WagonRepositoryConnector$GetTask.run(WagonRepositoryConnector.java:725)
	at org.eclipse.aether.util.concurrency.RunnableErrorForwarder$1.run(RunnableErrorForwarder.java:67)
	... 3 more
Caused by: org.apache.maven.wagon.TransferFailedException: java.lang.RuntimeException: Could
not generate DH keypair
	at org.apache.maven.wagon.providers.http.AbstractHttpClientWagon.fillInputData(AbstractHttpClientWagon.java:935)
	at org.apache.maven.wagon.StreamWagon.getInputStream(StreamWagon.java:116)
	at org.apache.maven.wagon.StreamWagon.getIfNewer(StreamWagon.java:88)
	at org.apache.maven.wagon.StreamWagon.get(StreamWagon.java:61)
	at org.eclipse.aether.connector.wagon.WagonRepositoryConnector$GetTask.run(WagonRepositoryConnector.java:660)
	... 4 more
Caused by: javax.net.ssl.SSLException: java.lang.RuntimeException: Could not generate DH keypair
	at com.sun.net.ssl.internal.ssl.Alerts.getSSLException(Alerts.java:190)
	at com.sun.net.ssl.internal.ssl.SSLSocketImpl.fatal(SSLSocketImpl.java:1699)
	at com.sun.net.ssl.internal.ssl.SSLSocketImpl.fatal(SSLSocketImpl.java:1660)
	at com.sun.net.ssl.internal.ssl.SSLSocketImpl.handleException(SSLSocketImpl.java:1643)
	at com.sun.net.ssl.internal.ssl.SSLSocketImpl.startHandshake(SSLSocketImpl.java:1172)
	at com.sun.net.ssl.internal.ssl.SSLSocketImpl.startHandshake(SSLSocketImpl.java:1149)
	at org.apache.maven.wagon.providers.http.httpclient.conn.ssl.SSLConnectionSocketFactory.connectSocket(SSLConnectionSocketFactory.java:261)
	at org.apache.maven.wagon.providers.http.httpclient.impl.conn.HttpClientConnectionOperator.connect(HttpClientConnectionOperator.java:118)
	at org.apache.maven.wagon.providers.http.httpclient.impl.conn.PoolingHttpClientConnectionManager.connect(PoolingHttpClientConnectionManager.java:314)
	at org.apache.maven.wagon.providers.http.httpclient.impl.execchain.MainClientExec.establishRoute(MainClientExec.java:357)
	at org.apache.maven.wagon.providers.http.httpclient.impl.execchain.MainClientExec.execute(MainClientExec.java:218)
	at org.apache.maven.wagon.providers.http.httpclient.impl.execchain.ProtocolExec.execute(ProtocolExec.java:194)
	at org.apache.maven.wagon.providers.http.httpclient.impl.execchain.RetryExec.execute(RetryExec.java:85)
	at org.apache.maven.wagon.providers.http.httpclient.impl.execchain.RedirectExec.execute(RedirectExec.java:108)
	at org.apache.maven.wagon.providers.http.httpclient.impl.client.InternalHttpClient.doExecute(InternalHttpClient.java:186)
	at org.apache.maven.wagon.providers.http.httpclient.impl.client.CloseableHttpClient.execute(CloseableHttpClient.java:82)
	at org.apache.maven.wagon.providers.http.AbstractHttpClientWagon.execute(AbstractHttpClientWagon.java:756)
	at org.apache.maven.wagon.providers.http.AbstractHttpClientWagon.fillInputData(AbstractHttpClientWagon.java:854)
	... 8 more
Caused by: java.lang.RuntimeException: Could not generate DH keypair
	at com.sun.net.ssl.internal.ssl.DHCrypt.<init>(DHCrypt.java:106)
	at com.sun.net.ssl.internal.ssl.ClientHandshaker.serverKeyExchange(ClientHandshaker.java:556)
	at com.sun.net.ssl.internal.ssl.ClientHandshaker.processMessage(ClientHandshaker.java:183)
	at com.sun.net.ssl.internal.ssl.Handshaker.processLoop(Handshaker.java:593)
	at com.sun.net.ssl.internal.ssl.Handshaker.process_record(Handshaker.java:529)
	at com.sun.net.ssl.internal.ssl.SSLSocketImpl.readRecord(SSLSocketImpl.java:893)
	at com.sun.net.ssl.internal.ssl.SSLSocketImpl.performInitialHandshake(SSLSocketImpl.java:1138)
	at com.sun.net.ssl.internal.ssl.SSLSocketImpl.startHandshake(SSLSocketImpl.java:1165)
	... 21 more
Caused by: java.security.InvalidAlgorithmParameterException: Prime size must be multiple of
64, and can only range from 512 to 1024 (inclusive)
	at com.sun.crypto.provider.DHKeyPairGenerator.initialize(DashoA13*..)
	at java.security.KeyPairGenerator$Delegate.initialize(KeyPairGenerator.java:627)
	at com.sun.net.ssl.internal.ssl.DHCrypt.<init>(DHCrypt.java:100)
	... 28 more
[ERROR] 
[ERROR] Re-run Maven using the -X switch to enable full debug logging.
[ERROR] 
[ERROR] For more information about the errors and possible solutions, please read the following
articles:
[ERROR] [Help 1] http://cwiki.apache.org/confluence/display/MAVEN/MojoExecutionException
[JENKINS] Archiving F:\hudson\hudson-slave\workspace\Oltu-OAuth-2.0-windows\trunk\oauth-2.0\integration-tests\pom.xml
to org.apache.oltu.oauth2/org.apache.oltu.oauth2.integration-tests/1.0.2-SNAPSHOT/org.apache.oltu.oauth2.integration-tests-1.0.2-SNAPSHOT.pom
[JENKINS] Archiving F:\hudson\hudson-slave\workspace\Oltu-OAuth-2.0-windows\trunk\oauth-2.0\authzserver\pom.xml
to org.apache.oltu.oauth2/org.apache.oltu.oauth2.authzserver/1.0.2-SNAPSHOT/org.apache.oltu.oauth2.authzserver-1.0.2-SNAPSHOT.pom
[JENKINS] Archiving F:\hudson\hudson-slave\workspace\Oltu-OAuth-2.0-windows\trunk\oauth-2.0\jwt\pom.xml
to org.apache.oltu.oauth2/org.apache.oltu.oauth2.jwt/1.0.2-SNAPSHOT/org.apache.oltu.oauth2.jwt-1.0.2-SNAPSHOT.pom
[JENKINS] Archiving F:\hudson\hudson-slave\workspace\Oltu-OAuth-2.0-windows\trunk\oauth-2.0\resourceserver-filter\pom.xml
to org.apache.oltu.oauth2/org.apache.oltu.oauth2.resourceserver-filter/1.0.2-SNAPSHOT/org.apache.oltu.oauth2.resourceserver-filter-1.0.2-SNAPSHOT.pom
[JENKINS] Archiving F:\hudson\hudson-slave\workspace\Oltu-OAuth-2.0-windows\trunk\oauth-2.0\dynamicreg-client\pom.xml
to org.apache.oltu.oauth2/org.apache.oltu.oauth2.dynamicreg.client/1.0.2-SNAPSHOT/org.apache.oltu.oauth2.dynamicreg.client-1.0.2-SNAPSHOT.pom
[JENKINS] Archiving F:\hudson\hudson-slave\workspace\Oltu-OAuth-2.0-windows\trunk\oauth-2.0\httpclient4\pom.xml
to org.apache.oltu.oauth2/org.apache.oltu.oauth2.httpclient4/1.0.2-SNAPSHOT/org.apache.oltu.oauth2.httpclient4-1.0.2-SNAPSHOT.pom
[JENKINS] Archiving F:\hudson\hudson-slave\workspace\Oltu-OAuth-2.0-windows\trunk\oauth-2.0\dynamicreg-common\pom.xml
to org.apache.oltu.oauth2/org.apache.oltu.oauth2.dynamicreg.common/1.0.2-SNAPSHOT/org.apache.oltu.oauth2.dynamicreg.common-1.0.2-SNAPSHOT.pom
[JENKINS] Archiving F:\hudson\hudson-slave\workspace\Oltu-OAuth-2.0-windows\trunk\oauth-2.0\client\pom.xml
to org.apache.oltu.oauth2/org.apache.oltu.oauth2.client/1.0.2-SNAPSHOT/org.apache.oltu.oauth2.client-1.0.2-SNAPSHOT.pom
[JENKINS] Archiving F:\hudson\hudson-slave\workspace\Oltu-OAuth-2.0-windows\trunk\oauth-2.0\resourceserver\pom.xml
to org.apache.oltu.oauth2/org.apache.oltu.oauth2.resourceserver/1.0.2-SNAPSHOT/org.apache.oltu.oauth2.resourceserver-1.0.2-SNAPSHOT.pom
[JENKINS] Archiving F:\hudson\hudson-slave\workspace\Oltu-OAuth-2.0-windows\trunk\oauth-2.0\dynamicreg-server\pom.xml
to org.apache.oltu.oauth2/org.apache.oltu.oauth2.dynamicreg.server/1.0.2-SNAPSHOT/org.apache.oltu.oauth2.dynamicreg.server-1.0.2-SNAPSHOT.pom
[JENKINS] Archiving <https://builds.apache.org/job/Oltu-OAuth-2.0-windows/ws/trunk\oauth-2.0\pom.xml>
to org.apache.oltu.oauth2/org.apache.oltu.oauth2.parent/1.0.2-SNAPSHOT/org.apache.oltu.oauth2.parent-1.0.2-SNAPSHOT.pom
[JENKINS] Archiving F:\hudson\hudson-slave\workspace\Oltu-OAuth-2.0-windows\trunk\oauth-2.0\test-utils\pom.xml
to org.apache.oltu.oauth2/org.apache.oltu.oauth2.test-utils/1.0.2-SNAPSHOT/org.apache.oltu.oauth2.test-utils-1.0.2-SNAPSHOT.pom
[JENKINS] Archiving F:\hudson\hudson-slave\workspace\Oltu-OAuth-2.0-windows\trunk\oauth-2.0\common\pom.xml
to org.apache.oltu.oauth2/org.apache.oltu.oauth2.common/1.0.2-SNAPSHOT/org.apache.oltu.oauth2.common-1.0.2-SNAPSHOT.pom
Sending e-mails to: dev@oltu.apache.org
channel stopped

Mime
View raw message