oltu-dev mailing list archives

Site index · List index
Message view « Date » · « Thread »
Top « Date » · « Thread »
From Apache Jenkins Server <jenk...@builds.apache.org>
Subject Build failed in Jenkins: Oltu-OpenID-Conect #103
Date Tue, 09 Feb 2016 09:11:36 GMT
See <https://builds.apache.org/job/Oltu-OpenID-Conect/103/changes>

Changes:

[asanso] OLTU-80 - Implement JWE support for JWT

------------------------------------------
[...truncated 935 lines...]
Downloaded: http://repo1.maven.org/maven2/org/apache/maven/maven-parent/11/maven-parent-11.pom
(32 KB at 620.6 KB/sec)
Downloading: http://repo1.maven.org/maven2/org/apache/apache/5/apache-5.pom
Downloaded: http://repo1.maven.org/maven2/org/apache/apache/5/apache-5.pom (5 KB at 81.7 KB/sec)
Downloading: http://repo1.maven.org/maven2/org/apache/maven/maven-model/2.2.1/maven-model-2.2.1.pom
Downloaded: http://repo1.maven.org/maven2/org/apache/maven/maven-model/2.2.1/maven-model-2.2.1.pom
(4 KB at 64.6 KB/sec)
Downloading: http://repo1.maven.org/maven2/org/apache/maven/maven-plugin-api/2.2.1/maven-plugin-api-2.2.1.pom
Downloaded: http://repo1.maven.org/maven2/org/apache/maven/maven-plugin-api/2.2.1/maven-plugin-api-2.2.1.pom
(2 KB at 23.4 KB/sec)
Downloading: http://repo1.maven.org/maven2/org/codehaus/plexus/plexus-utils/1.5.10/plexus-utils-1.5.10.pom
Downloaded: http://repo1.maven.org/maven2/org/codehaus/plexus/plexus-utils/1.5.10/plexus-utils-1.5.10.pom
(6 KB at 112.3 KB/sec)
Downloading: http://repo1.maven.org/maven2/org/mortbay/jetty/jetty/6.1.25/jetty-6.1.25.pom
Downloaded: http://repo1.maven.org/maven2/org/mortbay/jetty/jetty/6.1.25/jetty-6.1.25.pom
(7 KB at 124.7 KB/sec)
Downloading: http://repo1.maven.org/maven2/org/mortbay/jetty/project/6.1.25/project-6.1.25.pom
Downloaded: http://repo1.maven.org/maven2/org/mortbay/jetty/project/6.1.25/project-6.1.25.pom
(9 KB at 179.8 KB/sec)
Downloading: http://repo1.maven.org/maven2/org/mortbay/jetty/jetty-parent/10/jetty-parent-10.pom
Downloaded: http://repo1.maven.org/maven2/org/mortbay/jetty/jetty-parent/10/jetty-parent-10.pom
(4 KB at 65.5 KB/sec)
Downloading: http://repo1.maven.org/maven2/org/eclipse/jetty/jetty-parent/14/jetty-parent-14.pom
Downloaded: http://repo1.maven.org/maven2/org/eclipse/jetty/jetty-parent/14/jetty-parent-14.pom
(17 KB at 196.3 KB/sec)
Downloading: http://repo1.maven.org/maven2/org/mortbay/jetty/jetty-util/6.1.25/jetty-util-6.1.25.pom
Downloaded: http://repo1.maven.org/maven2/org/mortbay/jetty/jetty-util/6.1.25/jetty-util-6.1.25.pom
(4 KB at 75.7 KB/sec)
Downloading: http://repo1.maven.org/maven2/org/mortbay/jetty/servlet-api/2.5-20081211/servlet-api-2.5-20081211.pom
Downloaded: http://repo1.maven.org/maven2/org/mortbay/jetty/servlet-api/2.5-20081211/servlet-api-2.5-20081211.pom
(3 KB at 53.4 KB/sec)
Downloading: http://repo1.maven.org/maven2/org/mortbay/jetty/jetty-parent/7/jetty-parent-7.pom
Downloaded: http://repo1.maven.org/maven2/org/mortbay/jetty/jetty-parent/7/jetty-parent-7.pom
(13 KB at 245.2 KB/sec)
Downloading: http://repo1.maven.org/maven2/commons-lang/commons-lang/2.5/commons-lang-2.5.pom
Downloaded: http://repo1.maven.org/maven2/commons-lang/commons-lang/2.5/commons-lang-2.5.pom
(17 KB at 334.5 KB/sec)
Downloading: http://repo1.maven.org/maven2/org/apache/commons/commons-parent/12/commons-parent-12.pom
Downloaded: http://repo1.maven.org/maven2/org/apache/commons/commons-parent/12/commons-parent-12.pom
(27 KB at 525.8 KB/sec)
Downloading: http://repo1.maven.org/maven2/org/apache/maven/wagon/wagon-ssh/1.0/wagon-ssh-1.0.jar
Downloading: http://repo1.maven.org/maven2/com/jcraft/jsch/0.1.44-1/jsch-0.1.44-1.jar
Downloaded: http://repo1.maven.org/maven2/org/apache/maven/wagon/wagon-ssh/1.0/wagon-ssh-1.0.jar
(28 KB at 542.1 KB/sec)
Downloading: http://repo1.maven.org/maven2/org/apache/maven/wagon/wagon-ssh-common/1.0/wagon-ssh-common-1.0.jar
Downloading: http://repo1.maven.org/maven2/org/codehaus/plexus/plexus-interactivity-api/1.0-alpha-6/plexus-interactivity-api-1.0-alpha-6.jar
Downloading: http://repo1.maven.org/maven2/org/apache/maven/reporting/maven-reporting-api/3.0/maven-reporting-api-3.0.jar
Downloading: http://repo1.maven.org/maven2/org/apache/maven/reporting/maven-reporting-exec/1.0.1/maven-reporting-exec-1.0.1.jar
Downloaded: http://repo1.maven.org/maven2/org/codehaus/plexus/plexus-interactivity-api/1.0-alpha-6/plexus-interactivity-api-1.0-alpha-6.jar
(12 KB at 235.0 KB/sec)
Downloading: http://repo1.maven.org/maven2/org/apache/velocity/velocity/1.5/velocity-1.5.jar
Downloaded: http://repo1.maven.org/maven2/org/apache/maven/reporting/maven-reporting-api/3.0/maven-reporting-api-3.0.jar
(11 KB at 148.4 KB/sec)
Downloading: http://repo1.maven.org/maven2/org/sonatype/aether/aether-util/1.7/aether-util-1.7.jar
Downloaded: http://repo1.maven.org/maven2/com/jcraft/jsch/0.1.44-1/jsch-0.1.44-1.jar (209
KB at 1265.3 KB/sec)
Downloading: http://repo1.maven.org/maven2/org/sonatype/sisu/sisu-inject-bean/1.4.2/sisu-inject-bean-1.4.2.jar
Downloaded: http://repo1.maven.org/maven2/org/apache/maven/wagon/wagon-ssh-common/1.0/wagon-ssh-common-1.0.jar
(26 KB at 240.3 KB/sec)
Downloading: http://repo1.maven.org/maven2/org/sonatype/sisu/sisu-guice/2.1.7/sisu-guice-2.1.7-noaop.jar
Downloaded: http://repo1.maven.org/maven2/org/apache/maven/reporting/maven-reporting-exec/1.0.1/maven-reporting-exec-1.0.1.jar
(22 KB at 223.9 KB/sec)
Downloading: http://repo1.maven.org/maven2/org/codehaus/plexus/plexus-interpolation/1.14/plexus-interpolation-1.14.jar
Downloaded: http://repo1.maven.org/maven2/org/apache/velocity/velocity/1.5/velocity-1.5.jar
(383 KB at 5105.8 KB/sec)
Downloading: http://repo1.maven.org/maven2/org/sonatype/plexus/plexus-sec-dispatcher/1.3/plexus-sec-dispatcher-1.3.jar
Downloaded: http://repo1.maven.org/maven2/org/sonatype/plexus/plexus-sec-dispatcher/1.3/plexus-sec-dispatcher-1.3.jar
(28 KB at 569.1 KB/sec)
Downloading: http://repo1.maven.org/maven2/org/sonatype/plexus/plexus-cipher/1.4/plexus-cipher-1.4.jar
Downloaded: http://repo1.maven.org/maven2/org/sonatype/aether/aether-util/1.7/aether-util-1.7.jar
(106 KB at 1098.1 KB/sec)
Downloading: http://repo1.maven.org/maven2/org/apache/maven/doxia/doxia-sink-api/1.2/doxia-sink-api-1.2.jar
Downloaded: http://repo1.maven.org/maven2/org/sonatype/sisu/sisu-inject-bean/1.4.2/sisu-inject-bean-1.4.2.jar
(150 KB at 1965.8 KB/sec)
Downloading: http://repo1.maven.org/maven2/org/apache/maven/doxia/doxia-logging-api/1.2/doxia-logging-api-1.2.jar
Downloaded: http://repo1.maven.org/maven2/org/codehaus/plexus/plexus-interpolation/1.14/plexus-interpolation-1.14.jar
(60 KB at 784.7 KB/sec)
Downloading: http://repo1.maven.org/maven2/org/apache/maven/doxia/doxia-core/1.2/doxia-core-1.2.jar
Downloaded: http://repo1.maven.org/maven2/org/sonatype/plexus/plexus-cipher/1.4/plexus-cipher-1.4.jar
(14 KB at 268.9 KB/sec)
Downloading: http://repo1.maven.org/maven2/xerces/xercesImpl/2.9.1/xercesImpl-2.9.1.jar
Downloaded: http://repo1.maven.org/maven2/org/apache/maven/doxia/doxia-sink-api/1.2/doxia-sink-api-1.2.jar
(11 KB at 224.0 KB/sec)
Downloading: http://repo1.maven.org/maven2/xml-apis/xml-apis/1.3.04/xml-apis-1.3.04.jar
Downloaded: http://repo1.maven.org/maven2/org/apache/maven/doxia/doxia-logging-api/1.2/doxia-logging-api-1.2.jar
(12 KB at 226.1 KB/sec)
Downloading: http://repo1.maven.org/maven2/org/apache/httpcomponents/httpclient/4.0.2/httpclient-4.0.2.jar
Downloaded: http://repo1.maven.org/maven2/org/sonatype/sisu/sisu-guice/2.1.7/sisu-guice-2.1.7-noaop.jar
(461 KB at 3199.2 KB/sec)
Downloading: http://repo1.maven.org/maven2/org/apache/httpcomponents/httpcore/4.0.1/httpcore-4.0.1.jar
Downloaded: http://repo1.maven.org/maven2/org/apache/maven/doxia/doxia-core/1.2/doxia-core-1.2.jar
(151 KB at 2119.8 KB/sec)
Downloading: http://repo1.maven.org/maven2/commons-codec/commons-codec/1.3/commons-codec-1.3.jar
Downloaded: http://repo1.maven.org/maven2/commons-codec/commons-codec/1.3/commons-codec-1.3.jar
(46 KB at 877.5 KB/sec)
Downloading: http://repo1.maven.org/maven2/org/apache/maven/doxia/doxia-module-xhtml/1.2/doxia-module-xhtml-1.2.jar
Downloaded: http://repo1.maven.org/maven2/org/apache/httpcomponents/httpcore/4.0.1/httpcore-4.0.1.jar
(169 KB at 2679.9 KB/sec)
Downloading: http://repo1.maven.org/maven2/org/apache/maven/doxia/doxia-module-apt/1.2/doxia-module-apt-1.2.jar
Downloaded: http://repo1.maven.org/maven2/xml-apis/xml-apis/1.3.04/xml-apis-1.3.04.jar (190
KB at 1917.2 KB/sec)
Downloading: http://repo1.maven.org/maven2/org/apache/maven/doxia/doxia-module-xdoc/1.2/doxia-module-xdoc-1.2.jar
Downloaded: http://repo1.maven.org/maven2/org/apache/httpcomponents/httpclient/4.0.2/httpclient-4.0.2.jar
(287 KB at 2889.1 KB/sec)
Downloading: http://repo1.maven.org/maven2/org/apache/maven/doxia/doxia-module-fml/1.2/doxia-module-fml-1.2.jar
Downloaded: http://repo1.maven.org/maven2/xerces/xercesImpl/2.9.1/xercesImpl-2.9.1.jar (1201
KB at 10347.6 KB/sec)
Downloading: http://repo1.maven.org/maven2/javax/servlet/servlet-api/2.5/servlet-api-2.5.jar
Downloaded: http://repo1.maven.org/maven2/org/apache/maven/doxia/doxia-module-xhtml/1.2/doxia-module-xhtml-1.2.jar
(15 KB at 283.5 KB/sec)
Downloading: http://repo1.maven.org/maven2/org/apache/maven/doxia/doxia-decoration-model/1.2/doxia-decoration-model-1.2.jar
Downloaded: http://repo1.maven.org/maven2/org/apache/maven/doxia/doxia-module-apt/1.2/doxia-module-apt-1.2.jar
(51 KB at 1035.1 KB/sec)
Downloading: http://repo1.maven.org/maven2/org/apache/maven/doxia/doxia-site-renderer/1.2/doxia-site-renderer-1.2.jar
Downloaded: http://repo1.maven.org/maven2/org/apache/maven/doxia/doxia-module-xdoc/1.2/doxia-module-xdoc-1.2.jar
(36 KB at 714.6 KB/sec)
Downloading: http://repo1.maven.org/maven2/commons-collections/commons-collections/3.2.1/commons-collections-3.2.1.jar
Downloaded: http://repo1.maven.org/maven2/org/apache/maven/doxia/doxia-module-fml/1.2/doxia-module-fml-1.2.jar
(37 KB at 770.2 KB/sec)
Downloading: http://repo1.maven.org/maven2/org/apache/maven/shared/maven-doxia-tools/1.4/maven-doxia-tools-1.4.jar
Downloaded: http://repo1.maven.org/maven2/javax/servlet/servlet-api/2.5/servlet-api-2.5.jar
(103 KB at 1866.3 KB/sec)
Downloading: http://repo1.maven.org/maven2/org/codehaus/plexus/plexus-i18n/1.0-beta-7/plexus-i18n-1.0-beta-7.jar
Downloaded: http://repo1.maven.org/maven2/org/apache/maven/doxia/doxia-decoration-model/1.2/doxia-decoration-model-1.2.jar
(59 KB at 1166.7 KB/sec)
Downloading: http://repo1.maven.org/maven2/org/codehaus/plexus/plexus-utils/1.5.10/plexus-utils-1.5.10.jar
Downloaded: http://repo1.maven.org/maven2/org/apache/maven/doxia/doxia-site-renderer/1.2/doxia-site-renderer-1.2.jar
(51 KB at 1017.4 KB/sec)
Downloading: http://repo1.maven.org/maven2/org/mortbay/jetty/jetty/6.1.25/jetty-6.1.25.jar
Downloaded: http://repo1.maven.org/maven2/org/apache/maven/shared/maven-doxia-tools/1.4/maven-doxia-tools-1.4.jar
(45 KB at 864.9 KB/sec)
Downloading: http://repo1.maven.org/maven2/org/mortbay/jetty/servlet-api/2.5-20081211/servlet-api-2.5-20081211.jar
Downloaded: http://repo1.maven.org/maven2/org/codehaus/plexus/plexus-i18n/1.0-beta-7/plexus-i18n-1.0-beta-7.jar
(11 KB at 209.4 KB/sec)
Downloading: http://repo1.maven.org/maven2/org/mortbay/jetty/jetty-util/6.1.25/jetty-util-6.1.25.jar
Downloaded: http://repo1.maven.org/maven2/commons-collections/commons-collections/3.2.1/commons-collections-3.2.1.jar
(562 KB at 5853.2 KB/sec)
Downloading: http://repo1.maven.org/maven2/commons-lang/commons-lang/2.5/commons-lang-2.5.jar
Downloaded: http://repo1.maven.org/maven2/org/mortbay/jetty/jetty/6.1.25/jetty-6.1.25.jar
(526 KB at 8348.5 KB/sec)
Downloading: http://repo1.maven.org/maven2/commons-io/commons-io/1.4/commons-io-1.4.jar
Downloaded: http://repo1.maven.org/maven2/org/mortbay/jetty/servlet-api/2.5-20081211/servlet-api-2.5-20081211.jar
(131 KB at 2519.0 KB/sec)
Downloaded: http://repo1.maven.org/maven2/org/codehaus/plexus/plexus-utils/1.5.10/plexus-utils-1.5.10.jar
(274 KB at 3752.6 KB/sec)
Downloaded: http://repo1.maven.org/maven2/org/mortbay/jetty/jetty-util/6.1.25/jetty-util-6.1.25.jar
(174 KB at 2983.1 KB/sec)
Downloaded: http://repo1.maven.org/maven2/commons-lang/commons-lang/2.5/commons-lang-2.5.jar
(273 KB at 4957.3 KB/sec)
Downloaded: http://repo1.maven.org/maven2/commons-io/commons-io/1.4/commons-io-1.4.jar (107
KB at 2088.0 KB/sec)
[INFO] 
[INFO] --- maven-install-plugin:2.5.1:install (default-install) @ org.apache.oltu.openidconnect.parent
---
Downloading: http://repo1.maven.org/maven2/commons-codec/commons-codec/1.6/commons-codec-1.6.pom
Downloaded: http://repo1.maven.org/maven2/commons-codec/commons-codec/1.6/commons-codec-1.6.pom
(11 KB at 227.0 KB/sec)
Downloading: http://repo1.maven.org/maven2/org/apache/commons/commons-parent/22/commons-parent-22.pom
Downloaded: http://repo1.maven.org/maven2/org/apache/commons/commons-parent/22/commons-parent-22.pom
(41 KB at 818.7 KB/sec)
Downloading: http://repo1.maven.org/maven2/org/apache/maven/shared/maven-shared-utils/0.4/maven-shared-utils-0.4.pom
Downloaded: http://repo1.maven.org/maven2/org/apache/maven/shared/maven-shared-utils/0.4/maven-shared-utils-0.4.pom
(4 KB at 80.7 KB/sec)
Downloading: http://repo1.maven.org/maven2/com/google/code/findbugs/jsr305/2.0.1/jsr305-2.0.1.pom
Downloaded: http://repo1.maven.org/maven2/com/google/code/findbugs/jsr305/2.0.1/jsr305-2.0.1.pom
(965 B at 19.2 KB/sec)
Downloading: http://repo1.maven.org/maven2/org/codehaus/plexus/plexus-utils/3.0.15/plexus-utils-3.0.15.pom
Downloaded: http://repo1.maven.org/maven2/org/codehaus/plexus/plexus-utils/3.0.15/plexus-utils-3.0.15.pom
(4 KB at 62.7 KB/sec)
Downloading: http://repo1.maven.org/maven2/org/codehaus/plexus/plexus/3.3.1/plexus-3.3.1.pom
Downloaded: http://repo1.maven.org/maven2/org/codehaus/plexus/plexus/3.3.1/plexus-3.3.1.pom
(20 KB at 407.5 KB/sec)
Downloading: http://repo1.maven.org/maven2/commons-codec/commons-codec/1.6/commons-codec-1.6.jar
Downloading: http://repo1.maven.org/maven2/org/apache/maven/shared/maven-shared-utils/0.4/maven-shared-utils-0.4.jar
Downloading: http://repo1.maven.org/maven2/com/google/code/findbugs/jsr305/2.0.1/jsr305-2.0.1.jar
Downloading: http://repo1.maven.org/maven2/org/codehaus/plexus/plexus-utils/3.0.15/plexus-utils-3.0.15.jar
Downloaded: http://repo1.maven.org/maven2/commons-codec/commons-codec/1.6/commons-codec-1.6.jar
(228 KB at 4371.5 KB/sec)
Downloaded: http://repo1.maven.org/maven2/org/apache/maven/shared/maven-shared-utils/0.4/maven-shared-utils-0.4.jar
(152 KB at 2864.3 KB/sec)
Downloaded: http://repo1.maven.org/maven2/com/google/code/findbugs/jsr305/2.0.1/jsr305-2.0.1.jar
(32 KB at 622.4 KB/sec)
Downloaded: http://repo1.maven.org/maven2/org/codehaus/plexus/plexus-utils/3.0.15/plexus-utils-3.0.15.jar
(234 KB at 3070.4 KB/sec)
[INFO] Installing <https://builds.apache.org/job/Oltu-OpenID-Conect/ws/trunk/openid-connect/pom.xml>
to <https://builds.apache.org/job/Oltu-OpenID-Conect/ws/.repository/org/apache/oltu/openidconnect/org.apache.oltu.openidconnect.parent/1-SNAPSHOT/org.apache.oltu.openidconnect.parent-1-SNAPSHOT.pom>
[INFO] 
[INFO] --- maven-deploy-plugin:2.8.1:deploy (default-deploy) @ org.apache.oltu.openidconnect.parent
---
Downloading: https://repository.apache.org/content/repositories/snapshots/org/apache/oltu/openidconnect/org.apache.oltu.openidconnect.parent/1-SNAPSHOT/maven-metadata.xml
[WARNING] Could not transfer metadata org.apache.oltu.openidconnect:org.apache.oltu.openidconnect.parent:1-SNAPSHOT/maven-metadata.xml
from/to apache.snapshots.https (https://repository.apache.org/content/repositories/snapshots):
Error transferring file: java.lang.RuntimeException: Could not generate DH keypair
[INFO] ------------------------------------------------------------------------
[INFO] Reactor Summary:
[INFO] 
[INFO] Apache Oltu - OpenId Connect ...................... FAILURE [25.598s]
[INFO] Apache Oltu - OpenId Connect - Common ............. SKIPPED
[INFO] Apache Oltu - OpenId Connect - Client ............. SKIPPED
[INFO] ------------------------------------------------------------------------
[INFO] BUILD FAILURE
[INFO] ------------------------------------------------------------------------
[INFO] Total time: 32.817s
[INFO] Finished at: Tue Feb 09 09:05:20 UTC 2016
[INFO] Final Memory: 16M/97M
[INFO] ------------------------------------------------------------------------
Waiting for Jenkins to finish collecting data[ERROR] Failed to execute goal org.apache.maven.plugins:maven-deploy-plugin:2.8.1:deploy
(default-deploy) on project org.apache.oltu.openidconnect.parent: Failed to retrieve remote
metadata org.apache.oltu.openidconnect:org.apache.oltu.openidconnect.parent:1-SNAPSHOT/maven-metadata.xml:
Could not transfer metadata org.apache.oltu.openidconnect:org.apache.oltu.openidconnect.parent:1-SNAPSHOT/maven-metadata.xml
from/to apache.snapshots.https (https://repository.apache.org/content/repositories/snapshots):
Error transferring file: java.lang.RuntimeException: Could not generate DH keypair: Prime
size must be multiple of 64, and can only range from 512 to 1024 (inclusive) -> [Help 1]
org.apache.maven.lifecycle.LifecycleExecutionException: Failed to execute goal org.apache.maven.plugins:maven-deploy-plugin:2.8.1:deploy
(default-deploy) on project org.apache.oltu.openidconnect.parent: Failed to retrieve remote
metadata org.apache.oltu.openidconnect:org.apache.oltu.openidconnect.parent:1-SNAPSHOT/maven-metadata.xml:
Could not transfer metadata org.apache.oltu.openidconnect:org.apache.oltu.openidconnect.parent:1-SNAPSHOT/maven-metadata.xml
from/to apache.snapshots.https (https://repository.apache.org/content/repositories/snapshots):
Error transferring file: java.lang.RuntimeException: Could not generate DH keypair
	at org.apache.maven.lifecycle.internal.MojoExecutor.execute(MojoExecutor.java:217)
	at org.apache.maven.lifecycle.internal.MojoExecutor.execute(MojoExecutor.java:153)
	at org.apache.maven.lifecycle.internal.MojoExecutor.execute(MojoExecutor.java:145)
	at org.apache.maven.lifecycle.internal.LifecycleModuleBuilder.buildProject(LifecycleModuleBuilder.java:84)
	at org.apache.maven.lifecycle.internal.LifecycleModuleBuilder.buildProject(LifecycleModuleBuilder.java:59)
	at org.apache.maven.lifecycle.internal.LifecycleStarter.singleThreadedBuild(LifecycleStarter.java:183)
	at org.apache.maven.lifecycle.internal.LifecycleStarter.execute(LifecycleStarter.java:161)
	at org.apache.maven.DefaultMaven.doExecute(DefaultMaven.java:319)
	at org.apache.maven.DefaultMaven.execute(DefaultMaven.java:156)
	at org.jvnet.hudson.maven3.launcher.Maven3Launcher.main(Maven3Launcher.java:117)
	at sun.reflect.NativeMethodAccessorImpl.invoke0(Native Method)
	at sun.reflect.NativeMethodAccessorImpl.invoke(NativeMethodAccessorImpl.java:39)
	at sun.reflect.DelegatingMethodAccessorImpl.invoke(DelegatingMethodAccessorImpl.java:25)
	at java.lang.reflect.Method.invoke(Method.java:597)
	at org.codehaus.plexus.classworlds.launcher.Launcher.launchStandard(Launcher.java:329)
	at org.codehaus.plexus.classworlds.launcher.Launcher.launch(Launcher.java:239)
	at org.jvnet.hudson.maven3.agent.Maven3Main.launch(Maven3Main.java:181)
	at sun.reflect.NativeMethodAccessorImpl.invoke0(Native Method)
	at sun.reflect.NativeMethodAccessorImpl.invoke(NativeMethodAccessorImpl.java:39)
	at sun.reflect.DelegatingMethodAccessorImpl.invoke(DelegatingMethodAccessorImpl.java:25)
	at java.lang.reflect.Method.invoke(Method.java:597)
	at hudson.maven.Maven3Builder.call(Maven3Builder.java:136)
	at hudson.maven.Maven3Builder.call(Maven3Builder.java:71)
	at hudson.remoting.UserRequest.perform(UserRequest.java:121)
	at hudson.remoting.UserRequest.perform(UserRequest.java:49)
	at hudson.remoting.Request$2.run(Request.java:326)
	at hudson.remoting.InterceptingExecutorService$1.call(InterceptingExecutorService.java:68)
	at java.util.concurrent.FutureTask$Sync.innerRun(FutureTask.java:303)
	at java.util.concurrent.FutureTask.run(FutureTask.java:138)
	at java.util.concurrent.ThreadPoolExecutor$Worker.runTask(ThreadPoolExecutor.java:895)
	at java.util.concurrent.ThreadPoolExecutor$Worker.run(ThreadPoolExecutor.java:918)
	at java.lang.Thread.run(Thread.java:662)
Caused by: org.apache.maven.plugin.MojoExecutionException: Failed to retrieve remote metadata
org.apache.oltu.openidconnect:org.apache.oltu.openidconnect.parent:1-SNAPSHOT/maven-metadata.xml:
Could not transfer metadata org.apache.oltu.openidconnect:org.apache.oltu.openidconnect.parent:1-SNAPSHOT/maven-metadata.xml
from/to apache.snapshots.https (https://repository.apache.org/content/repositories/snapshots):
Error transferring file: java.lang.RuntimeException: Could not generate DH keypair
	at org.apache.maven.plugin.deploy.DeployMojo.deployProject(DeployMojo.java:282)
	at org.apache.maven.plugin.deploy.DeployMojo.execute(DeployMojo.java:169)
	at org.apache.maven.plugin.DefaultBuildPluginManager.executeMojo(DefaultBuildPluginManager.java:101)
	at org.apache.maven.lifecycle.internal.MojoExecutor.execute(MojoExecutor.java:209)
	... 31 more
Caused by: org.apache.maven.artifact.deployer.ArtifactDeploymentException: Failed to retrieve
remote metadata org.apache.oltu.openidconnect:org.apache.oltu.openidconnect.parent:1-SNAPSHOT/maven-metadata.xml:
Could not transfer metadata org.apache.oltu.openidconnect:org.apache.oltu.openidconnect.parent:1-SNAPSHOT/maven-metadata.xml
from/to apache.snapshots.https (https://repository.apache.org/content/repositories/snapshots):
Error transferring file: java.lang.RuntimeException: Could not generate DH keypair
	at org.apache.maven.artifact.deployer.DefaultArtifactDeployer.deploy(DefaultArtifactDeployer.java:141)
	at org.apache.maven.plugin.deploy.AbstractDeployMojo.deploy(AbstractDeployMojo.java:171)
	at org.apache.maven.plugin.deploy.DeployMojo.deployProject(DeployMojo.java:240)
	... 34 more
Caused by: org.sonatype.aether.deployment.DeploymentException: Failed to retrieve remote metadata
org.apache.oltu.openidconnect:org.apache.oltu.openidconnect.parent:1-SNAPSHOT/maven-metadata.xml:
Could not transfer metadata org.apache.oltu.openidconnect:org.apache.oltu.openidconnect.parent:1-SNAPSHOT/maven-metadata.xml
from/to apache.snapshots.https (https://repository.apache.org/content/repositories/snapshots):
Error transferring file: java.lang.RuntimeException: Could not generate DH keypair
	at org.sonatype.aether.impl.internal.DefaultDeployer.upload(DefaultDeployer.java:407)
	at org.sonatype.aether.impl.internal.DefaultDeployer.deploy(DefaultDeployer.java:260)
	at org.sonatype.aether.impl.internal.DefaultDeployer.deploy(DefaultDeployer.java:215)
	at org.sonatype.aether.impl.internal.DefaultRepositorySystem.deploy(DefaultRepositorySystem.java:480)
	at org.apache.maven.artifact.deployer.DefaultArtifactDeployer.deploy(DefaultArtifactDeployer.java:137)
	... 36 more
Caused by: org.sonatype.aether.transfer.MetadataTransferException: Could not transfer metadata
org.apache.oltu.openidconnect:org.apache.oltu.openidconnect.parent:1-SNAPSHOT/maven-metadata.xml
from/to apache.snapshots.https (https://repository.apache.org/content/repositories/snapshots):
Error transferring file: java.lang.RuntimeException: Could not generate DH keypair
	at org.sonatype.aether.connector.wagon.WagonRepositoryConnector$3.wrap(WagonRepositoryConnector.java:932)
	at org.sonatype.aether.connector.wagon.WagonRepositoryConnector$3.wrap(WagonRepositoryConnector.java:923)
	at org.sonatype.aether.connector.wagon.WagonRepositoryConnector$GetTask.flush(WagonRepositoryConnector.java:695)
	at org.sonatype.aether.connector.wagon.WagonRepositoryConnector$GetTask.flush(WagonRepositoryConnector.java:689)
	at org.sonatype.aether.connector.wagon.WagonRepositoryConnector.get(WagonRepositoryConnector.java:445)
	at org.sonatype.aether.impl.internal.DefaultDeployer.upload(DefaultDeployer.java:379)
	... 40 more
Caused by: org.apache.maven.wagon.TransferFailedException: Error transferring file: java.lang.RuntimeException:
Could not generate DH keypair
	at org.apache.maven.wagon.providers.http.LightweightHttpWagon.fillInputData(LightweightHttpWagon.java:143)
	at org.apache.maven.wagon.StreamWagon.getInputStream(StreamWagon.java:116)
	at org.apache.maven.wagon.StreamWagon.getIfNewer(StreamWagon.java:88)
	at org.apache.maven.wagon.StreamWagon.get(StreamWagon.java:61)
	at org.sonatype.aether.connector.wagon.WagonRepositoryConnector$GetTask.run(WagonRepositoryConnector.java:608)
	at org.sonatype.aether.util.concurrency.RunnableErrorForwarder$1.run(RunnableErrorForwarder.java:64)
	... 3 more
Caused by: javax.net.ssl.SSLException: java.lang.RuntimeException: Could not generate DH keypair
	at com.sun.net.ssl.internal.ssl.Alerts.getSSLException(Alerts.java:190)
	at com.sun.net.ssl.internal.ssl.SSLSocketImpl.fatal(SSLSocketImpl.java:1747)
	at com.sun.net.ssl.internal.ssl.SSLSocketImpl.fatal(SSLSocketImpl.java:1708)
	at com.sun.net.ssl.internal.ssl.SSLSocketImpl.handleException(SSLSocketImpl.java:1691)
	at com.sun.net.ssl.internal.ssl.SSLSocketImpl.startHandshake(SSLSocketImpl.java:1222)
	at com.sun.net.ssl.internal.ssl.SSLSocketImpl.startHandshake(SSLSocketImpl.java:1199)
	at sun.net.www.protocol.https.HttpsClient.afterConnect(HttpsClient.java:434)
	at sun.net.www.protocol.https.AbstractDelegateHttpsURLConnection.connect(AbstractDelegateHttpsURLConnection.java:166)
	at sun.net.www.protocol.http.HttpURLConnection.getInputStream(HttpURLConnection.java:1195)
	at java.net.HttpURLConnection.getResponseCode(HttpURLConnection.java:379)
	at sun.net.www.protocol.https.HttpsURLConnectionImpl.getResponseCode(HttpsURLConnectionImpl.java:318)
	at org.apache.maven.wagon.providers.http.LightweightHttpWagon.fillInputData(LightweightHttpWagon.java:115)
	... 8 more
Caused by: java.lang.RuntimeException: Could not generate DH keypair
	at com.sun.net.ssl.internal.ssl.DHCrypt.<init>(DHCrypt.java:114)
	at com.sun.net.ssl.internal.ssl.ClientHandshaker.serverKeyExchange(ClientHandshaker.java:559)
	at com.sun.net.ssl.internal.ssl.ClientHandshaker.processMessage(ClientHandshaker.java:186)
	at com.sun.net.ssl.internal.ssl.Handshaker.processLoop(Handshaker.java:593)
	at com.sun.net.ssl.internal.ssl.Handshaker.process_record(Handshaker.java:529)
	at com.sun.net.ssl.internal.ssl.SSLSocketImpl.readRecord(SSLSocketImpl.java:943)
	at com.sun.net.ssl.internal.ssl.SSLSocketImpl.performInitialHandshake(SSLSocketImpl.java:1188)
	at com.sun.net.ssl.internal.ssl.SSLSocketImpl.startHandshake(SSLSocketImpl.java:1215)
	... 15 more
Caused by: java.security.InvalidAlgorithmParameterException: Prime size must be multiple of
64, and can only range from 512 to 1024 (inclusive)
	at com.sun.crypto.provider.DHKeyPairGenerator.initialize(DashoA13*..)
	at java.security.KeyPairGenerator$Delegate.initialize(KeyPairGenerator.java:627)
	at com.sun.net.ssl.internal.ssl.DHCrypt.<init>(DHCrypt.java:107)
	... 22 more
[ERROR] 
[ERROR] Re-run Maven using the -X switch to enable full debug logging.
[ERROR] 
[ERROR] For more information about the errors and possible solutions, please read the following
articles:
[ERROR] [Help 1] http://cwiki.apache.org/confluence/display/MAVEN/MojoExecutionException

[JENKINS] Archiving <https://builds.apache.org/job/Oltu-OpenID-Conect/ws/trunk/openid-connect/pom.xml>
to org.apache.oltu.openidconnect/org.apache.oltu.openidconnect.parent/1-SNAPSHOT/org.apache.oltu.openidconnect.parent-1-SNAPSHOT.pom
[JENKINS] Archiving <https://builds.apache.org/job/Oltu-OpenID-Conect/ws/trunk/openid-connect/common/pom.xml>
to org.apache.oltu.openidconnect/org.apache.oltu.openidconnect.common/0.0.1-SNAPSHOT/org.apache.oltu.openidconnect.common-0.0.1-SNAPSHOT.pom
[JENKINS] Archiving <https://builds.apache.org/job/Oltu-OpenID-Conect/ws/trunk/openid-connect/client/pom.xml>
to org.apache.oltu.openidconnect/org.apache.oltu.openidconnect.client/0.0.1-SNAPSHOT/org.apache.oltu.openidconnect.client-0.0.1-SNAPSHOT.pom
Sending e-mails to: dev@oltu.apache.org
channel stopped

Mime
View raw message