oltu-dev mailing list archives

Site index · List index
Message view « Date » · « Thread »
Top « Date » · « Thread »
From Łukasz Dywicki <l...@code-house.org>
Subject Re: Build failed in Jenkins: Oltu #125
Date Tue, 08 Jul 2014 14:52:17 GMT
Seems that changes are OK but there is some infrastructure issue which
prevent builds from uploading artifacts..

2014-07-08 10:49 GMT+02:00 Simone Tripodi <simonetripodi@apache.org>:
> Hi again!
>
> Just checked in modifications in r1608691, let's wait for next Jenkins build :)
>
> Thanks once again for contributing!
> -Simo
>
> http://people.apache.org/~simonetripodi/
> http://twitter.com/simonetripodi
>
>
> On Tue, Jul 8, 2014 at 10:37 AM, Simone Tripodi
> <simonetripodi@apache.org> wrote:
>> Thanks Lukasz,
>> I am having a look at it right now! :)
>> Best,
>> -Simo
>> http://people.apache.org/~simonetripodi/
>> http://twitter.com/simonetripodi
>>
>>
>> On Tue, Jul 8, 2014 at 10:32 AM, Łukasz Dywicki <luke@code-house.org> wrote:
>>> Seems build didn't contain <extensions>true</extensions> for parent.
I
>>> updated my pull request and updated two other poms to refer reactor
>>> POM.
>>>
>>> Cheers,
>>> Lukasz
>>>
>>> 2014-07-08 10:07 GMT+02:00 Łukasz Dywicki <luke@code-house.org>:
>>>> Hey this seems to be very strange. I tested this locally with Maven
>>>> 3.2.1 and had no issues.. verifying.
>>>>
>>>> 2014-07-08 3:48 GMT+02:00 Apache Jenkins Server <jenkins@builds.apache.org>:
>>>>> See <https://builds.apache.org/job/Oltu/125/changes>
>>>>>
>>>>> Changes:
>>>>>
>>>>> [simonetripodi] OLTU-134 - Broken OSGi metadata
>>>>>
>>>>> applied patch submitted by Å ukasz Dywicki
>>>>>
>>>>> ------------------------------------------
>>>>> Started by an SCM change
>>>>> Building remotely on ubuntu2 (Ubuntu ubuntu) in workspace <https://builds.apache.org/job/Oltu/ws/>
>>>>> Updating https://svn.apache.org/repos/asf/oltu/trunk at revision '2014-07-08T01:43:26.729
+0000'
>>>>> U         demos/client-demo/pom.xml
>>>>> U         parent/pom.xml
>>>>> U         commons/json/pom.xml
>>>>> U         commons/encodedtoken/pom.xml
>>>>> U         oauth-2.0/client/pom.xml
>>>>> U         oauth-2.0/dynamicreg-client/pom.xml
>>>>> U         oauth-2.0/resourceserver/pom.xml
>>>>> U         oauth-2.0/resourceserver-filter/pom.xml
>>>>> U         oauth-2.0/authzserver/pom.xml
>>>>> U         oauth-2.0/httpclient4/pom.xml
>>>>> U         oauth-2.0/jwt/pom.xml
>>>>> U         oauth-2.0/dynamicreg-server/pom.xml
>>>>> U         oauth-2.0/common/pom.xml
>>>>> U         oauth-2.0/dynamicreg-common/pom.xml
>>>>> U         oauth-2.0/pom.xml
>>>>> U         jose/jws/pom.xml
>>>>> U         openid-connect/common/pom.xml
>>>>> U         openid-connect/client/pom.xml
>>>>> At revision 1608640
>>>>> Parsing POMs
>>>>> Downloaded artifact http://repo.maven.apache.org/maven2/org/apache/apache/10/apache-10.pom
>>>>> Downloaded artifact http://repo.maven.apache.org/maven2/org/apache/oltu/org.apache.oltu.parent/1/org.apache.oltu.parent-1.pom
>>>>> Modules changed, recalculating dependency graph
>>>>> maven3-agent.jar already up to date
>>>>> maven3-interceptor.jar already up to date
>>>>> maven3-interceptor-commons.jar already up to date
>>>>> [trunk] $ /home/hudson/tools/java/latest1.6/bin/java -da -dsa -XX:MaxPermSize=192m
-Xmx512M -cp /home/jenkins/jenkins-slave/maven3-agent.jar:/home/jenkins/jenkins-slave/tools/hudson.tasks.Maven_MavenInstallation/Maven_3.0.3/boot/plexus-classworlds-2.4.jar
org.jvnet.hudson.maven3.agent.Maven3Main /home/jenkins/jenkins-slave/tools/hudson.tasks.Maven_MavenInstallation/Maven_3.0.3
/home/hudson/jenkins-slave/slave.jar /home/jenkins/jenkins-slave/maven3-interceptor.jar /home/jenkins/jenkins-slave/maven3-interceptor-commons.jar
36098
>>>>> <===[JENKINS REMOTING CAPACITY]===>   channel started
>>>>> log4j:WARN No appenders could be found for logger (org.apache.commons.beanutils.converters.BooleanConverter).
>>>>> log4j:WARN Please initialize the log4j system properly.
>>>>> Executing Maven:  -B -f <https://builds.apache.org/job/Oltu/ws/trunk/pom.xml>
-Dmaven.repo.local=<https://builds.apache.org/job/Oltu/ws/.repository> -U -B -e clean
deploy
>>>>> [INFO] Error stacktraces are turned on.
>>>>> [INFO] Scanning for projects...
>>>>> [ERROR] The build could not read 15 projects -> [Help 1]
>>>>> org.apache.maven.project.ProjectBuildingException: Some problems were
encountered while processing the POMs:
>>>>> [ERROR] Unknown packaging: bundle @ line 29, column 14
>>>>> [ERROR] Unknown packaging: bundle @ line 29, column 14
>>>>> [ERROR] Unknown packaging: bundle @ line 28, column 14
>>>>> [ERROR] Unknown packaging: bundle @ line 28, column 14
>>>>> [ERROR] Unknown packaging: bundle @ line 27, column 14
>>>>> [ERROR] Unknown packaging: bundle @ line 28, column 14
>>>>> [ERROR] Unknown packaging: bundle @ line 28, column 14
>>>>> [ERROR] Unknown packaging: bundle @ line 28, column 14
>>>>> [ERROR] Unknown packaging: bundle @ line 28, column 14
>>>>> [ERROR] Unknown packaging: bundle @ line 28, column 14
>>>>> [ERROR] Unknown packaging: bundle @ line 28, column 14
>>>>> [ERROR] Unknown packaging: bundle @ line 28, column 14
>>>>> [ERROR] Unknown packaging: bundle @ line 29, column 14
>>>>> [ERROR] Unknown packaging: bundle @ line 29, column 14
>>>>> [ERROR] Unknown packaging: bundle @ line 29, column 14
>>>>>
>>>>>         at org.apache.maven.project.DefaultProjectBuilder.build(DefaultProjectBuilder.java:339)
>>>>>         at org.apache.maven.DefaultMaven.collectProjects(DefaultMaven.java:632)
>>>>>         at org.apache.maven.DefaultMaven.getProjectsForMavenReactor(DefaultMaven.java:581)
>>>>>         at org.apache.maven.DefaultMaven.doExecute(DefaultMaven.java:233)
>>>>>         at org.apache.maven.DefaultMaven.execute(DefaultMaven.java:156)
>>>>>         at org.jvnet.hudson.maven3.launcher.Maven3Launcher.main(Maven3Launcher.java:117)
>>>>>         at sun.reflect.NativeMethodAccessorImpl.invoke0(Native Method)
>>>>>         at sun.reflect.NativeMethodAccessorImpl.invoke(NativeMethodAccessorImpl.java:39)
>>>>>         at sun.reflect.DelegatingMethodAccessorImpl.invoke(DelegatingMethodAccessorImpl.java:25)
>>>>>         at java.lang.reflect.Method.invoke(Method.java:597)
>>>>>         at org.codehaus.plexus.classworlds.launcher.Launcher.launchStandard(Launcher.java:329)
>>>>>         at org.codehaus.plexus.classworlds.launcher.Launcher.launch(Launcher.java:239)
>>>>>         at org.jvnet.hudson.maven3.agent.Maven3Main.launch(Maven3Main.java:178)
>>>>>         at sun.reflect.NativeMethodAccessorImpl.invoke0(Native Method)
>>>>>         at sun.reflect.NativeMethodAccessorImpl.invoke(NativeMethodAccessorImpl.java:39)
>>>>>         at sun.reflect.DelegatingMethodAccessorImpl.invoke(DelegatingMethodAccessorImpl.java:25)
>>>>>         at java.lang.reflect.Method.invoke(Method.java:597)
>>>>>         at hudson.maven.Maven3Builder.call(Maven3Builder.java:134)
>>>>>         at hudson.maven.Maven3Builder.call(Maven3Builder.java:69)
>>>>>         at hudson.remoting.UserRequest.perform(UserRequest.java:118)
>>>>>         at hudson.remoting.UserRequest.perform(UserRequest.java:48)
>>>>>         at hudson.remoting.Request$2.run(Request.java:328)
>>>>>         at hudson.remoting.InterceptingExecutorService$1.call(InterceptingExecutorService.java:72)
>>>>>         at java.util.concurrent.FutureTask$Sync.innerRun(FutureTask.java:303)
>>>>>         at java.util.concurrent.FutureTask.run(FutureTask.java:138)
>>>>>         at java.util.concurrent.ThreadPoolExecutor$Worker.runTask(ThreadPoolExecutor.java:895)
>>>>>         at java.util.concurrent.ThreadPoolExecutor$Worker.run(ThreadPoolExecutor.java:918)
>>>>>         at java.lang.Thread.run(Thread.java:662)
>>>>> [ERROR]
>>>>> [ERROR]   The project org.apache.oltu.commons:org.apache.oltu.commons.encodedtoken:1.0.1-SNAPSHOT
(<https://builds.apache.org/job/Oltu/ws/trunk/commons/encodedtoken/pom.xml)> has 1 error
>>>>> [ERROR]     Unknown packaging: bundle @ line 29, column 14
>>>>> [ERROR]
>>>>> [ERROR]   The project org.apache.oltu.commons:org.apache.oltu.commons.json:1.0.1-SNAPSHOT
(<https://builds.apache.org/job/Oltu/ws/trunk/commons/json/pom.xml)> has 1 error
>>>>> [ERROR]     Unknown packaging: bundle @ line 29, column 14
>>>>> [ERROR]
>>>>> [ERROR]   The project org.apache.oltu.oauth2:org.apache.oltu.oauth2.common:1.0.1-SNAPSHOT
(<https://builds.apache.org/job/Oltu/ws/trunk/oauth-2.0/common/pom.xml)> has 1 error
>>>>> [ERROR]     Unknown packaging: bundle @ line 28, column 14
>>>>> [ERROR]
>>>>> [ERROR]   The project org.apache.oltu.oauth2:org.apache.oltu.oauth2.client:1.0.1-SNAPSHOT
(<https://builds.apache.org/job/Oltu/ws/trunk/oauth-2.0/client/pom.xml)> has 1 error
>>>>> [ERROR]     Unknown packaging: bundle @ line 28, column 14
>>>>> [ERROR]
>>>>> [ERROR]   The project org.apache.oltu.oauth2:org.apache.oltu.oauth2.httpclient4:1.0.1-SNAPSHOT
(<https://builds.apache.org/job/Oltu/ws/trunk/oauth-2.0/httpclient4/pom.xml)> has 1
error
>>>>> [ERROR]     Unknown packaging: bundle @ line 27, column 14
>>>>> [ERROR]
>>>>> [ERROR]   The project org.apache.oltu.oauth2:org.apache.oltu.oauth2.dynamicreg.client:1.0.1-SNAPSHOT
(<https://builds.apache.org/job/Oltu/ws/trunk/oauth-2.0/dynamicreg-client/pom.xml)>
has 1 error
>>>>> [ERROR]     Unknown packaging: bundle @ line 28, column 14
>>>>> [ERROR]
>>>>> [ERROR]   The project org.apache.oltu.oauth2:org.apache.oltu.oauth2.dynamicreg.common:1.0.1-SNAPSHOT
(<https://builds.apache.org/job/Oltu/ws/trunk/oauth-2.0/dynamicreg-common/pom.xml)>
has 1 error
>>>>> [ERROR]     Unknown packaging: bundle @ line 28, column 14
>>>>> [ERROR]
>>>>> [ERROR]   The project org.apache.oltu.oauth2:org.apache.oltu.oauth2.authzserver:1.0.1-SNAPSHOT
(<https://builds.apache.org/job/Oltu/ws/trunk/oauth-2.0/authzserver/pom.xml)> has 1
error
>>>>> [ERROR]     Unknown packaging: bundle @ line 28, column 14
>>>>> [ERROR]
>>>>> [ERROR]   The project org.apache.oltu.oauth2:org.apache.oltu.oauth2.resourceserver:1.0.1-SNAPSHOT
(<https://builds.apache.org/job/Oltu/ws/trunk/oauth-2.0/resourceserver/pom.xml)> has
1 error
>>>>> [ERROR]     Unknown packaging: bundle @ line 28, column 14
>>>>> [ERROR]
>>>>> [ERROR]   The project org.apache.oltu.oauth2:org.apache.oltu.oauth2.resourceserver-filter:1.0.1-SNAPSHOT
(<https://builds.apache.org/job/Oltu/ws/trunk/oauth-2.0/resourceserver-filter/pom.xml)>
has 1 error
>>>>> [ERROR]     Unknown packaging: bundle @ line 28, column 14
>>>>> [ERROR]
>>>>> [ERROR]   The project org.apache.oltu.oauth2:org.apache.oltu.oauth2.dynamicreg.server:1.0.1-SNAPSHOT
(<https://builds.apache.org/job/Oltu/ws/trunk/oauth-2.0/dynamicreg-server/pom.xml)>
has 1 error
>>>>> [ERROR]     Unknown packaging: bundle @ line 28, column 14
>>>>> [ERROR]
>>>>> [ERROR]   The project org.apache.oltu.oauth2:org.apache.oltu.oauth2.jwt:1.0.1-SNAPSHOT
(<https://builds.apache.org/job/Oltu/ws/trunk/oauth-2.0/jwt/pom.xml)> has 1 error
>>>>> [ERROR]     Unknown packaging: bundle @ line 28, column 14
>>>>> [ERROR]
>>>>> [ERROR]   The project org.apache.oltu.openidconnect:org.apache.oltu.openidconnect.common:0.0.1-SNAPSHOT
(<https://builds.apache.org/job/Oltu/ws/trunk/openid-connect/common/pom.xml)> has 1
error
>>>>> [ERROR]     Unknown packaging: bundle @ line 29, column 14
>>>>> [ERROR]
>>>>> [ERROR]   The project org.apache.oltu.openidconnect:org.apache.oltu.openidconnect.client:0.0.1-SNAPSHOT
(<https://builds.apache.org/job/Oltu/ws/trunk/openid-connect/client/pom.xml)> has 1
error
>>>>> [ERROR]     Unknown packaging: bundle @ line 29, column 14
>>>>> [ERROR]
>>>>> [ERROR]   The project org.apache.oltu.jose:org.apache.oltu.jose.jws:1.0.1-SNAPSHOT
(<https://builds.apache.org/job/Oltu/ws/trunk/jose/jws/pom.xml)> has 1 error
>>>>> [ERROR]     Unknown packaging: bundle @ line 29, column 14
>>>>> [ERROR]
>>>>> [ERROR] Re-run Maven using the -X switch to enable full debug logging.
>>>>> [ERROR]
>>>>> [ERROR] For more information about the errors and possible solutions,
please read the following articles:
>>>>> [ERROR] [Help 1] http://cwiki.apache.org/confluence/display/MAVEN/ProjectBuildingException
>>>>> channel stopped

Mime
View raw message