oltu-dev mailing list archives

Site index · List index
Message view « Date » · « Thread »
Top « Date » · « Thread »
From Apache Jenkins Server <jenk...@builds.apache.org>
Subject Build failed in Jenkins: Oltu-OAuth-2.0 #182
Date Mon, 07 Jul 2014 10:22:18 GMT
See <https://builds.apache.org/job/Oltu-OAuth-2.0/182/changes>

Changes:

[simonetripodi] OLTU-134 - Broken OSGi metadata

applied patch submitted by Łukasz Dywicki

------------------------------------------
Started by an SCM change
Building remotely on windows2 (Windows) in workspace <https://builds.apache.org/job/Oltu-OAuth-2.0/ws/>
Updating https://svn.apache.org/repos/asf/oltu/trunk at revision '2014-07-07T03:11:05.936
-0700'
U         parent\pom.xml
U         commons\json\pom.xml
U         commons\encodedtoken\pom.xml
U         oauth-2.0\common\pom.xml
U         oauth-2.0\dynamicreg-common\pom.xml
U         oauth-2.0\client\pom.xml
U         oauth-2.0\dynamicreg-client\pom.xml
U         oauth-2.0\resourceserver\pom.xml
U         oauth-2.0\resourceserver-filter\pom.xml
U         oauth-2.0\authzserver\pom.xml
U         oauth-2.0\httpclient4\pom.xml
U         oauth-2.0\jwt\pom.xml
U         oauth-2.0\dynamicreg-server\pom.xml
U         jose\jws\pom.xml
U         openid-connect\client\pom.xml
U         openid-connect\common\pom.xml
At revision 1608390
Parsing POMs
Downloaded artifact http://repo.maven.apache.org/maven2/org/apache/apache/10/apache-10.pom
Modules changed, recalculating dependency graph
maven3-agent.jar already up to date
maven3-interceptor.jar already up to date
maven3-interceptor-commons.jar already up to date
[oauth-2.0] $ f:\jenkins\tools\java\latest-1.6-64/bin/java -da -dsa -XX:MaxPermSize=192m -Xmx512M
-cp f:\jenkins\jenkins-slave\maven3-agent.jar;f:\jenkins\jenkins-slave\tools\hudson.tasks.Maven_MavenInstallation\Maven_3.0.3\boot\plexus-classworlds-2.4.jar
org.jvnet.hudson.maven3.agent.Maven3Main f:\jenkins\jenkins-slave\tools\hudson.tasks.Maven_MavenInstallation\Maven_3.0.3
F:\jenkins\jenkins-slave\slave.jar f:\jenkins\jenkins-slave\maven3-interceptor.jar f:\jenkins\jenkins-slave\maven3-interceptor-commons.jar
60481
<===[JENKINS REMOTING CAPACITY]===>   channel started
log4j:WARN No appenders could be found for logger (org.apache.commons.beanutils.converters.BooleanConverter).
log4j:WARN Please initialize the log4j system properly.
Executing Maven:  -B -f <https://builds.apache.org/job/Oltu-OAuth-2.0/ws/trunk\oauth-2.0\pom.xml>
-Dmaven.repo.local=<https://builds.apache.org/job/Oltu-OAuth-2.0/ws/.repository> -B
-e clean deploy
[INFO] Error stacktraces are turned on.
[INFO] Scanning for projects...
[ERROR] The build could not read 10 projects -> [Help 1]
org.apache.maven.project.ProjectBuildingException: Some problems were encountered while processing
the POMs:
[ERROR] Unknown packaging: bundle @ line 28, column 14
[ERROR] Unknown packaging: bundle @ line 28, column 14
[ERROR] Unknown packaging: bundle @ line 27, column 14
[ERROR] Unknown packaging: bundle @ line 28, column 14
[ERROR] Unknown packaging: bundle @ line 28, column 14
[ERROR] Unknown packaging: bundle @ line 28, column 14
[ERROR] Unknown packaging: bundle @ line 28, column 14
[ERROR] Unknown packaging: bundle @ line 28, column 14
[ERROR] Unknown packaging: bundle @ line 28, column 14
[ERROR] Unknown packaging: bundle @ line 28, column 14
[WARNING] 'parent.relativePath' of POM org.apache.oltu:org.apache.oltu.parent:3-SNAPSHOT (<https://builds.apache.org/job/Oltu-OAuth-2.0/ws/trunk\parent\pom.xml)>
points at org.apache.oltu:org.apache.oltu.reactor instead of org.apache:apache, please verify
your project structure @ org.apache.oltu:org.apache.oltu.parent:3-SNAPSHOT, <https://builds.apache.org/job/Oltu-OAuth-2.0/ws/trunk\parent\pom.xml,>
line 21, column 11

	at org.apache.maven.project.DefaultProjectBuilder.build(DefaultProjectBuilder.java:339)
	at org.apache.maven.DefaultMaven.collectProjects(DefaultMaven.java:632)
	at org.apache.maven.DefaultMaven.getProjectsForMavenReactor(DefaultMaven.java:581)
	at org.apache.maven.DefaultMaven.doExecute(DefaultMaven.java:233)
	at org.apache.maven.DefaultMaven.execute(DefaultMaven.java:156)
	at org.jvnet.hudson.maven3.launcher.Maven3Launcher.main(Maven3Launcher.java:117)
	at sun.reflect.NativeMethodAccessorImpl.invoke0(Native Method)
	at sun.reflect.NativeMethodAccessorImpl.invoke(NativeMethodAccessorImpl.java:39)
	at sun.reflect.DelegatingMethodAccessorImpl.invoke(DelegatingMethodAccessorImpl.java:25)
	at java.lang.reflect.Method.invoke(Method.java:597)
	at org.codehaus.plexus.classworlds.launcher.Launcher.launchStandard(Launcher.java:329)
	at org.codehaus.plexus.classworlds.launcher.Launcher.launch(Launcher.java:239)
	at org.jvnet.hudson.maven3.agent.Maven3Main.launch(Maven3Main.java:178)
	at sun.reflect.NativeMethodAccessorImpl.invoke0(Native Method)
	at sun.reflect.NativeMethodAccessorImpl.invoke(NativeMethodAccessorImpl.java:39)
	at sun.reflect.DelegatingMethodAccessorImpl.invoke(DelegatingMethodAccessorImpl.java:25)
	at java.lang.reflect.Method.invoke(Method.java:597)
	at hudson.maven.Maven3Builder.call(Maven3Builder.java:134)
	at hudson.maven.Maven3Builder.call(Maven3Builder.java:69)
	at hudson.remoting.UserRequest.perform(UserRequest.java:118)
	at hudson.remoting.UserRequest.perform(UserRequest.java:48)
	at hudson.remoting.Request$2.run(Request.java:328)
	at hudson.remoting.InterceptingExecutorService$1.call(InterceptingExecutorService.java:72)
	at java.util.concurrent.FutureTask$Sync.innerRun(FutureTask.java:303)
	at java.util.concurrent.FutureTask.run(FutureTask.java:138)
	at java.util.concurrent.ThreadPoolExecutor$Worker.runTask(ThreadPoolExecutor.java:886)
	at java.util.concurrent.ThreadPoolExecutor$Worker.run(ThreadPoolExecutor.java:908)
	at java.lang.Thread.run(Thread.java:662)
[ERROR]   
[ERROR]   The project org.apache.oltu.oauth2:org.apache.oltu.oauth2.common:1.0.1-SNAPSHOT
(F:\jenkins\jenkins-slave\workspace\Oltu-OAuth-2.0\trunk\oauth-2.0\common\pom.xml) has 1 error
[ERROR]     Unknown packaging: bundle @ line 28, column 14
[ERROR]   
[ERROR]   The project org.apache.oltu.oauth2:org.apache.oltu.oauth2.client:1.0.1-SNAPSHOT
(F:\jenkins\jenkins-slave\workspace\Oltu-OAuth-2.0\trunk\oauth-2.0\client\pom.xml) has 1 error
[ERROR]     Unknown packaging: bundle @ line 28, column 14
[ERROR]   
[ERROR]   The project org.apache.oltu.oauth2:org.apache.oltu.oauth2.httpclient4:1.0.1-SNAPSHOT
(F:\jenkins\jenkins-slave\workspace\Oltu-OAuth-2.0\trunk\oauth-2.0\httpclient4\pom.xml) has
1 error
[ERROR]     Unknown packaging: bundle @ line 27, column 14
[ERROR]   
[ERROR]   The project org.apache.oltu.oauth2:org.apache.oltu.oauth2.dynamicreg.client:1.0.1-SNAPSHOT
(F:\jenkins\jenkins-slave\workspace\Oltu-OAuth-2.0\trunk\oauth-2.0\dynamicreg-client\pom.xml)
has 1 error
[ERROR]     Unknown packaging: bundle @ line 28, column 14
[ERROR]   
[ERROR]   The project org.apache.oltu.oauth2:org.apache.oltu.oauth2.dynamicreg.common:1.0.1-SNAPSHOT
(F:\jenkins\jenkins-slave\workspace\Oltu-OAuth-2.0\trunk\oauth-2.0\dynamicreg-common\pom.xml)
has 1 error
[ERROR]     Unknown packaging: bundle @ line 28, column 14
[ERROR]   
[ERROR]   The project org.apache.oltu.oauth2:org.apache.oltu.oauth2.authzserver:1.0.1-SNAPSHOT
(F:\jenkins\jenkins-slave\workspace\Oltu-OAuth-2.0\trunk\oauth-2.0\authzserver\pom.xml) has
1 error
[ERROR]     Unknown packaging: bundle @ line 28, column 14
[ERROR]   
[ERROR]   The project org.apache.oltu.oauth2:org.apache.oltu.oauth2.resourceserver:1.0.1-SNAPSHOT
(F:\jenkins\jenkins-slave\workspace\Oltu-OAuth-2.0\trunk\oauth-2.0\resourceserver\pom.xml)
has 1 error
[ERROR]     Unknown packaging: bundle @ line 28, column 14
[ERROR]   
[ERROR]   The project org.apache.oltu.oauth2:org.apache.oltu.oauth2.resourceserver-filter:1.0.1-SNAPSHOT
(F:\jenkins\jenkins-slave\workspace\Oltu-OAuth-2.0\trunk\oauth-2.0\resourceserver-filter\pom.xml)
has 1 error
[ERROR]     Unknown packaging: bundle @ line 28, column 14
[ERROR]   
[ERROR]   The project org.apache.oltu.oauth2:org.apache.oltu.oauth2.dynamicreg.server:1.0.1-SNAPSHOT
(F:\jenkins\jenkins-slave\workspace\Oltu-OAuth-2.0\trunk\oauth-2.0\dynamicreg-server\pom.xml)
has 1 error
[ERROR]     Unknown packaging: bundle @ line 28, column 14
[ERROR]   
[ERROR]   The project org.apache.oltu.oauth2:org.apache.oltu.oauth2.jwt:1.0.1-SNAPSHOT (F:\jenkins\jenkins-slave\workspace\Oltu-OAuth-2.0\trunk\oauth-2.0\jwt\pom.xml)
has 1 error
[ERROR]     Unknown packaging: bundle @ line 28, column 14
[ERROR] 
[ERROR] Re-run Maven using the -X switch to enable full debug logging.
[ERROR] 
[ERROR] For more information about the errors and possible solutions, please read the following
articles:
[ERROR] [Help 1] http://cwiki.apache.org/confluence/display/MAVEN/ProjectBuildingException
channel stopped

Mime
View raw message