oltu-dev mailing list archives

Site index · List index
Message view « Date » · « Thread »
Top « Date » · « Thread »
From Apache Jenkins Server <jenk...@builds.apache.org>
Subject Build failed in Jenkins: Oltu #117
Date Thu, 06 Mar 2014 03:15:31 GMT
See <https://builds.apache.org/job/Oltu/117/changes>

Changes:

[simonetripodi] simplified download page

[simonetripodi] [maven-release-plugin] prepare for next development iteration

[simonetripodi] [maven-release-plugin] prepare release org.apache.oltu.oauth2.parent-1.0.0

[simonetripodi] releng: it doesn't have anymore sense to maintain a single file with global
changes file, since Oltu hosts multiple specs implementations and not only OAuth 2.0

------------------------------------------
[...truncated 3900 lines...]
Downloading: http://repo1.maven.org/maven2/org/tuckey/urlrewritefilter/3.1.0/urlrewritefilter-3.1.0.jar
Downloaded: http://repo1.maven.org/maven2/org/springframework/spring-aop/3.2.4.RELEASE/spring-aop-3.2.4.RELEASE.jar
(328 KB at 3412.4 KB/sec)
Downloaded: http://repo1.maven.org/maven2/org/springframework/spring-core/3.2.4.RELEASE/spring-core-3.2.4.RELEASE.jar
(850 KB at 9132.2 KB/sec)
Downloading: http://repo1.maven.org/maven2/taglibs/standard/1.1.2/standard-1.1.2.jar
Downloaded: http://repo1.maven.org/maven2/org/tuckey/urlrewritefilter/3.1.0/urlrewritefilter-3.1.0.jar
(144 KB at 8430.1 KB/sec)
Downloaded: http://repo1.maven.org/maven2/org/springframework/spring-webmvc/3.2.4.RELEASE/spring-webmvc-3.2.4.RELEASE.jar
(623 KB at 11310.2 KB/sec)
Downloaded: http://repo1.maven.org/maven2/taglibs/standard/1.1.2/standard-1.1.2.jar (385 KB
at 18287.7 KB/sec)
Downloaded: http://repo1.maven.org/maven2/org/springframework/spring-web/3.2.4.RELEASE/spring-web-3.2.4.RELEASE.jar
(612 KB at 10019.8 KB/sec)
Downloading: http://repository.apache.org/snapshots/org/apache/oltu/oauth2/org.apache.oltu.oauth2.dynamicreg.client/1.0.0-SNAPSHOT/org.apache.oltu.oauth2.dynamicreg.client-1.0.0-20140225.023206-85.jar
Downloading: http://repository.apache.org/snapshots/org/apache/oltu/oauth2/org.apache.oltu.oauth2.dynamicreg.common/1.0.0-SNAPSHOT/org.apache.oltu.oauth2.dynamicreg.common-1.0.0-20140225.023201-85.jar
Downloaded: http://repository.apache.org/snapshots/org/apache/oltu/oauth2/org.apache.oltu.oauth2.dynamicreg.client/1.0.0-SNAPSHOT/org.apache.oltu.oauth2.dynamicreg.client-1.0.0-20140225.023206-85.jar
(16 KB at 95.6 KB/sec)
Downloaded: http://repository.apache.org/snapshots/org/apache/oltu/oauth2/org.apache.oltu.oauth2.dynamicreg.common/1.0.0-SNAPSHOT/org.apache.oltu.oauth2.dynamicreg.common-1.0.0-20140225.023201-85.jar
(11 KB at 60.5 KB/sec)
[INFO] 
[INFO] --- maven-clean-plugin:2.5:clean (default-clean) @ org.apache.oltu.demos.client ---
[INFO] Deleting <https://builds.apache.org/job/Oltu/ws/trunk/demos/client-demo/target>
[INFO] 
[INFO] --- maven-enforcer-plugin:1.2:enforce (enforce-java) @ org.apache.oltu.demos.client
---
[INFO] 
[INFO] --- buildnumber-maven-plugin:1.2:create (default) @ org.apache.oltu.demos.client ---
[INFO] Checking for local modifications: skipped.
[INFO] Updating project files from SCM: skipped.
[INFO] Executing: /bin/sh -c cd <https://builds.apache.org/job/Oltu/ws/trunk/demos/client-demo>
&& svn --non-interactive info
[INFO] Working directory: <https://builds.apache.org/job/Oltu/ws/trunk/demos/client-demo>
[INFO] Storing buildNumber: 1536702 at timestamp: 1394075704731
[INFO] Executing: /bin/sh -c cd <https://builds.apache.org/job/Oltu/ws/trunk/demos/client-demo>
&& svn --non-interactive info
[INFO] Working directory: <https://builds.apache.org/job/Oltu/ws/trunk/demos/client-demo>
[INFO] Storing buildScmBranch: trunk
[INFO] 
[INFO] --- maven-remote-resources-plugin:1.2.1:process (default) @ org.apache.oltu.demos.client
---
Downloading: http://repository.apache.org/snapshots/org/apache/oltu/oauth2/org.apache.oltu.oauth2.dynamicreg.common/1.0.0-SNAPSHOT/maven-metadata.xml
Downloaded: http://repository.apache.org/snapshots/org/apache/oltu/oauth2/org.apache.oltu.oauth2.dynamicreg.common/1.0.0-SNAPSHOT/maven-metadata.xml
(815 B at 6.9 KB/sec)
Downloading: http://repository.apache.org/snapshots/org/apache/oltu/oauth2/org.apache.oltu.oauth2.dynamicreg.client/1.0.0-SNAPSHOT/maven-metadata.xml
Downloaded: http://repository.apache.org/snapshots/org/apache/oltu/oauth2/org.apache.oltu.oauth2.dynamicreg.client/1.0.0-SNAPSHOT/maven-metadata.xml
(2 KB at 13.6 KB/sec)
[INFO] 
[INFO] --- maven-resources-plugin:2.6:resources (default-resources) @ org.apache.oltu.demos.client
---
[INFO] Using 'UTF-8' encoding to copy filtered resources.
[INFO] Copying 3 resources
[INFO] Copying 3 resources
[INFO] 
[INFO] --- maven-compiler-plugin:3.1:compile (default-compile) @ org.apache.oltu.demos.client
---
[INFO] Changes detected - recompiling the module!
[INFO] Compiling 10 source files to <https://builds.apache.org/job/Oltu/ws/trunk/demos/client-demo/target/classes>
[INFO] 
[INFO] --- maven-bundle-plugin:2.3.7:manifest (bundle-manifest) @ org.apache.oltu.demos.client
---
[WARNING] Ignoring project type war - supportedProjectTypes = [jar, bundle]
[INFO] 
[INFO] --- maven-resources-plugin:2.6:testResources (default-testResources) @ org.apache.oltu.demos.client
---
[INFO] Using 'UTF-8' encoding to copy filtered resources.
[INFO] Copying 1 resource
[INFO] Copying 3 resources
[INFO] 
[INFO] --- maven-compiler-plugin:3.1:testCompile (default-testCompile) @ org.apache.oltu.demos.client
---
[INFO] No sources to compile
[INFO] 
[INFO] --- maven-surefire-plugin:2.14.1:test (default-test) @ org.apache.oltu.demos.client
---
[JENKINS] Recording test results[INFO] 
[INFO] --- maven-assembly-plugin:2.4:single (prepare-package) @ org.apache.oltu.demos.client
---
[INFO] Reading assembly descriptor: <https://builds.apache.org/job/Oltu/ws/trunk/demos/client-demo/src/main/assembly/prepare-war-legals.xml>

[INFO] Copying files to <https://builds.apache.org/job/Oltu/ws/trunk/demos/client-demo/target/war-legals>
[INFO] 
[INFO] --- maven-war-plugin:2.2:war (default-war) @ org.apache.oltu.demos.client ---
Downloading: http://repo1.maven.org/maven2/com/thoughtworks/xstream/xstream/1.3.1/xstream-1.3.1.pom
Downloaded: http://repo1.maven.org/maven2/com/thoughtworks/xstream/xstream/1.3.1/xstream-1.3.1.pom
(12 KB at 1240.6 KB/sec)
Downloading: http://repo1.maven.org/maven2/com/thoughtworks/xstream/xstream-parent/1.3.1/xstream-parent-1.3.1.pom
Downloaded: http://repo1.maven.org/maven2/com/thoughtworks/xstream/xstream-parent/1.3.1/xstream-parent-1.3.1.pom
(14 KB at 1050.9 KB/sec)
Downloading: http://repo1.maven.org/maven2/xpp3/xpp3_min/1.1.4c/xpp3_min-1.1.4c.pom
Downloaded: http://repo1.maven.org/maven2/xpp3/xpp3_min/1.1.4c/xpp3_min-1.1.4c.pom (2 KB at
314.5 KB/sec)
Downloading: http://repo1.maven.org/maven2/org/apache/maven/shared/maven-filtering/1.0-beta-2/maven-filtering-1.0-beta-2.pom
Downloaded: http://repo1.maven.org/maven2/org/apache/maven/shared/maven-filtering/1.0-beta-2/maven-filtering-1.0-beta-2.pom
(4 KB at 393.4 KB/sec)
Downloading: http://repo1.maven.org/maven2/org/apache/maven/shared/maven-shared-components/10/maven-shared-components-10.pom
Downloaded: http://repo1.maven.org/maven2/org/apache/maven/shared/maven-shared-components/10/maven-shared-components-10.pom
(9 KB at 1176.5 KB/sec)
Downloading: http://repo1.maven.org/maven2/org/apache/maven/maven-parent/9/maven-parent-9.pom
Downloaded: http://repo1.maven.org/maven2/org/apache/maven/maven-parent/9/maven-parent-9.pom
(33 KB at 5344.6 KB/sec)
Downloading: http://repo1.maven.org/maven2/org/codehaus/plexus/plexus-interpolation/1.6/plexus-interpolation-1.6.pom
Downloaded: http://repo1.maven.org/maven2/org/codehaus/plexus/plexus-interpolation/1.6/plexus-interpolation-1.6.pom
(3 KB at 567.8 KB/sec)
Downloading: http://repo1.maven.org/maven2/xpp3/xpp3_min/1.1.4c/xpp3_min-1.1.4c.jar
Downloading: http://repo1.maven.org/maven2/com/thoughtworks/xstream/xstream/1.3.1/xstream-1.3.1.jar
Downloading: http://repo1.maven.org/maven2/org/apache/maven/shared/maven-filtering/1.0-beta-2/maven-filtering-1.0-beta-2.jar
Downloaded: http://repo1.maven.org/maven2/xpp3/xpp3_min/1.1.4c/xpp3_min-1.1.4c.jar (25 KB
at 4061.8 KB/sec)
Downloaded: http://repo1.maven.org/maven2/org/apache/maven/shared/maven-filtering/1.0-beta-2/maven-filtering-1.0-beta-2.jar
(33 KB at 6480.3 KB/sec)
Downloaded: http://repo1.maven.org/maven2/com/thoughtworks/xstream/xstream/1.3.1/xstream-1.3.1.jar
(422 KB at 22173.4 KB/sec)
[INFO] Packaging webapp
[INFO] Assembling webapp [org.apache.oltu.demos.client] in [<https://builds.apache.org/job/Oltu/ws/trunk/demos/client-demo/target/org.apache.oltu.demos.client-1-SNAPSHOT]>
[INFO] Processing war project
[INFO] Copying webapp webResources [<https://builds.apache.org/job/Oltu/ws/trunk/demos/client-demo/src/main/resources/]>
to [<https://builds.apache.org/job/Oltu/ws/trunk/demos/client-demo/target/org.apache.oltu.demos.client-1-SNAPSHOT]>
[INFO] Copying webapp webResources [<https://builds.apache.org/job/Oltu/ws/trunk/demos/client-demo/target/war-legals/]>
to [<https://builds.apache.org/job/Oltu/ws/trunk/demos/client-demo/target/org.apache.oltu.demos.client-1-SNAPSHOT]>
[INFO] Copying webapp resources [<https://builds.apache.org/job/Oltu/ws/trunk/demos/client-demo/src/main/webapp]>
[INFO] Webapp assembled in [231 msecs]
[INFO] Building war: <https://builds.apache.org/job/Oltu/ws/trunk/demos/client-demo/target/org.apache.oltu.demos.client-1-SNAPSHOT.war>
[INFO] WEB-INF/web.xml already added, skipping
[INFO] 
[INFO] --- maven-site-plugin:3.0:attach-descriptor (attach-descriptor) @ org.apache.oltu.demos.client
---
[INFO] 
[INFO] --- maven-assembly-plugin:2.4:single (release-assembly) @ org.apache.oltu.demos.client
---
[INFO] Reading assembly descriptor: <https://builds.apache.org/job/Oltu/ws/trunk/demos/client-demo/src/main/assembly/bin.xml>
[INFO] ------------------------------------------------------------------------
[INFO] Reactor Summary:
[INFO] 
[INFO] Apache Oltu - Parent .............................. SUCCESS [28.843s]
[INFO] Apache Oltu - Commons - Parent .................... SUCCESS [2.299s]
[INFO] Apache Oltu - Commons - Encoded Token ............. SUCCESS [7.149s]
[INFO] Apache Oltu - Commons - JSON ...................... SUCCESS [2.946s]
[INFO] Apache Oltu - OAuth 2.0 - Parent .................. SUCCESS [2.078s]
[INFO] Apache Oltu - OAuth 2.0 - Common .................. SUCCESS [10.393s]
[INFO] Apache Oltu - OAuth 2.0 - Client .................. SUCCESS [8.494s]
[INFO] Apache Oltu - OAuth 2.0 - HttpClient .............. SUCCESS [6.290s]
[INFO] Apache Oltu - OAuth 2.0 - Dynamic Registration Common  SUCCESS [2.997s]
[INFO] Apache Oltu - OAuth 2.0 - Dynamic Registration Client  SUCCESS [4.932s]
[INFO] Apache Oltu - OAuth 2.0 - Authorization Server .... SUCCESS [9.219s]
[INFO] Apache Oltu - OAuth 2.0 - Resource Server ......... SUCCESS [6.500s]
[INFO] Apache Oltu - OAuth 2.0 - Resource Server Filter .. SUCCESS [5.536s]
[INFO] Apache Oltu - OAuth 2.0 - Test Utils .............. SUCCESS [3.369s]
[INFO] Apache Oltu - OAuth 2.0 - Dynamic Registration Server  SUCCESS [6.683s]
[INFO] Apache Oltu - OAuth 2.0 - Integration Tests ....... SUCCESS [11.999s]
[INFO] Apache Oltu - OAuth 2.0 - JWT ..................... SUCCESS [5.059s]
[INFO] Apache Oltu - OpenId Connect - Parent ............. SUCCESS [2.253s]
[INFO] Apache Oltu - OpenId Connect - Common ............. SUCCESS [3.735s]
[INFO] Apache Oltu - OpenId Connect - Client ............. SUCCESS [7.094s]
[INFO] Apache Oltu - JOSE - Parent ....................... SUCCESS [1.422s]
[INFO] Apache Oltu - JOSE - JWS .......................... SUCCESS [4.486s]
[INFO] Apache Oltu - Demos - Parent ...................... SUCCESS [2.173s]
[INFO] Apache Oltu - Demos - Client ...................... FAILURE [5.681s]
[INFO] Apache Oltu - Reactor ............................. SKIPPED
[INFO] ------------------------------------------------------------------------
[INFO] BUILD FAILURE
[INFO] ------------------------------------------------------------------------
[INFO] Total time: 3:10.357s
[INFO] Finished at: Thu Mar 06 03:15:09 UTC 2014
[INFO] Final Memory: 36M/128M
[INFO] ------------------------------------------------------------------------
Waiting for Jenkins to finish collecting data[ERROR] Failed to execute goal org.apache.maven.plugins:maven-assembly-plugin:2.4:single
(release-assembly) on project org.apache.oltu.demos.client: Failed to create assembly: Error
adding file to archive: <https://builds.apache.org/job/Oltu/ws/trunk/demos/client-demo/./../../CHANGES>
isn't a file. -> [Help 1]
org.apache.maven.lifecycle.LifecycleExecutionException: Failed to execute goal org.apache.maven.plugins:maven-assembly-plugin:2.4:single
(release-assembly) on project org.apache.oltu.demos.client: Failed to create assembly: Error
adding file to archive: <https://builds.apache.org/job/Oltu/ws/trunk/demos/client-demo/./../../CHANGES>
isn't a file.
	at org.apache.maven.lifecycle.internal.MojoExecutor.execute(MojoExecutor.java:217)
	at org.apache.maven.lifecycle.internal.MojoExecutor.execute(MojoExecutor.java:153)
	at org.apache.maven.lifecycle.internal.MojoExecutor.execute(MojoExecutor.java:145)
	at org.apache.maven.lifecycle.internal.LifecycleModuleBuilder.buildProject(LifecycleModuleBuilder.java:84)
	at org.apache.maven.lifecycle.internal.LifecycleModuleBuilder.buildProject(LifecycleModuleBuilder.java:59)
	at org.apache.maven.lifecycle.internal.LifecycleStarter.singleThreadedBuild(LifecycleStarter.java:183)
	at org.apache.maven.lifecycle.internal.LifecycleStarter.execute(LifecycleStarter.java:161)
	at org.apache.maven.DefaultMaven.doExecute(DefaultMaven.java:319)
	at org.apache.maven.DefaultMaven.execute(DefaultMaven.java:156)
	at org.jvnet.hudson.maven3.launcher.Maven3Launcher.main(Maven3Launcher.java:117)
	at sun.reflect.NativeMethodAccessorImpl.invoke0(Native Method)
	at sun.reflect.NativeMethodAccessorImpl.invoke(NativeMethodAccessorImpl.java:39)
	at sun.reflect.DelegatingMethodAccessorImpl.invoke(DelegatingMethodAccessorImpl.java:25)
	at java.lang.reflect.Method.invoke(Method.java:597)
	at org.codehaus.plexus.classworlds.launcher.Launcher.launchStandard(Launcher.java:329)
	at org.codehaus.plexus.classworlds.launcher.Launcher.launch(Launcher.java:239)
	at org.jvnet.hudson.maven3.agent.Maven3Main.launch(Maven3Main.java:178)
	at sun.reflect.NativeMethodAccessorImpl.invoke0(Native Method)
	at sun.reflect.NativeMethodAccessorImpl.invoke(NativeMethodAccessorImpl.java:39)
	at sun.reflect.DelegatingMethodAccessorImpl.invoke(DelegatingMethodAccessorImpl.java:25)
	at java.lang.reflect.Method.invoke(Method.java:597)
	at hudson.maven.Maven3Builder.call(Maven3Builder.java:134)
	at hudson.maven.Maven3Builder.call(Maven3Builder.java:69)
	at hudson.remoting.UserRequest.perform(UserRequest.java:118)
	at hudson.remoting.UserRequest.perform(UserRequest.java:48)
	at hudson.remoting.Request$2.run(Request.java:328)
	at hudson.remoting.InterceptingExecutorService$1.call(InterceptingExecutorService.java:72)
	at java.util.concurrent.FutureTask$Sync.innerRun(FutureTask.java:303)
	at java.util.concurrent.FutureTask.run(FutureTask.java:138)
	at java.util.concurrent.ThreadPoolExecutor$Worker.runTask(ThreadPoolExecutor.java:895)
	at java.util.concurrent.ThreadPoolExecutor$Worker.run(ThreadPoolExecutor.java:918)
	at java.lang.Thread.run(Thread.java:662)
Caused by: org.apache.maven.plugin.MojoExecutionException: Failed to create assembly: Error
adding file to archive: <https://builds.apache.org/job/Oltu/ws/trunk/demos/client-demo/./../../CHANGES>
isn't a file.
	at org.apache.maven.plugin.assembly.mojos.AbstractAssemblyMojo.execute(AbstractAssemblyMojo.java:495)
	at org.apache.maven.plugin.DefaultBuildPluginManager.executeMojo(DefaultBuildPluginManager.java:101)
	at org.apache.maven.lifecycle.internal.MojoExecutor.execute(MojoExecutor.java:209)
	... 31 more
Caused by: org.apache.maven.plugin.assembly.archive.ArchiveCreationException: Error adding
file to archive: <https://builds.apache.org/job/Oltu/ws/trunk/demos/client-demo/./../../CHANGES>
isn't a file.
	at org.apache.maven.plugin.assembly.archive.phase.FileItemAssemblyPhase.execute(FileItemAssemblyPhase.java:117)
	at org.apache.maven.plugin.assembly.archive.DefaultAssemblyArchiver.createArchive(DefaultAssemblyArchiver.java:183)
	at org.apache.maven.plugin.assembly.mojos.AbstractAssemblyMojo.execute(AbstractAssemblyMojo.java:436)
	... 33 more
Caused by: org.codehaus.plexus.archiver.ArchiverException: <https://builds.apache.org/job/Oltu/ws/trunk/demos/client-demo/./../../CHANGES>
isn't a file.
	at org.codehaus.plexus.archiver.AbstractArchiver.addFile(AbstractArchiver.java:386)
	at org.apache.maven.plugin.assembly.archive.archiver.AssemblyProxyArchiver.addFile(AssemblyProxyArchiver.java:463)
	at org.apache.maven.plugin.assembly.archive.phase.FileItemAssemblyPhase.execute(FileItemAssemblyPhase.java:113)
	... 35 more
[ERROR] 
[ERROR] Re-run Maven using the -X switch to enable full debug logging.
[ERROR] 
[ERROR] For more information about the errors and possible solutions, please read the following
articles:
[ERROR] [Help 1] http://cwiki.apache.org/confluence/display/MAVEN/MojoExecutionException
[ERROR] 
[ERROR] After correcting the problems, you can resume the build with the command
[ERROR]   mvn <goals> -rf :org.apache.oltu.demos.client

[JENKINS] Archiving <https://builds.apache.org/job/Oltu/ws/trunk/oauth-2.0/integration-tests/pom.xml>
to org.apache.oltu.oauth2/org.apache.oltu.oauth2.integration-tests/1.0.1-SNAPSHOT/org.apache.oltu.oauth2.integration-tests-1.0.1-SNAPSHOT.pom
[JENKINS] Archiving <https://builds.apache.org/job/Oltu/ws/trunk/oauth-2.0/integration-tests/target/org.apache.oltu.oauth2.integration-tests-1.0.1-SNAPSHOT.jar>
to org.apache.oltu.oauth2/org.apache.oltu.oauth2.integration-tests/1.0.1-20140306.031427-3/org.apache.oltu.oauth2.integration-tests-1.0.1-20140306.031427-3.jar
[JENKINS] Archiving <https://builds.apache.org/job/Oltu/ws/trunk/parent/pom.xml> to
org.apache.oltu/org.apache.oltu.parent/3-SNAPSHOT/org.apache.oltu.parent-3-SNAPSHOT.pom
[JENKINS] Archiving <https://builds.apache.org/job/Oltu/ws/trunk/parent/target/org.apache.oltu.parent-3-SNAPSHOT-site.xml>
to org.apache.oltu/org.apache.oltu.parent/3-20140306.031228-3/org.apache.oltu.parent-3-20140306.031228-3-site.xml
[JENKINS] Archiving <https://builds.apache.org/job/Oltu/ws/trunk/oauth-2.0/authzserver/pom.xml>
to org.apache.oltu.oauth2/org.apache.oltu.oauth2.authzserver/1.0.1-SNAPSHOT/org.apache.oltu.oauth2.authzserver-1.0.1-SNAPSHOT.pom
[JENKINS] Archiving <https://builds.apache.org/job/Oltu/ws/trunk/oauth-2.0/authzserver/target/org.apache.oltu.oauth2.authzserver-1.0.1-SNAPSHOT.jar>
to org.apache.oltu.oauth2/org.apache.oltu.oauth2.authzserver/1.0.1-20140306.031344-3/org.apache.oltu.oauth2.authzserver-1.0.1-20140306.031344-3.jar
[JENKINS] Archiving <https://builds.apache.org/job/Oltu/ws/trunk/oauth-2.0/authzserver/target/org.apache.oltu.oauth2.authzserver-1.0.1-SNAPSHOT-bin.tar.gz>
to org.apache.oltu.oauth2/org.apache.oltu.oauth2.authzserver/1.0.1-20140306.031344-3/org.apache.oltu.oauth2.authzserver-1.0.1-20140306.031344-3-bin.tar.gz
[JENKINS] Archiving <https://builds.apache.org/job/Oltu/ws/trunk/oauth-2.0/authzserver/target/org.apache.oltu.oauth2.authzserver-1.0.1-SNAPSHOT-bin.zip>
to org.apache.oltu.oauth2/org.apache.oltu.oauth2.authzserver/1.0.1-20140306.031344-3/org.apache.oltu.oauth2.authzserver-1.0.1-20140306.031344-3-bin.zip
[JENKINS] Archiving <https://builds.apache.org/job/Oltu/ws/trunk/oauth-2.0/jwt/pom.xml>
to org.apache.oltu.oauth2/org.apache.oltu.oauth2.jwt/1.0.1-SNAPSHOT/org.apache.oltu.oauth2.jwt-1.0.1-SNAPSHOT.pom
[JENKINS] Archiving <https://builds.apache.org/job/Oltu/ws/trunk/oauth-2.0/jwt/target/org.apache.oltu.oauth2.jwt-1.0.1-SNAPSHOT.jar>
to org.apache.oltu.oauth2/org.apache.oltu.oauth2.jwt/1.0.1-20140306.031432-3/org.apache.oltu.oauth2.jwt-1.0.1-20140306.031432-3.jar
[JENKINS] Archiving <https://builds.apache.org/job/Oltu/ws/trunk/oauth-2.0/resourceserver-filter/pom.xml>
to org.apache.oltu.oauth2/org.apache.oltu.oauth2.resourceserver-filter/1.0.1-SNAPSHOT/org.apache.oltu.oauth2.resourceserver-filter-1.0.1-SNAPSHOT.pom
[JENKINS] Archiving <https://builds.apache.org/job/Oltu/ws/trunk/oauth-2.0/resourceserver-filter/target/org.apache.oltu.oauth2.resourceserver-filter-1.0.1-SNAPSHOT.jar>
to org.apache.oltu.oauth2/org.apache.oltu.oauth2.resourceserver-filter/1.0.1-20140306.031359-3/org.apache.oltu.oauth2.resourceserver-filter-1.0.1-20140306.031359-3.jar
[JENKINS] Archiving <https://builds.apache.org/job/Oltu/ws/trunk/oauth-2.0/resourceserver-filter/target/org.apache.oltu.oauth2.resourceserver-filter-1.0.1-SNAPSHOT-bin.tar.gz>
to org.apache.oltu.oauth2/org.apache.oltu.oauth2.resourceserver-filter/1.0.1-20140306.031359-3/org.apache.oltu.oauth2.resourceserver-filter-1.0.1-20140306.031359-3-bin.tar.gz
[JENKINS] Archiving <https://builds.apache.org/job/Oltu/ws/trunk/oauth-2.0/resourceserver-filter/target/org.apache.oltu.oauth2.resourceserver-filter-1.0.1-SNAPSHOT-bin.zip>
to org.apache.oltu.oauth2/org.apache.oltu.oauth2.resourceserver-filter/1.0.1-20140306.031359-3/org.apache.oltu.oauth2.resourceserver-filter-1.0.1-20140306.031359-3-bin.zip
[JENKINS] Archiving <https://builds.apache.org/job/Oltu/ws/trunk/oauth-2.0/dynamicreg-client/pom.xml>
to org.apache.oltu.oauth2/org.apache.oltu.oauth2.dynamicreg.client/1.0.1-SNAPSHOT/org.apache.oltu.oauth2.dynamicreg.client-1.0.1-SNAPSHOT.pom
[JENKINS] Archiving <https://builds.apache.org/job/Oltu/ws/trunk/oauth-2.0/dynamicreg-client/target/org.apache.oltu.oauth2.dynamicreg.client-1.0.1-SNAPSHOT.jar>
to org.apache.oltu.oauth2/org.apache.oltu.oauth2.dynamicreg.client/1.0.1-20140306.031333-3/org.apache.oltu.oauth2.dynamicreg.client-1.0.1-20140306.031333-3.jar
[JENKINS] Archiving <https://builds.apache.org/job/Oltu/ws/trunk/oauth-2.0/dynamicreg-client/target/org.apache.oltu.oauth2.dynamicreg.client-1.0.1-SNAPSHOT-bin.tar.gz>
to org.apache.oltu.oauth2/org.apache.oltu.oauth2.dynamicreg.client/1.0.1-20140306.031333-3/org.apache.oltu.oauth2.dynamicreg.client-1.0.1-20140306.031333-3-bin.tar.gz
[JENKINS] Archiving <https://builds.apache.org/job/Oltu/ws/trunk/oauth-2.0/dynamicreg-client/target/org.apache.oltu.oauth2.dynamicreg.client-1.0.1-SNAPSHOT-bin.zip>
to org.apache.oltu.oauth2/org.apache.oltu.oauth2.dynamicreg.client/1.0.1-20140306.031333-3/org.apache.oltu.oauth2.dynamicreg.client-1.0.1-20140306.031333-3-bin.zip
[JENKINS] Archiving <https://builds.apache.org/job/Oltu/ws/trunk/commons/encodedtoken/pom.xml>
to org.apache.oltu.commons/org.apache.oltu.commons.encodedtoken/1.0.1-SNAPSHOT/org.apache.oltu.commons.encodedtoken-1.0.1-SNAPSHOT.pom
[JENKINS] Archiving <https://builds.apache.org/job/Oltu/ws/trunk/commons/encodedtoken/target/org.apache.oltu.commons.encodedtoken-1.0.1-SNAPSHOT.jar>
to org.apache.oltu.commons/org.apache.oltu.commons.encodedtoken/1.0.1-20140306.031243-3/org.apache.oltu.commons.encodedtoken-1.0.1-20140306.031243-3.jar
[JENKINS] Archiving <https://builds.apache.org/job/Oltu/ws/trunk/commons/json/pom.xml>
to org.apache.oltu.commons/org.apache.oltu.commons.json/1.0.1-SNAPSHOT/org.apache.oltu.commons.json-1.0.1-SNAPSHOT.pom
[JENKINS] Archiving <https://builds.apache.org/job/Oltu/ws/trunk/commons/json/target/org.apache.oltu.commons.json-1.0.1-SNAPSHOT.jar>
to org.apache.oltu.commons/org.apache.oltu.commons.json/1.0.1-20140306.031246-3/org.apache.oltu.commons.json-1.0.1-20140306.031246-3.jar
[JENKINS] Archiving <https://builds.apache.org/job/Oltu/ws/trunk/demos/client-demo/pom.xml>
to org.apache.oltu.demos/org.apache.oltu.demos.client/1-SNAPSHOT/org.apache.oltu.demos.client-1-SNAPSHOT.pom
[JENKINS] Archiving <https://builds.apache.org/job/Oltu/ws/trunk/demos/client-demo/target/org.apache.oltu.demos.client-1-SNAPSHOT.war>
to org.apache.oltu.demos/org.apache.oltu.demos.client/1-SNAPSHOT/org.apache.oltu.demos.client-1-SNAPSHOT.war
[JENKINS] Archiving <https://builds.apache.org/job/Oltu/ws/trunk/oauth-2.0/httpclient4/pom.xml>
to org.apache.oltu.oauth2/org.apache.oltu.oauth2.httpclient4/1.0.1-SNAPSHOT/org.apache.oltu.oauth2.httpclient4-1.0.1-SNAPSHOT.pom
[JENKINS] Archiving <https://builds.apache.org/job/Oltu/ws/trunk/oauth-2.0/httpclient4/target/org.apache.oltu.oauth2.httpclient4-1.0.1-SNAPSHOT.jar>
to org.apache.oltu.oauth2/org.apache.oltu.oauth2.httpclient4/1.0.1-20140306.031322-3/org.apache.oltu.oauth2.httpclient4-1.0.1-20140306.031322-3.jar
[JENKINS] Archiving <https://builds.apache.org/job/Oltu/ws/trunk/oauth-2.0/httpclient4/target/org.apache.oltu.oauth2.httpclient4-1.0.1-SNAPSHOT-bin.tar.gz>
to org.apache.oltu.oauth2/org.apache.oltu.oauth2.httpclient4/1.0.1-20140306.031322-3/org.apache.oltu.oauth2.httpclient4-1.0.1-20140306.031322-3-bin.tar.gz
[JENKINS] Archiving <https://builds.apache.org/job/Oltu/ws/trunk/oauth-2.0/httpclient4/target/org.apache.oltu.oauth2.httpclient4-1.0.1-SNAPSHOT-bin.zip>
to org.apache.oltu.oauth2/org.apache.oltu.oauth2.httpclient4/1.0.1-20140306.031322-3/org.apache.oltu.oauth2.httpclient4-1.0.1-20140306.031322-3-bin.zip
[JENKINS] Archiving <https://builds.apache.org/job/Oltu/ws/trunk/oauth-2.0/dynamicreg-common/pom.xml>
to org.apache.oltu.oauth2/org.apache.oltu.oauth2.dynamicreg.common/1.0.1-SNAPSHOT/org.apache.oltu.oauth2.dynamicreg.common-1.0.1-SNAPSHOT.pom
[JENKINS] Archiving <https://builds.apache.org/job/Oltu/ws/trunk/oauth-2.0/dynamicreg-common/target/org.apache.oltu.oauth2.dynamicreg.common-1.0.1-SNAPSHOT.jar>
to org.apache.oltu.oauth2/org.apache.oltu.oauth2.dynamicreg.common/1.0.1-20140306.031328-3/org.apache.oltu.oauth2.dynamicreg.common-1.0.1-20140306.031328-3.jar
[JENKINS] Archiving <https://builds.apache.org/job/Oltu/ws/trunk/oauth-2.0/resourceserver/pom.xml>
to org.apache.oltu.oauth2/org.apache.oltu.oauth2.resourceserver/1.0.1-SNAPSHOT/org.apache.oltu.oauth2.resourceserver-1.0.1-SNAPSHOT.pom
[JENKINS] Archiving <https://builds.apache.org/job/Oltu/ws/trunk/oauth-2.0/resourceserver/target/org.apache.oltu.oauth2.resourceserver-1.0.1-SNAPSHOT.jar>
to org.apache.oltu.oauth2/org.apache.oltu.oauth2.resourceserver/1.0.1-20140306.031352-3/org.apache.oltu.oauth2.resourceserver-1.0.1-20140306.031352-3.jar
[JENKINS] Archiving <https://builds.apache.org/job/Oltu/ws/trunk/oauth-2.0/resourceserver/target/org.apache.oltu.oauth2.resourceserver-1.0.1-SNAPSHOT-bin.tar.gz>
to org.apache.oltu.oauth2/org.apache.oltu.oauth2.resourceserver/1.0.1-20140306.031352-3/org.apache.oltu.oauth2.resourceserver-1.0.1-20140306.031352-3-bin.tar.gz
[JENKINS] Archiving <https://builds.apache.org/job/Oltu/ws/trunk/oauth-2.0/resourceserver/target/org.apache.oltu.oauth2.resourceserver-1.0.1-SNAPSHOT-bin.zip>
to org.apache.oltu.oauth2/org.apache.oltu.oauth2.resourceserver/1.0.1-20140306.031352-3/org.apache.oltu.oauth2.resourceserver-1.0.1-20140306.031352-3-bin.zip
[JENKINS] Archiving <https://builds.apache.org/job/Oltu/ws/trunk/oauth-2.0/client/pom.xml>
to org.apache.oltu.oauth2/org.apache.oltu.oauth2.client/1.0.1-SNAPSHOT/org.apache.oltu.oauth2.client-1.0.1-SNAPSHOT.pom
[JENKINS] Archiving <https://builds.apache.org/job/Oltu/ws/trunk/oauth-2.0/client/target/org.apache.oltu.oauth2.client-1.0.1-SNAPSHOT.jar>
to org.apache.oltu.oauth2/org.apache.oltu.oauth2.client/1.0.1-20140306.031314-3/org.apache.oltu.oauth2.client-1.0.1-20140306.031314-3.jar
[JENKINS] Archiving <https://builds.apache.org/job/Oltu/ws/trunk/oauth-2.0/client/target/org.apache.oltu.oauth2.client-1.0.1-SNAPSHOT-bin.tar.gz>
to org.apache.oltu.oauth2/org.apache.oltu.oauth2.client/1.0.1-20140306.031314-3/org.apache.oltu.oauth2.client-1.0.1-20140306.031314-3-bin.tar.gz
[JENKINS] Archiving <https://builds.apache.org/job/Oltu/ws/trunk/oauth-2.0/client/target/org.apache.oltu.oauth2.client-1.0.1-SNAPSHOT-bin.zip>
to org.apache.oltu.oauth2/org.apache.oltu.oauth2.client/1.0.1-20140306.031314-3/org.apache.oltu.oauth2.client-1.0.1-20140306.031314-3-bin.zip
[JENKINS] Archiving <https://builds.apache.org/job/Oltu/ws/trunk/openid-connect/pom.xml>
to org.apache.oltu.openidconnect/org.apache.oltu.openidconnect.parent/0.1-SNAPSHOT/org.apache.oltu.openidconnect.parent-0.1-SNAPSHOT.pom
[JENKINS] Archiving <https://builds.apache.org/job/Oltu/ws/trunk/jose/pom.xml> to org.apache.oltu.jose/org.apache.oltu.jose.parent/2-SNAPSHOT/org.apache.oltu.jose.parent-2-SNAPSHOT.pom
[JENKINS] Archiving <https://builds.apache.org/job/Oltu/ws/trunk/openid-connect/common/pom.xml>
to org.apache.oltu.openidconnect/org.apache.oltu.openidconnect.common/0.1-SNAPSHOT/org.apache.oltu.openidconnect.common-0.1-SNAPSHOT.pom
[JENKINS] Archiving <https://builds.apache.org/job/Oltu/ws/trunk/openid-connect/common/target/org.apache.oltu.openidconnect.common-0.1-SNAPSHOT.jar>
to org.apache.oltu.openidconnect/org.apache.oltu.openidconnect.common/0.1-20140306.031441-82/org.apache.oltu.openidconnect.common-0.1-20140306.031441-82.jar
[JENKINS] Archiving <https://builds.apache.org/job/Oltu/ws/trunk/oauth-2.0/dynamicreg-server/pom.xml>
to org.apache.oltu.oauth2/org.apache.oltu.oauth2.dynamicreg.server/1.0.1-SNAPSHOT/org.apache.oltu.oauth2.dynamicreg.server-1.0.1-SNAPSHOT.pom
[JENKINS] Archiving <https://builds.apache.org/job/Oltu/ws/trunk/oauth-2.0/dynamicreg-server/target/org.apache.oltu.oauth2.dynamicreg.server-1.0.1-SNAPSHOT.jar>
to org.apache.oltu.oauth2/org.apache.oltu.oauth2.dynamicreg.server/1.0.1-20140306.031412-3/org.apache.oltu.oauth2.dynamicreg.server-1.0.1-20140306.031412-3.jar
[JENKINS] Archiving <https://builds.apache.org/job/Oltu/ws/trunk/oauth-2.0/dynamicreg-server/target/org.apache.oltu.oauth2.dynamicreg.server-1.0.1-SNAPSHOT-bin.tar.gz>
to org.apache.oltu.oauth2/org.apache.oltu.oauth2.dynamicreg.server/1.0.1-20140306.031412-3/org.apache.oltu.oauth2.dynamicreg.server-1.0.1-20140306.031412-3-bin.tar.gz
[JENKINS] Archiving <https://builds.apache.org/job/Oltu/ws/trunk/oauth-2.0/dynamicreg-server/target/org.apache.oltu.oauth2.dynamicreg.server-1.0.1-SNAPSHOT-bin.zip>
to org.apache.oltu.oauth2/org.apache.oltu.oauth2.dynamicreg.server/1.0.1-20140306.031412-3/org.apache.oltu.oauth2.dynamicreg.server-1.0.1-20140306.031412-3-bin.zip
[JENKINS] Archiving <https://builds.apache.org/job/Oltu/ws/trunk/demos/pom.xml> to org.apache.oltu.demos/org.apache.oltu.demos.parent/1-SNAPSHOT/org.apache.oltu.demos.parent-1-SNAPSHOT.pom
[JENKINS] Archiving <https://builds.apache.org/job/Oltu/ws/trunk/jose/jws/pom.xml> to
org.apache.oltu.jose/org.apache.oltu.jose.jws/1.0.1-SNAPSHOT/org.apache.oltu.jose.jws-1.0.1-SNAPSHOT.pom
[JENKINS] Archiving <https://builds.apache.org/job/Oltu/ws/trunk/jose/jws/target/org.apache.oltu.jose.jws-1.0.1-SNAPSHOT.jar>
to org.apache.oltu.jose/org.apache.oltu.jose.jws/1.0.1-20140306.031457-2/org.apache.oltu.jose.jws-1.0.1-20140306.031457-2.jar
[JENKINS] Archiving <https://builds.apache.org/job/Oltu/ws/trunk/oauth-2.0/pom.xml>
to org.apache.oltu.oauth2/org.apache.oltu.oauth2.parent/1.0.1-SNAPSHOT/org.apache.oltu.oauth2.parent-1.0.1-SNAPSHOT.pom
[JENKINS] Archiving <https://builds.apache.org/job/Oltu/ws/trunk/commons/pom.xml> to
org.apache.oltu.commons/org.apache.oltu.commons.parent/2-SNAPSHOT/org.apache.oltu.commons.parent-2-SNAPSHOT.pom
[JENKINS] Archiving <https://builds.apache.org/job/Oltu/ws/trunk/openid-connect/client/pom.xml>
to org.apache.oltu.openidconnect/org.apache.oltu.openidconnect.client/0.1-SNAPSHOT/org.apache.oltu.openidconnect.client-0.1-SNAPSHOT.pom
[JENKINS] Archiving <https://builds.apache.org/job/Oltu/ws/trunk/openid-connect/client/target/org.apache.oltu.openidconnect.client-0.1-SNAPSHOT.jar>
to org.apache.oltu.openidconnect/org.apache.oltu.openidconnect.client/0.1-20140306.031449-75/org.apache.oltu.openidconnect.client-0.1-20140306.031449-75.jar
[JENKINS] Archiving <https://builds.apache.org/job/Oltu/ws/trunk/pom.xml> to org.apache.oltu/org.apache.oltu.reactor/1-SNAPSHOT/org.apache.oltu.reactor-1-SNAPSHOT.pom
[JENKINS] Archiving <https://builds.apache.org/job/Oltu/ws/trunk/oauth-2.0/test-utils/pom.xml>
to org.apache.oltu.oauth2/org.apache.oltu.oauth2.test-utils/1.0.1-SNAPSHOT/org.apache.oltu.oauth2.test-utils-1.0.1-SNAPSHOT.pom
[JENKINS] Archiving <https://builds.apache.org/job/Oltu/ws/trunk/oauth-2.0/test-utils/target/org.apache.oltu.oauth2.test-utils-1.0.1-SNAPSHOT.jar>
to org.apache.oltu.oauth2/org.apache.oltu.oauth2.test-utils/1.0.1-20140306.031406-3/org.apache.oltu.oauth2.test-utils-1.0.1-20140306.031406-3.jar
[JENKINS] Archiving <https://builds.apache.org/job/Oltu/ws/trunk/oauth-2.0/common/pom.xml>
to org.apache.oltu.oauth2/org.apache.oltu.oauth2.common/1.0.1-SNAPSHOT/org.apache.oltu.oauth2.common-1.0.1-SNAPSHOT.pom
[JENKINS] Archiving <https://builds.apache.org/job/Oltu/ws/trunk/oauth-2.0/common/target/org.apache.oltu.oauth2.common-1.0.1-SNAPSHOT.jar>
to org.apache.oltu.oauth2/org.apache.oltu.oauth2.common/1.0.1-20140306.031306-3/org.apache.oltu.oauth2.common-1.0.1-20140306.031306-3.jar
Sending e-mails to: dev@oltu.apache.org
channel stopped

Mime
View raw message