oltu-dev mailing list archives

Site index · List index
Message view « Date » · « Thread »
Top « Date » · « Thread »
From Apache Jenkins Server <jenk...@builds.apache.org>
Subject Build failed in Jenkins: Oltu-OpenID-Conect #62
Date Mon, 03 Feb 2014 13:12:12 GMT
See <https://builds.apache.org/job/Oltu-OpenID-Conect/62/changes>

Changes:

[simonetripodi] [maven-release-plugin] prepare release org.apache.oltu.commons.parent-1

[simonetripodi] [maven-release-plugin] rollback the release of org.apache.oltu.commons.parent-1

[simonetripodi] [maven-release-plugin] prepare release org.apache.oltu.commons.parent-1

------------------------------------------
[...truncated 857 lines...]
Downloaded: http://repo1.maven.org/maven2/org/apache/maven/doxia/doxia-module-apt/1.2/doxia-module-apt-1.2.pom
(3 KB at 47.0 KB/sec)
Downloading: http://repo1.maven.org/maven2/org/apache/maven/doxia/doxia-module-xdoc/1.2/doxia-module-xdoc-1.2.pom
Downloaded: http://repo1.maven.org/maven2/org/apache/maven/doxia/doxia-module-xdoc/1.2/doxia-module-xdoc-1.2.pom
(6 KB at 101.9 KB/sec)
Downloading: http://repo1.maven.org/maven2/org/apache/maven/doxia/doxia-module-fml/1.2/doxia-module-fml-1.2.pom
Downloaded: http://repo1.maven.org/maven2/org/apache/maven/doxia/doxia-module-fml/1.2/doxia-module-fml-1.2.pom
(6 KB at 103.7 KB/sec)
Downloading: http://repo1.maven.org/maven2/javax/servlet/servlet-api/2.5/servlet-api-2.5.pom
Downloaded: http://repo1.maven.org/maven2/javax/servlet/servlet-api/2.5/servlet-api-2.5.pom
(157 B at 2.9 KB/sec)
Downloading: http://repo1.maven.org/maven2/org/apache/maven/doxia/doxia-decoration-model/1.2/doxia-decoration-model-1.2.pom
Downloaded: http://repo1.maven.org/maven2/org/apache/maven/doxia/doxia-decoration-model/1.2/doxia-decoration-model-1.2.pom
(3 KB at 58.5 KB/sec)
Downloading: http://repo1.maven.org/maven2/org/apache/maven/doxia/doxia-sitetools/1.2/doxia-sitetools-1.2.pom
Downloaded: http://repo1.maven.org/maven2/org/apache/maven/doxia/doxia-sitetools/1.2/doxia-sitetools-1.2.pom
(16 KB at 301.7 KB/sec)
Downloading: http://repo1.maven.org/maven2/org/apache/maven/doxia/doxia-site-renderer/1.2/doxia-site-renderer-1.2.pom
Downloaded: http://repo1.maven.org/maven2/org/apache/maven/doxia/doxia-site-renderer/1.2/doxia-site-renderer-1.2.pom
(7 KB at 117.1 KB/sec)
Downloading: http://repo1.maven.org/maven2/org/codehaus/plexus/plexus-i18n/1.0-beta-7/plexus-i18n-1.0-beta-7.pom
Downloaded: http://repo1.maven.org/maven2/org/codehaus/plexus/plexus-i18n/1.0-beta-7/plexus-i18n-1.0-beta-7.pom
(2 KB at 19.9 KB/sec)
Downloading: http://repo1.maven.org/maven2/org/codehaus/plexus/plexus-components/1.1.12/plexus-components-1.1.12.pom
Downloaded: http://repo1.maven.org/maven2/org/codehaus/plexus/plexus-components/1.1.12/plexus-components-1.1.12.pom
(3 KB at 57.5 KB/sec)
Downloading: http://repo1.maven.org/maven2/org/codehaus/plexus/plexus-velocity/1.1.7/plexus-velocity-1.1.7.pom
Downloaded: http://repo1.maven.org/maven2/org/codehaus/plexus/plexus-velocity/1.1.7/plexus-velocity-1.1.7.pom
(2 KB at 36.8 KB/sec)
Downloading: http://repo1.maven.org/maven2/org/codehaus/plexus/plexus-container-default/1.0-alpha-20/plexus-container-default-1.0-alpha-20.pom
Downloaded: http://repo1.maven.org/maven2/org/codehaus/plexus/plexus-container-default/1.0-alpha-20/plexus-container-default-1.0-alpha-20.pom
(3 KB at 56.2 KB/sec)
Downloading: http://repo1.maven.org/maven2/org/codehaus/plexus/plexus-containers/1.0-alpha-20/plexus-containers-1.0-alpha-20.pom
Downloaded: http://repo1.maven.org/maven2/org/codehaus/plexus/plexus-containers/1.0-alpha-20/plexus-containers-1.0-alpha-20.pom
(2 KB at 35.4 KB/sec)
Downloading: http://repo1.maven.org/maven2/org/codehaus/plexus/plexus-utils/1.3/plexus-utils-1.3.pom
Downloaded: http://repo1.maven.org/maven2/org/codehaus/plexus/plexus-utils/1.3/plexus-utils-1.3.pom
(2 KB at 19.8 KB/sec)
Downloading: http://repo1.maven.org/maven2/org/codehaus/plexus/plexus-classworlds/1.2-alpha-7/plexus-classworlds-1.2-alpha-7.pom
Downloaded: http://repo1.maven.org/maven2/org/codehaus/plexus/plexus-classworlds/1.2-alpha-7/plexus-classworlds-1.2-alpha-7.pom
(3 KB at 44.5 KB/sec)
Downloading: http://repo1.maven.org/maven2/org/apache/maven/shared/maven-doxia-tools/1.4/maven-doxia-tools-1.4.pom
Downloaded: http://repo1.maven.org/maven2/org/apache/maven/shared/maven-doxia-tools/1.4/maven-doxia-tools-1.4.pom
(8 KB at 141.3 KB/sec)
Downloading: http://repo1.maven.org/maven2/commons-io/commons-io/1.4/commons-io-1.4.pom
Downloaded: http://repo1.maven.org/maven2/commons-io/commons-io/1.4/commons-io-1.4.pom (13
KB at 247.3 KB/sec)
Downloading: http://repo1.maven.org/maven2/org/apache/commons/commons-parent/7/commons-parent-7.pom
Downloaded: http://repo1.maven.org/maven2/org/apache/commons/commons-parent/7/commons-parent-7.pom
(18 KB at 322.4 KB/sec)
Downloading: http://repo1.maven.org/maven2/org/apache/maven/maven-artifact/2.2.1/maven-artifact-2.2.1.pom
Downloaded: http://repo1.maven.org/maven2/org/apache/maven/maven-artifact/2.2.1/maven-artifact-2.2.1.pom
(2 KB at 29.7 KB/sec)
Downloading: http://repo1.maven.org/maven2/org/apache/maven/maven/2.2.1/maven-2.2.1.pom
Downloaded: http://repo1.maven.org/maven2/org/apache/maven/maven/2.2.1/maven-2.2.1.pom (22
KB at 429.1 KB/sec)
Downloading: http://repo1.maven.org/maven2/org/apache/maven/maven-model/2.2.1/maven-model-2.2.1.pom
Downloaded: http://repo1.maven.org/maven2/org/apache/maven/maven-model/2.2.1/maven-model-2.2.1.pom
(4 KB at 60.8 KB/sec)
Downloading: http://repo1.maven.org/maven2/org/apache/maven/maven-plugin-api/2.2.1/maven-plugin-api-2.2.1.pom
Downloaded: http://repo1.maven.org/maven2/org/apache/maven/maven-plugin-api/2.2.1/maven-plugin-api-2.2.1.pom
(2 KB at 27.4 KB/sec)
Downloading: http://repo1.maven.org/maven2/org/codehaus/plexus/plexus-utils/1.5.10/plexus-utils-1.5.10.pom
Downloaded: http://repo1.maven.org/maven2/org/codehaus/plexus/plexus-utils/1.5.10/plexus-utils-1.5.10.pom
(6 KB at 105.8 KB/sec)
Downloading: http://repo1.maven.org/maven2/org/mortbay/jetty/jetty/6.1.25/jetty-6.1.25.pom
Downloaded: http://repo1.maven.org/maven2/org/mortbay/jetty/jetty/6.1.25/jetty-6.1.25.pom
(7 KB at 115.3 KB/sec)
Downloading: http://repo1.maven.org/maven2/org/mortbay/jetty/project/6.1.25/project-6.1.25.pom
Downloaded: http://repo1.maven.org/maven2/org/mortbay/jetty/project/6.1.25/project-6.1.25.pom
(9 KB at 176.3 KB/sec)
Downloading: http://repo1.maven.org/maven2/org/mortbay/jetty/jetty-parent/10/jetty-parent-10.pom
Downloaded: http://repo1.maven.org/maven2/org/mortbay/jetty/jetty-parent/10/jetty-parent-10.pom
(4 KB at 60.6 KB/sec)
Downloading: http://repo1.maven.org/maven2/org/eclipse/jetty/jetty-parent/14/jetty-parent-14.pom
Downloaded: http://repo1.maven.org/maven2/org/eclipse/jetty/jetty-parent/14/jetty-parent-14.pom
(17 KB at 303.7 KB/sec)
Downloading: http://repo1.maven.org/maven2/org/mortbay/jetty/jetty-util/6.1.25/jetty-util-6.1.25.pom
Downloaded: http://repo1.maven.org/maven2/org/mortbay/jetty/jetty-util/6.1.25/jetty-util-6.1.25.pom
(4 KB at 72.8 KB/sec)
Downloading: http://repo1.maven.org/maven2/org/mortbay/jetty/servlet-api/2.5-20081211/servlet-api-2.5-20081211.pom
Downloaded: http://repo1.maven.org/maven2/org/mortbay/jetty/servlet-api/2.5-20081211/servlet-api-2.5-20081211.pom
(3 KB at 49.3 KB/sec)
Downloading: http://repo1.maven.org/maven2/org/mortbay/jetty/jetty-parent/7/jetty-parent-7.pom
Downloaded: http://repo1.maven.org/maven2/org/mortbay/jetty/jetty-parent/7/jetty-parent-7.pom
(13 KB at 245.2 KB/sec)
Downloading: http://repo1.maven.org/maven2/commons-lang/commons-lang/2.5/commons-lang-2.5.pom
Downloaded: http://repo1.maven.org/maven2/commons-lang/commons-lang/2.5/commons-lang-2.5.pom
(17 KB at 265.5 KB/sec)
Downloading: http://repo1.maven.org/maven2/org/apache/commons/commons-parent/12/commons-parent-12.pom
Downloaded: http://repo1.maven.org/maven2/org/apache/commons/commons-parent/12/commons-parent-12.pom
(27 KB at 496.0 KB/sec)
Downloading: http://repo1.maven.org/maven2/org/apache/maven/wagon/wagon-ssh/1.0/wagon-ssh-1.0.jar
Downloading: http://repo1.maven.org/maven2/com/jcraft/jsch/0.1.44-1/jsch-0.1.44-1.jar
Downloading: http://repo1.maven.org/maven2/org/apache/maven/reporting/maven-reporting-exec/1.0.1/maven-reporting-exec-1.0.1.jar
Downloading: http://repo1.maven.org/maven2/org/codehaus/plexus/plexus-interactivity-api/1.0-alpha-6/plexus-interactivity-api-1.0-alpha-6.jar
Downloading: http://repo1.maven.org/maven2/org/apache/maven/wagon/wagon-ssh-common/1.0/wagon-ssh-common-1.0.jar
Downloaded: http://repo1.maven.org/maven2/org/apache/maven/wagon/wagon-ssh/1.0/wagon-ssh-1.0.jar
(28 KB at 521.7 KB/sec)
Downloading: http://repo1.maven.org/maven2/org/apache/maven/reporting/maven-reporting-api/3.0/maven-reporting-api-3.0.jar
Downloaded: http://repo1.maven.org/maven2/org/apache/maven/reporting/maven-reporting-api/3.0/maven-reporting-api-3.0.jar
(11 KB at 205.5 KB/sec)
Downloading: http://repo1.maven.org/maven2/org/apache/velocity/velocity/1.5/velocity-1.5.jar
Downloaded: http://repo1.maven.org/maven2/org/codehaus/plexus/plexus-interactivity-api/1.0-alpha-6/plexus-interactivity-api-1.0-alpha-6.jar
(12 KB at 88.6 KB/sec)
Downloading: http://repo1.maven.org/maven2/org/sonatype/aether/aether-util/1.7/aether-util-1.7.jar
Downloaded: http://repo1.maven.org/maven2/org/apache/maven/reporting/maven-reporting-exec/1.0.1/maven-reporting-exec-1.0.1.jar
(22 KB at 129.9 KB/sec)
Downloading: http://repo1.maven.org/maven2/org/sonatype/sisu/sisu-inject-bean/1.4.2/sisu-inject-bean-1.4.2.jar
Downloaded: http://repo1.maven.org/maven2/org/apache/maven/wagon/wagon-ssh-common/1.0/wagon-ssh-common-1.0.jar
(26 KB at 159.2 KB/sec)
Downloading: http://repo1.maven.org/maven2/org/sonatype/sisu/sisu-guice/2.1.7/sisu-guice-2.1.7-noaop.jar
Downloaded: http://repo1.maven.org/maven2/com/jcraft/jsch/0.1.44-1/jsch-0.1.44-1.jar (209
KB at 628.8 KB/sec)
Downloading: http://repo1.maven.org/maven2/org/codehaus/plexus/plexus-interpolation/1.14/plexus-interpolation-1.14.jar
Downloaded: http://repo1.maven.org/maven2/org/sonatype/aether/aether-util/1.7/aether-util-1.7.jar
(106 KB at 524.5 KB/sec)
Downloading: http://repo1.maven.org/maven2/org/sonatype/plexus/plexus-sec-dispatcher/1.3/plexus-sec-dispatcher-1.3.jar
Downloaded: http://repo1.maven.org/maven2/org/sonatype/sisu/sisu-inject-bean/1.4.2/sisu-inject-bean-1.4.2.jar
(150 KB at 739.6 KB/sec)
Downloading: http://repo1.maven.org/maven2/org/sonatype/plexus/plexus-cipher/1.4/plexus-cipher-1.4.jar
Downloaded: http://repo1.maven.org/maven2/org/apache/velocity/velocity/1.5/velocity-1.5.jar
(383 KB at 1280.7 KB/sec)
Downloading: http://repo1.maven.org/maven2/org/apache/maven/doxia/doxia-sink-api/1.2/doxia-sink-api-1.2.jar
Downloaded: http://repo1.maven.org/maven2/org/codehaus/plexus/plexus-interpolation/1.14/plexus-interpolation-1.14.jar
(60 KB at 828.3 KB/sec)
Downloading: http://repo1.maven.org/maven2/org/apache/maven/doxia/doxia-logging-api/1.2/doxia-logging-api-1.2.jar
Downloaded: http://repo1.maven.org/maven2/org/sonatype/plexus/plexus-sec-dispatcher/1.3/plexus-sec-dispatcher-1.3.jar
(28 KB at 387.3 KB/sec)
Downloading: http://repo1.maven.org/maven2/org/apache/maven/doxia/doxia-core/1.2/doxia-core-1.2.jar
Downloaded: http://repo1.maven.org/maven2/org/sonatype/plexus/plexus-cipher/1.4/plexus-cipher-1.4.jar
(14 KB at 193.8 KB/sec)
Downloading: http://repo1.maven.org/maven2/xerces/xercesImpl/2.9.1/xercesImpl-2.9.1.jar
Downloaded: http://repo1.maven.org/maven2/org/apache/maven/doxia/doxia-sink-api/1.2/doxia-sink-api-1.2.jar
(11 KB at 215.2 KB/sec)
Downloading: http://repo1.maven.org/maven2/xml-apis/xml-apis/1.3.04/xml-apis-1.3.04.jar
Downloaded: http://repo1.maven.org/maven2/org/apache/maven/doxia/doxia-logging-api/1.2/doxia-logging-api-1.2.jar
(12 KB at 158.3 KB/sec)
Downloading: http://repo1.maven.org/maven2/org/apache/httpcomponents/httpclient/4.0.2/httpclient-4.0.2.jar
Downloaded: http://repo1.maven.org/maven2/org/sonatype/sisu/sisu-guice/2.1.7/sisu-guice-2.1.7-noaop.jar
(461 KB at 1379.3 KB/sec)
Downloading: http://repo1.maven.org/maven2/org/apache/httpcomponents/httpcore/4.0.1/httpcore-4.0.1.jar
Downloaded: http://repo1.maven.org/maven2/org/apache/maven/doxia/doxia-core/1.2/doxia-core-1.2.jar
(151 KB at 901.3 KB/sec)
Downloading: http://repo1.maven.org/maven2/commons-codec/commons-codec/1.3/commons-codec-1.3.jar
Downloaded: http://repo1.maven.org/maven2/org/apache/httpcomponents/httpcore/4.0.1/httpcore-4.0.1.jar
(169 KB at 1639.2 KB/sec)
Downloading: http://repo1.maven.org/maven2/org/apache/maven/doxia/doxia-module-xhtml/1.2/doxia-module-xhtml-1.2.jar
Downloaded: http://repo1.maven.org/maven2/xml-apis/xml-apis/1.3.04/xml-apis-1.3.04.jar (190
KB at 1256.9 KB/sec)
Downloading: http://repo1.maven.org/maven2/org/apache/maven/doxia/doxia-module-apt/1.2/doxia-module-apt-1.2.jar
Downloaded: http://repo1.maven.org/maven2/commons-codec/commons-codec/1.3/commons-codec-1.3.jar
(46 KB at 651.9 KB/sec)
Downloading: http://repo1.maven.org/maven2/org/apache/maven/doxia/doxia-module-xdoc/1.2/doxia-module-xdoc-1.2.jar
Downloaded: http://repo1.maven.org/maven2/org/apache/httpcomponents/httpclient/4.0.2/httpclient-4.0.2.jar
(287 KB at 1682.5 KB/sec)
Downloading: http://repo1.maven.org/maven2/org/apache/maven/doxia/doxia-module-fml/1.2/doxia-module-fml-1.2.jar
Downloaded: http://repo1.maven.org/maven2/org/apache/maven/doxia/doxia-module-xhtml/1.2/doxia-module-xhtml-1.2.jar
(15 KB at 216.8 KB/sec)
Downloading: http://repo1.maven.org/maven2/javax/servlet/servlet-api/2.5/servlet-api-2.5.jar
Downloaded: http://repo1.maven.org/maven2/org/apache/maven/doxia/doxia-module-apt/1.2/doxia-module-apt-1.2.jar
(51 KB at 658.7 KB/sec)
Downloading: http://repo1.maven.org/maven2/org/apache/maven/doxia/doxia-decoration-model/1.2/doxia-decoration-model-1.2.jar
Downloaded: http://repo1.maven.org/maven2/org/apache/maven/doxia/doxia-module-fml/1.2/doxia-module-fml-1.2.jar
(37 KB at 492.9 KB/sec)
Downloading: http://repo1.maven.org/maven2/org/apache/maven/doxia/doxia-site-renderer/1.2/doxia-site-renderer-1.2.jar
Downloaded: http://repo1.maven.org/maven2/org/apache/maven/doxia/doxia-module-xdoc/1.2/doxia-module-xdoc-1.2.jar
(36 KB at 458.1 KB/sec)
Downloading: http://repo1.maven.org/maven2/commons-collections/commons-collections/3.2.1/commons-collections-3.2.1.jar
Downloaded: http://repo1.maven.org/maven2/javax/servlet/servlet-api/2.5/servlet-api-2.5.jar
(103 KB at 1316.0 KB/sec)
Downloading: http://repo1.maven.org/maven2/org/apache/maven/shared/maven-doxia-tools/1.4/maven-doxia-tools-1.4.jar
Downloaded: http://repo1.maven.org/maven2/org/apache/maven/doxia/doxia-decoration-model/1.2/doxia-decoration-model-1.2.jar
(59 KB at 747.9 KB/sec)
Downloading: http://repo1.maven.org/maven2/org/codehaus/plexus/plexus-i18n/1.0-beta-7/plexus-i18n-1.0-beta-7.jar
Downloaded: http://repo1.maven.org/maven2/org/apache/maven/doxia/doxia-site-renderer/1.2/doxia-site-renderer-1.2.jar
(51 KB at 660.7 KB/sec)
Downloading: http://repo1.maven.org/maven2/org/codehaus/plexus/plexus-utils/1.5.10/plexus-utils-1.5.10.jar
Downloaded: http://repo1.maven.org/maven2/xerces/xercesImpl/2.9.1/xercesImpl-2.9.1.jar (1201
KB at 3279.6 KB/sec)
Downloading: http://repo1.maven.org/maven2/org/mortbay/jetty/jetty/6.1.25/jetty-6.1.25.jar
Downloaded: http://repo1.maven.org/maven2/org/codehaus/plexus/plexus-i18n/1.0-beta-7/plexus-i18n-1.0-beta-7.jar
(11 KB at 168.2 KB/sec)
Downloading: http://repo1.maven.org/maven2/org/mortbay/jetty/servlet-api/2.5-20081211/servlet-api-2.5-20081211.jar
Downloaded: http://repo1.maven.org/maven2/org/apache/maven/shared/maven-doxia-tools/1.4/maven-doxia-tools-1.4.jar
(45 KB at 558.4 KB/sec)
Downloading: http://repo1.maven.org/maven2/org/mortbay/jetty/jetty-util/6.1.25/jetty-util-6.1.25.jar
Downloaded: http://repo1.maven.org/maven2/org/mortbay/jetty/jetty/6.1.25/jetty-6.1.25.jar
(526 KB at 4870.0 KB/sec)
Downloading: http://repo1.maven.org/maven2/commons-lang/commons-lang/2.5/commons-lang-2.5.jar
Downloaded: http://repo1.maven.org/maven2/org/mortbay/jetty/jetty-util/6.1.25/jetty-util-6.1.25.jar
(174 KB at 1679.8 KB/sec)
Downloading: http://repo1.maven.org/maven2/commons-io/commons-io/1.4/commons-io-1.4.jar
Downloaded: http://repo1.maven.org/maven2/org/codehaus/plexus/plexus-utils/1.5.10/plexus-utils-1.5.10.jar
(274 KB at 2014.3 KB/sec)
Downloaded: http://repo1.maven.org/maven2/org/mortbay/jetty/servlet-api/2.5-20081211/servlet-api-2.5-20081211.jar
(131 KB at 1039.6 KB/sec)
Downloaded: http://repo1.maven.org/maven2/commons-collections/commons-collections/3.2.1/commons-collections-3.2.1.jar
(562 KB at 2411.6 KB/sec)
Downloaded: http://repo1.maven.org/maven2/commons-lang/commons-lang/2.5/commons-lang-2.5.jar
(273 KB at 3786.8 KB/sec)
Downloaded: http://repo1.maven.org/maven2/commons-io/commons-io/1.4/commons-io-1.4.jar (107
KB at 1499.8 KB/sec)
[INFO] 
[INFO] --- maven-install-plugin:2.4:install (default-install) @ org.apache.oltu.openidconnect.parent
---
Downloading: http://repo1.maven.org/maven2/org/codehaus/plexus/plexus-utils/3.0.5/plexus-utils-3.0.5.pom
Downloaded: http://repo1.maven.org/maven2/org/codehaus/plexus/plexus-utils/3.0.5/plexus-utils-3.0.5.pom
(3 KB at 35.0 KB/sec)
Downloading: http://repo1.maven.org/maven2/org/codehaus/plexus/plexus-digest/1.0/plexus-digest-1.0.pom
Downloaded: http://repo1.maven.org/maven2/org/codehaus/plexus/plexus-digest/1.0/plexus-digest-1.0.pom
(2 KB at 15.0 KB/sec)
Downloading: http://repo1.maven.org/maven2/org/codehaus/plexus/plexus-components/1.1.7/plexus-components-1.1.7.pom
Downloaded: http://repo1.maven.org/maven2/org/codehaus/plexus/plexus-components/1.1.7/plexus-components-1.1.7.pom
(5 KB at 70.4 KB/sec)
Downloading: http://repo1.maven.org/maven2/org/codehaus/plexus/plexus-utils/3.0.5/plexus-utils-3.0.5.jar
Downloading: http://repo1.maven.org/maven2/org/codehaus/plexus/plexus-digest/1.0/plexus-digest-1.0.jar
Downloaded: http://repo1.maven.org/maven2/org/codehaus/plexus/plexus-digest/1.0/plexus-digest-1.0.jar
(12 KB at 165.4 KB/sec)
Downloaded: http://repo1.maven.org/maven2/org/codehaus/plexus/plexus-utils/3.0.5/plexus-utils-3.0.5.jar
(226 KB at 1667.0 KB/sec)
[INFO] Installing <https://builds.apache.org/job/Oltu-OpenID-Conect/ws/trunk\openid-connect\pom.xml>
to <https://builds.apache.org/job/Oltu-OpenID-Conect/ws/.repository\org\apache\oltu\openidconnect\org.apache.oltu.openidconnect.parent\0.1-SNAPSHOT\org.apache.oltu.openidconnect.parent-0.1-SNAPSHOT.pom>
[INFO] 
[INFO] --- maven-deploy-plugin:2.7:deploy (default-deploy) @ org.apache.oltu.openidconnect.parent
---
Downloading: http://repo1.maven.org/maven2/org/codehaus/plexus/plexus-utils/1.5.6/plexus-utils-1.5.6.pom
Downloaded: http://repo1.maven.org/maven2/org/codehaus/plexus/plexus-utils/1.5.6/plexus-utils-1.5.6.pom
(6 KB at 76.1 KB/sec)
Downloading: http://repo1.maven.org/maven2/org/codehaus/plexus/plexus/1.0.12/plexus-1.0.12.pom
Downloaded: http://repo1.maven.org/maven2/org/codehaus/plexus/plexus/1.0.12/plexus-1.0.12.pom
(10 KB at 134.8 KB/sec)
Downloading: http://repo1.maven.org/maven2/org/codehaus/plexus/plexus-utils/1.5.6/plexus-utils-1.5.6.jar
Downloaded: http://repo1.maven.org/maven2/org/codehaus/plexus/plexus-utils/1.5.6/plexus-utils-1.5.6.jar
(245 KB at 1609.7 KB/sec)
Downloading: https://repository.apache.org/content/repositories/snapshots/org/apache/oltu/openidconnect/org.apache.oltu.openidconnect.parent/0.1-SNAPSHOT/maven-metadata.xml
Downloaded: https://repository.apache.org/content/repositories/snapshots/org/apache/oltu/openidconnect/org.apache.oltu.openidconnect.parent/0.1-SNAPSHOT/maven-metadata.xml
(640 B at 0.5 KB/sec)
Uploading: https://repository.apache.org/content/repositories/snapshots/org/apache/oltu/openidconnect/org.apache.oltu.openidconnect.parent/0.1-SNAPSHOT/org.apache.oltu.openidconnect.parent-0.1-20140203.131143-74.pom
[INFO] ------------------------------------------------------------------------
[INFO] Reactor Summary:
[INFO] 
[INFO] Apache Oltu - OpenId Connect - Parent ............. FAILURE [35.185s]
[INFO] Apache Oltu - OpenId Connect - Common ............. SKIPPED
[INFO] Apache Oltu - OpenId Connect - Client ............. SKIPPED
[INFO] ------------------------------------------------------------------------
[INFO] BUILD FAILURE
[INFO] ------------------------------------------------------------------------
[INFO] Total time: 36.349s
[INFO] Finished at: Mon Feb 03 05:11:43 PST 2014
[INFO] Final Memory: 15M/61M
[INFO] ------------------------------------------------------------------------
Waiting for Jenkins to finish collecting data
[ERROR] Failed to execute goal org.apache.maven.plugins:maven-deploy-plugin:2.7:deploy (default-deploy)
on project org.apache.oltu.openidconnect.parent: Failed to deploy artifacts: Could not transfer
artifact org.apache.oltu.openidconnect:org.apache.oltu.openidconnect.parent:pom:0.1-20140203.131143-74
from/to apache.snapshots.https (https://repository.apache.org/content/repositories/snapshots):
Failed to transfer file: https://repository.apache.org/content/repositories/snapshots/org/apache/oltu/openidconnect/org.apache.oltu.openidconnect.parent/0.1-SNAPSHOT/org.apache.oltu.openidconnect.parent-0.1-20140203.131143-74.pom.
Return code is: 401 -> [Help 1]
org.apache.maven.lifecycle.LifecycleExecutionException: Failed to execute goal org.apache.maven.plugins:maven-deploy-plugin:2.7:deploy
(default-deploy) on project org.apache.oltu.openidconnect.parent: Failed to deploy artifacts:
Could not transfer artifact org.apache.oltu.openidconnect:org.apache.oltu.openidconnect.parent:pom:0.1-20140203.131143-74
from/to apache.snapshots.https (https://repository.apache.org/content/repositories/snapshots):
Failed to transfer file: https://repository.apache.org/content/repositories/snapshots/org/apache/oltu/openidconnect/org.apache.oltu.openidconnect.parent/0.1-SNAPSHOT/org.apache.oltu.openidconnect.parent-0.1-20140203.131143-74.pom.
Return code is: 401
	at org.apache.maven.lifecycle.internal.MojoExecutor.execute(MojoExecutor.java:217)
	at org.apache.maven.lifecycle.internal.MojoExecutor.execute(MojoExecutor.java:153)
	at org.apache.maven.lifecycle.internal.MojoExecutor.execute(MojoExecutor.java:145)
	at org.apache.maven.lifecycle.internal.LifecycleModuleBuilder.buildProject(LifecycleModuleBuilder.java:84)
	at org.apache.maven.lifecycle.internal.LifecycleModuleBuilder.buildProject(LifecycleModuleBuilder.java:59)
	at org.apache.maven.lifecycle.internal.LifecycleStarter.singleThreadedBuild(LifecycleStarter.java:183)
	at org.apache.maven.lifecycle.internal.LifecycleStarter.execute(LifecycleStarter.java:161)
	at org.apache.maven.DefaultMaven.doExecute(DefaultMaven.java:319)
	at org.apache.maven.DefaultMaven.execute(DefaultMaven.java:156)
	at org.jvnet.hudson.maven3.launcher.Maven3Launcher.main(Maven3Launcher.java:117)
	at sun.reflect.NativeMethodAccessorImpl.invoke0(Native Method)
	at sun.reflect.NativeMethodAccessorImpl.invoke(NativeMethodAccessorImpl.java:39)
	at sun.reflect.DelegatingMethodAccessorImpl.invoke(DelegatingMethodAccessorImpl.java:25)
	at java.lang.reflect.Method.invoke(Method.java:597)
	at org.codehaus.plexus.classworlds.launcher.Launcher.launchStandard(Launcher.java:329)
[JENKINS] Archiving <https://builds.apache.org/job/Oltu-OpenID-Conect/ws/trunk\openid-connect\pom.xml>
to org.apache.oltu.openidconnect/org.apache.oltu.openidconnect.parent/0.1-SNAPSHOT/org.apache.oltu.openidconnect.parent-0.1-SNAPSHOT.pom
	at org.codehaus.plexus.classworlds.launcher.Launcher.launch(Launcher.java:239)
	at org.jvnet.hudson.maven3.agent.Maven3Main.launch(Maven3Main.java:178)
	at sun.reflect.NativeMethodAccessorImpl.invoke0(Native Method)
	at sun.reflect.NativeMethodAccessorImpl.invoke(NativeMethodAccessorImpl.java:39)
	at sun.reflect.DelegatingMethodAccessorImpl.invoke(DelegatingMethodAccessorImpl.java:25)
	at java.lang.reflect.Method.invoke(Method.java:597)
	at hudson.maven.Maven3Builder.call(Maven3Builder.java:134)
	at hudson.maven.Maven3Builder.call(Maven3Builder.java:69)
	at hudson.remoting.UserRequest.perform(UserRequest.java:118)
	at hudson.remoting.UserRequest.perform(UserRequest.java:48)
	at hudson.remoting.Request$2.run(Request.java:328)
	at hudson.remoting.InterceptingExecutorService$1.call(InterceptingExecutorService.java:72)
	at java.util.concurrent.FutureTask$Sync.innerRun(FutureTask.java:303)
	at java.util.concurrent.FutureTask.run(FutureTask.java:138)
	at java.util.concurrent.ThreadPoolExecutor$Worker.runTask(ThreadPoolExecutor.java:886)
	at java.util.concurrent.ThreadPoolExecutor$Worker.run(ThreadPoolExecutor.java:908)
	at java.lang.Thread.run(Thread.java:662)
Caused by: org.apache.maven.plugin.MojoExecutionException: Failed to deploy artifacts: Could
not transfer artifact org.apache.oltu.openidconnect:org.apache.oltu.openidconnect.parent:pom:0.1-20140203.131143-74
from/to apache.snapshots.https (https://repository.apache.org/content/repositories/snapshots):
Failed to transfer file: https://repository.apache.org/content/repositories/snapshots/org/apache/oltu/openidconnect/org.apache.oltu.openidconnect.parent/0.1-SNAPSHOT/org.apache.oltu.openidconnect.parent-0.1-20140203.131143-74.pom.
Return code is: 401
	at org.apache.maven.plugin.deploy.DeployMojo.execute(DeployMojo.java:193)
	at org.apache.maven.plugin.DefaultBuildPluginManager.executeMojo(DefaultBuildPluginManager.java:101)
	at org.apache.maven.lifecycle.internal.MojoExecutor.execute(MojoExecutor.java:209)
	... 31 more
Caused by: org.apache.maven.artifact.deployer.ArtifactDeploymentException: Failed to deploy
artifacts: Could not transfer artifact org.apache.oltu.openidconnect:org.apache.oltu.openidconnect.parent:pom:0.1-20140203.131143-74
from/to apache.snapshots.https (https://repository.apache.org/content/repositories/snapshots):
Failed to transfer file: https://repository.apache.org/content/repositories/snapshots/org/apache/oltu/openidconnect/org.apache.oltu.openidconnect.parent/0.1-SNAPSHOT/org.apache.oltu.openidconnect.parent-0.1-20140203.131143-74.pom.
Return code is: 401
	at org.apache.maven.artifact.deployer.DefaultArtifactDeployer.deploy(DefaultArtifactDeployer.java:141)
	at org.apache.maven.plugin.deploy.AbstractDeployMojo.deploy(AbstractDeployMojo.java:167)
	at org.apache.maven.plugin.deploy.DeployMojo.execute(DeployMojo.java:149)
	... 33 more
Caused by: org.sonatype.aether.deployment.DeploymentException: Failed to deploy artifacts:
Could not transfer artifact org.apache.oltu.openidconnect:org.apache.oltu.openidconnect.parent:pom:0.1-20140203.131143-74
from/to apache.snapshots.https (https://repository.apache.org/content/repositories/snapshots):
Failed to transfer file: https://repository.apache.org/content/repositories/snapshots/org/apache/oltu/openidconnect/org.apache.oltu.openidconnect.parent/0.1-SNAPSHOT/org.apache.oltu.openidconnect.parent-0.1-20140203.131143-74.pom.
Return code is: 401
	at org.sonatype.aether.impl.internal.DefaultDeployer.deploy(DefaultDeployer.java:284)
	at org.sonatype.aether.impl.internal.DefaultDeployer.deploy(DefaultDeployer.java:215)
	at org.sonatype.aether.impl.internal.DefaultRepositorySystem.deploy(DefaultRepositorySystem.java:480)
	at org.apache.maven.artifact.deployer.DefaultArtifactDeployer.deploy(DefaultArtifactDeployer.java:137)
	... 35 more
Caused by: org.sonatype.aether.transfer.ArtifactTransferException: Could not transfer artifact
org.apache.oltu.openidconnect:org.apache.oltu.openidconnect.parent:pom:0.1-20140203.131143-74
from/to apache.snapshots.https (https://repository.apache.org/content/repositories/snapshots):
Failed to transfer file: https://repository.apache.org/content/repositories/snapshots/org/apache/oltu/openidconnect/org.apache.oltu.openidconnect.parent/0.1-SNAPSHOT/org.apache.oltu.openidconnect.parent-0.1-20140203.131143-74.pom.
Return code is: 401
	at org.sonatype.aether.connector.wagon.WagonRepositoryConnector$4.wrap(WagonRepositoryConnector.java:949)
	at org.sonatype.aether.connector.wagon.WagonRepositoryConnector$4.wrap(WagonRepositoryConnector.java:940)
	at org.sonatype.aether.connector.wagon.WagonRepositoryConnector$PutTask.flush(WagonRepositoryConnector.java:864)
	at org.sonatype.aether.connector.wagon.WagonRepositoryConnector.put(WagonRepositoryConnector.java:466)
	at org.sonatype.aether.impl.internal.DefaultDeployer.deploy(DefaultDeployer.java:278)
	... 38 more
Caused by: org.apache.maven.wagon.TransferFailedException: Failed to transfer file: https://repository.apache.org/content/repositories/snapshots/org/apache/oltu/openidconnect/org.apache.oltu.openidconnect.parent/0.1-SNAPSHOT/org.apache.oltu.openidconnect.parent-0.1-20140203.131143-74.pom.
Return code is: 401
	at org.apache.maven.wagon.providers.http.LightweightHttpWagon.finishPutTransfer(LightweightHttpWagon.java:205)
	at org.apache.maven.wagon.AbstractWagon.putTransfer(AbstractWagon.java:413)
	at org.apache.maven.wagon.AbstractWagon.transfer(AbstractWagon.java:392)
	at org.apache.maven.wagon.AbstractWagon.putTransfer(AbstractWagon.java:365)
	at org.apache.maven.wagon.StreamWagon.put(StreamWagon.java:163)
	at org.sonatype.aether.connector.wagon.WagonRepositoryConnector$PutTask.run(WagonRepositoryConnector.java:825)
	at org.sonatype.aether.connector.wagon.WagonRepositoryConnector.put(WagonRepositoryConnector.java:465)
	... 39 more
[ERROR] 
[ERROR] Re-run Maven using the -X switch to enable full debug logging.
[ERROR] 
[ERROR] For more information about the errors and possible solutions, please read the following
articles:
[ERROR] [Help 1] http://cwiki.apache.org/confluence/display/MAVEN/MojoExecutionException
[JENKINS] Archiving F:\jenkins\jenkins-slave\workspace\Oltu-OpenID-Conect\trunk\openid-connect\common\pom.xml
to org.apache.oltu.openidconnect/org.apache.oltu.openidconnect.common/0.1-SNAPSHOT/org.apache.oltu.openidconnect.common-0.1-SNAPSHOT.pom
[JENKINS] Archiving F:\jenkins\jenkins-slave\workspace\Oltu-OpenID-Conect\trunk\openid-connect\client\pom.xml
to org.apache.oltu.openidconnect/org.apache.oltu.openidconnect.client/0.1-SNAPSHOT/org.apache.oltu.openidconnect.client-0.1-SNAPSHOT.pom
Sending e-mails to: dev@oltu.apache.org
channel stopped

Mime
View raw message