oltu-dev mailing list archives

Site index · List index
Message view « Date » · « Thread »
Top « Date » · « Thread »
From Apache Jenkins Server <jenk...@builds.apache.org>
Subject Build failed in Jenkins: Oltu-OAuth-2.0 #163
Date Mon, 24 Feb 2014 15:50:33 GMT
See <https://builds.apache.org/job/Oltu-OAuth-2.0/163/changes>

Changes:

[simonetripodi] releng: dependencies updated to latest released version

[simonetripodi] releng: updated parent to latest stable released version

------------------------------------------
[...truncated 1302 lines...]
Downloaded: http://repo1.maven.org/maven2/org/apache/commons/commons-lang3/3.1/commons-lang3-3.1.jar
(309 KB at 1927.5 KB/sec)
[INFO] Surefire report directory: <https://builds.apache.org/job/Oltu-OAuth-2.0/ws/trunk/oauth-2.0/common/target/surefire-reports>
Downloading: http://repo1.maven.org/maven2/org/apache/maven/surefire/surefire-junit4/2.16/surefire-junit4-2.16.pom
Downloaded: http://repo1.maven.org/maven2/org/apache/maven/surefire/surefire-junit4/2.16/surefire-junit4-2.16.pom
(3 KB at 78.5 KB/sec)
Downloading: http://repo1.maven.org/maven2/org/apache/maven/surefire/surefire-providers/2.16/surefire-providers-2.16.pom
Downloaded: http://repo1.maven.org/maven2/org/apache/maven/surefire/surefire-providers/2.16/surefire-providers-2.16.pom
(3 KB at 72.6 KB/sec)
Downloading: http://repo1.maven.org/maven2/org/apache/maven/surefire/surefire-junit4/2.16/surefire-junit4-2.16.jar
Downloaded: http://repo1.maven.org/maven2/org/apache/maven/surefire/surefire-junit4/2.16/surefire-junit4-2.16.jar
(63 KB at 1365.7 KB/sec)

-------------------------------------------------------
 T E S T S
-------------------------------------------------------
Running org.apache.oltu.oauth2.common.parameters.BodyURLEncodedParametersApplierTest
Tests run: 1, Failures: 0, Errors: 0, Skipped: 0, Time elapsed: 0.042 sec - in org.apache.oltu.oauth2.common.parameters.BodyURLEncodedParametersApplierTest
Running org.apache.oltu.oauth2.common.parameters.WWWAuthHeaderParametersApplierTest
Tests run: 1, Failures: 0, Errors: 0, Skipped: 0, Time elapsed: 0 sec - in org.apache.oltu.oauth2.common.parameters.WWWAuthHeaderParametersApplierTest
Running org.apache.oltu.oauth2.common.parameters.QueryParameterApplierTest
Tests run: 1, Failures: 0, Errors: 0, Skipped: 0, Time elapsed: 0 sec - in org.apache.oltu.oauth2.common.parameters.QueryParameterApplierTest
Running org.apache.oltu.oauth2.common.parameters.JSONBodyParametersApplierTest
Tests run: 1, Failures: 0, Errors: 0, Skipped: 0, Time elapsed: 0.001 sec - in org.apache.oltu.oauth2.common.parameters.JSONBodyParametersApplierTest
Running org.apache.oltu.oauth2.common.parameters.FragmentParametersApplierTest
Tests run: 1, Failures: 0, Errors: 0, Skipped: 0, Time elapsed: 0 sec - in org.apache.oltu.oauth2.common.parameters.FragmentParametersApplierTest
Running org.apache.oltu.oauth2.common.validators.AbstractValidatorTest
Tests run: 2, Failures: 0, Errors: 0, Skipped: 0, Time elapsed: 0.127 sec - in org.apache.oltu.oauth2.common.validators.AbstractValidatorTest
Running org.apache.oltu.oauth2.common.message.OAuthResponseTest
Tests run: 1, Failures: 0, Errors: 0, Skipped: 0, Time elapsed: 0 sec - in org.apache.oltu.oauth2.common.message.OAuthResponseTest
Running org.apache.oltu.oauth2.common.utils.JSONUtilsTest
Tests run: 2, Failures: 0, Errors: 0, Skipped: 1, Time elapsed: 0 sec - in org.apache.oltu.oauth2.common.utils.JSONUtilsTest
Running org.apache.oltu.oauth2.common.utils.OAuthUtilsTest
Tests run: 27, Failures: 0, Errors: 0, Skipped: 0, Time elapsed: 0.038 sec - in org.apache.oltu.oauth2.common.utils.OAuthUtilsTest
Running org.apache.oltu.oauth2.common.domain.BasicClientInfoBuilderTest
Tests run: 1, Failures: 0, Errors: 0, Skipped: 0, Time elapsed: 0 sec - in org.apache.oltu.oauth2.common.domain.BasicClientInfoBuilderTest
Running org.apache.oltu.oauth2.common.OAuthUtilsTest
Tests run: 2, Failures: 0, Errors: 0, Skipped: 1, Time elapsed: 0.001 sec - in org.apache.oltu.oauth2.common.OAuthUtilsTest

Results :

Tests run: 40, Failures: 0, Errors: 0, Skipped: 2

[JENKINS] Recording test results
[INFO] 
[INFO] --- maven-jar-plugin:2.4:jar (default-jar) @ org.apache.oltu.oauth2.common ---
Downloading: http://repo1.maven.org/maven2/org/apache/maven/maven-archiver/2.5/maven-archiver-2.5.pom
Downloaded: http://repo1.maven.org/maven2/org/apache/maven/maven-archiver/2.5/maven-archiver-2.5.pom
(5 KB at 83.6 KB/sec)
Downloading: http://repo1.maven.org/maven2/org/codehaus/plexus/plexus-archiver/2.1/plexus-archiver-2.1.pom
Downloaded: http://repo1.maven.org/maven2/org/codehaus/plexus/plexus-archiver/2.1/plexus-archiver-2.1.pom
(3 KB at 85.7 KB/sec)
Downloading: http://repo1.maven.org/maven2/org/codehaus/plexus/plexus-io/2.0.2/plexus-io-2.0.2.pom
Downloaded: http://repo1.maven.org/maven2/org/codehaus/plexus/plexus-io/2.0.2/plexus-io-2.0.2.pom
(2 KB at 54.6 KB/sec)
Downloading: http://repo1.maven.org/maven2/org/codehaus/plexus/plexus-components/1.1.19/plexus-components-1.1.19.pom
Downloaded: http://repo1.maven.org/maven2/org/codehaus/plexus/plexus-components/1.1.19/plexus-components-1.1.19.pom
(3 KB at 85.0 KB/sec)
Downloading: http://repo1.maven.org/maven2/org/codehaus/plexus/plexus/3.0.1/plexus-3.0.1.pom
Downloaded: http://repo1.maven.org/maven2/org/codehaus/plexus/plexus/3.0.1/plexus-3.0.1.pom
(19 KB at 403.9 KB/sec)
Downloading: http://repo1.maven.org/maven2/org/codehaus/plexus/plexus-interpolation/1.15/plexus-interpolation-1.15.pom
Downloaded: http://repo1.maven.org/maven2/org/codehaus/plexus/plexus-interpolation/1.15/plexus-interpolation-1.15.pom
(1018 B at 31.1 KB/sec)
Downloading: http://repo1.maven.org/maven2/org/apache/maven/maven-archiver/2.5/maven-archiver-2.5.jar
Downloading: http://repo1.maven.org/maven2/org/codehaus/plexus/plexus-io/2.0.2/plexus-io-2.0.2.jar
Downloading: http://repo1.maven.org/maven2/commons-lang/commons-lang/2.1/commons-lang-2.1.jar
Downloading: http://repo1.maven.org/maven2/org/codehaus/plexus/plexus-interpolation/1.15/plexus-interpolation-1.15.jar
Downloading: http://repo1.maven.org/maven2/org/codehaus/plexus/plexus-archiver/2.1/plexus-archiver-2.1.jar
Downloaded: http://repo1.maven.org/maven2/org/apache/maven/maven-archiver/2.5/maven-archiver-2.5.jar
(22 KB at 453.2 KB/sec)
Downloaded: http://repo1.maven.org/maven2/org/codehaus/plexus/plexus-io/2.0.2/plexus-io-2.0.2.jar
(57 KB at 801.4 KB/sec)
Downloaded: http://repo1.maven.org/maven2/org/codehaus/plexus/plexus-interpolation/1.15/plexus-interpolation-1.15.jar
(60 KB at 831.8 KB/sec)
Downloaded: http://repo1.maven.org/maven2/org/codehaus/plexus/plexus-archiver/2.1/plexus-archiver-2.1.jar
(181 KB at 1652.4 KB/sec)
Downloaded: http://repo1.maven.org/maven2/commons-lang/commons-lang/2.1/commons-lang-2.1.jar
(203 KB at 1690.5 KB/sec)
[INFO] Building jar: <https://builds.apache.org/job/Oltu-OAuth-2.0/ws/trunk/oauth-2.0/common/target/org.apache.oltu.oauth2.common-1.0.0-SNAPSHOT.jar>
[INFO] 
[INFO] --- maven-site-plugin:3.0:attach-descriptor (attach-descriptor) @ org.apache.oltu.oauth2.common
---
[INFO] 
[INFO] --- maven-install-plugin:2.5.1:install (default-install) @ org.apache.oltu.oauth2.common
---
[INFO] Installing <https://builds.apache.org/job/Oltu-OAuth-2.0/ws/trunk/oauth-2.0/common/target/org.apache.oltu.oauth2.common-1.0.0-SNAPSHOT.jar>
to <https://builds.apache.org/job/Oltu-OAuth-2.0/ws/.repository/org/apache/oltu/oauth2/org.apache.oltu.oauth2.common/1.0.0-SNAPSHOT/org.apache.oltu.oauth2.common-1.0.0-SNAPSHOT.jar>
[INFO] Installing <https://builds.apache.org/job/Oltu-OAuth-2.0/ws/trunk/oauth-2.0/common/pom.xml>
to <https://builds.apache.org/job/Oltu-OAuth-2.0/ws/.repository/org/apache/oltu/oauth2/org.apache.oltu.oauth2.common/1.0.0-SNAPSHOT/org.apache.oltu.oauth2.common-1.0.0-SNAPSHOT.pom>
[INFO] 
[INFO] --- maven-deploy-plugin:2.8.1:deploy (default-deploy) @ org.apache.oltu.oauth2.common
---
Downloading: https://repository.apache.org/content/repositories/snapshots/org/apache/oltu/oauth2/org.apache.oltu.oauth2.common/1.0.0-SNAPSHOT/maven-metadata.xml
Downloaded: https://repository.apache.org/content/repositories/snapshots/org/apache/oltu/oauth2/org.apache.oltu.oauth2.common/1.0.0-SNAPSHOT/maven-metadata.xml
(804 B at 0.6 KB/sec)
Uploading: https://repository.apache.org/content/repositories/snapshots/org/apache/oltu/oauth2/org.apache.oltu.oauth2.common/1.0.0-SNAPSHOT/org.apache.oltu.oauth2.common-1.0.0-20140224.144825-85.jar
Uploaded: https://repository.apache.org/content/repositories/snapshots/org/apache/oltu/oauth2/org.apache.oltu.oauth2.common/1.0.0-SNAPSHOT/org.apache.oltu.oauth2.common-1.0.0-20140224.144825-85.jar
(52 KB at 19.7 KB/sec)
Uploading: https://repository.apache.org/content/repositories/snapshots/org/apache/oltu/oauth2/org.apache.oltu.oauth2.common/1.0.0-SNAPSHOT/org.apache.oltu.oauth2.common-1.0.0-20140224.144825-85.pom
Uploaded: https://repository.apache.org/content/repositories/snapshots/org/apache/oltu/oauth2/org.apache.oltu.oauth2.common/1.0.0-SNAPSHOT/org.apache.oltu.oauth2.common-1.0.0-20140224.144825-85.pom
(3 KB at 3.6 KB/sec)
Downloading: https://repository.apache.org/content/repositories/snapshots/org/apache/oltu/oauth2/org.apache.oltu.oauth2.common/maven-metadata.xml
Downloaded: https://repository.apache.org/content/repositories/snapshots/org/apache/oltu/oauth2/org.apache.oltu.oauth2.common/maven-metadata.xml
(371 B at 0.8 KB/sec)
Uploading: https://repository.apache.org/content/repositories/snapshots/org/apache/oltu/oauth2/org.apache.oltu.oauth2.common/1.0.0-SNAPSHOT/maven-metadata.xml
Uploaded: https://repository.apache.org/content/repositories/snapshots/org/apache/oltu/oauth2/org.apache.oltu.oauth2.common/1.0.0-SNAPSHOT/maven-metadata.xml
(804 B at 1.1 KB/sec)
Uploading: https://repository.apache.org/content/repositories/snapshots/org/apache/oltu/oauth2/org.apache.oltu.oauth2.common/maven-metadata.xml
Uploaded: https://repository.apache.org/content/repositories/snapshots/org/apache/oltu/oauth2/org.apache.oltu.oauth2.common/maven-metadata.xml
(371 B at 0.5 KB/sec)
[INFO]                                                                         
[INFO] ------------------------------------------------------------------------
[INFO] Building Apache Oltu - OAuth 2.0 - Client 1.0.0-SNAPSHOT
[INFO] ------------------------------------------------------------------------
Downloading: http://repo1.maven.org/maven2/org/apache/maven/plugins/maven-assembly-plugin/2.4/maven-assembly-plugin-2.4.pom
Downloaded: http://repo1.maven.org/maven2/org/apache/maven/plugins/maven-assembly-plugin/2.4/maven-assembly-plugin-2.4.pom
(17 KB at 153.7 KB/sec)
Downloading: http://repo1.maven.org/maven2/org/apache/maven/plugins/maven-assembly-plugin/2.4/maven-assembly-plugin-2.4.jar
Downloaded: http://repo1.maven.org/maven2/org/apache/maven/plugins/maven-assembly-plugin/2.4/maven-assembly-plugin-2.4.jar
(221 KB at 1500.5 KB/sec)
[INFO] 
[INFO] --- maven-clean-plugin:2.5:clean (default-clean) @ org.apache.oltu.oauth2.client ---
[INFO] Deleting <https://builds.apache.org/job/Oltu-OAuth-2.0/ws/trunk/oauth-2.0/client/target>
[INFO] 
[INFO] --- maven-enforcer-plugin:1.3.1:enforce (enforce-java) @ org.apache.oltu.oauth2.client
---
[INFO] 
[INFO] --- buildnumber-maven-plugin:1.2:create (default) @ org.apache.oltu.oauth2.client ---
[INFO] Checking for local modifications: skipped.
[INFO] Updating project files from SCM: skipped.
[INFO] Executing: /bin/sh -c cd <https://builds.apache.org/job/Oltu-OAuth-2.0/ws/trunk/oauth-2.0/client>
&& svn --non-interactive info
[INFO] Working directory: <https://builds.apache.org/job/Oltu-OAuth-2.0/ws/trunk/oauth-2.0/client>
[WARNING] Cannot get the revision information from the scm repository, proceeding with revision
of ?????? : 
Exception while executing SCM command.
[INFO] Storing buildNumber: ?????? at timestamp: 1393253627025
[INFO] Executing: /bin/sh -c cd <https://builds.apache.org/job/Oltu-OAuth-2.0/ws/trunk/oauth-2.0/client>
&& svn --non-interactive info
[INFO] Working directory: <https://builds.apache.org/job/Oltu-OAuth-2.0/ws/trunk/oauth-2.0/client>
[WARNING] Cannot get the branch information from the scm repository, proceeding with UNKNOWN_BRANCH
: 
Exception while executing SCM command.
[INFO] Storing buildScmBranch: UNKNOWN_BRANCH
[INFO] 
[INFO] --- maven-remote-resources-plugin:1.2.1:process (default) @ org.apache.oltu.oauth2.client
---
[INFO] 
[INFO] --- maven-resources-plugin:2.6:resources (default-resources) @ org.apache.oltu.oauth2.client
---
[INFO] Using 'UTF-8' encoding to copy filtered resources.
[INFO] skip non existing resourceDirectory <https://builds.apache.org/job/Oltu-OAuth-2.0/ws/trunk/oauth-2.0/client../..>
[INFO] Copying 3 resources
[INFO] 
[INFO] --- maven-compiler-plugin:3.1:compile (default-compile) @ org.apache.oltu.oauth2.client
---
[INFO] Changes detected - recompiling the module!
[INFO] Compiling 18 source files to <https://builds.apache.org/job/Oltu-OAuth-2.0/ws/trunk/oauth-2.0/client/target/classes>
[WARNING] Note: Some input files use unchecked or unsafe operations.
[WARNING] Note: Recompile with -Xlint:unchecked for details.
[INFO] 
[INFO] --- maven-bundle-plugin:2.3.7:manifest (bundle-manifest) @ org.apache.oltu.oauth2.client
---
[INFO] 
[INFO] --- maven-resources-plugin:2.6:testResources (default-testResources) @ org.apache.oltu.oauth2.client
---
[INFO] Using 'UTF-8' encoding to copy filtered resources.
[INFO] Copying 1 resource
[INFO] Copying 3 resources
[INFO] 
[INFO] --- maven-compiler-plugin:3.1:testCompile (default-testCompile) @ org.apache.oltu.oauth2.client
---
[INFO] Changes detected - recompiling the module!
[INFO] Compiling 9 source files to <https://builds.apache.org/job/Oltu-OAuth-2.0/ws/trunk/oauth-2.0/client/target/test-classes>
[INFO] 
[INFO] --- maven-surefire-plugin:2.16:test (default-test) @ org.apache.oltu.oauth2.client
---
[INFO] Surefire report directory: <https://builds.apache.org/job/Oltu-OAuth-2.0/ws/trunk/oauth-2.0/client/target/surefire-reports>

-------------------------------------------------------
 T E S T S
-------------------------------------------------------

Results :

Tests run: 0, Failures: 0, Errors: 0, Skipped: 0

[JENKINS] Recording test results
[INFO] ------------------------------------------------------------------------
[INFO] Reactor Summary:
[INFO] 
[INFO] Apache Oltu - OAuth 2.0 - Parent .................. SUCCESS [1:57.410s]
[INFO] Apache Oltu - OAuth 2.0 - Common .................. SUCCESS [1:02.144s]
[INFO] Apache Oltu - OAuth 2.0 - Client .................. FAILURE [51.834s]
[INFO] Apache Oltu - OAuth 2.0 - HttpClient .............. SKIPPED
[INFO] Apache Oltu - OAuth 2.0 - Dynamic Registration Common  SKIPPED
[INFO] Apache Oltu - OAuth 2.0 - Dynamic Registration Client  SKIPPED
[INFO] Apache Oltu - OAuth 2.0 - Authorization Server .... SKIPPED
[INFO] Apache Oltu - OAuth 2.0 - Resource Server ......... SKIPPED
[INFO] Apache Oltu - OAuth 2.0 - Resource Server Filter .. SKIPPED
[INFO] Apache Oltu - OAuth 2.0 - Test Utils .............. SKIPPED
[INFO] Apache Oltu - OAuth 2.0 - Dynamic Registration Server  SKIPPED
[INFO] Apache Oltu - OAuth 2.0 - Integration Tests ....... SKIPPED
[INFO] Apache Oltu - OAuth 2.0 - JWT ..................... SKIPPED
[INFO] ------------------------------------------------------------------------
[INFO] BUILD FAILURE
[INFO] ------------------------------------------------------------------------
[INFO] Total time: 19:24.590s
[INFO] Finished at: Mon Feb 24 14:59:34 GMT+00:00 2014
[INFO] Final Memory: 22M/195M
[INFO] ------------------------------------------------------------------------
Waiting for Jenkins to finish collecting data[ERROR] Failed to execute goal org.apache.maven.plugins:maven-surefire-plugin:2.16:test
(default-test) on project org.apache.oltu.oauth2.client: Execution default-test of goal org.apache.maven.plugins:maven-surefire-plugin:2.16:test
failed: The forked VM terminated without saying properly goodbye. VM crash or System.exit
called ?
[ERROR] Command was/bin/sh -c cd <https://builds.apache.org/job/Oltu-OAuth-2.0/ws/trunk/oauth-2.0/client>
&& /zonestorage/hudson_solaris/home/hudson/hudson-slave/tools/jdk6-u26-auto-install/jre/bin/java
-jar <https://builds.apache.org/job/Oltu-OAuth-2.0/ws/trunk/oauth-2.0/client/target/surefire/surefirebooter3051900944032582141.jar>
<https://builds.apache.org/job/Oltu-OAuth-2.0/ws/trunk/oauth-2.0/client/target/surefire/surefire4767404852482809441tmp>
<https://builds.apache.org/job/Oltu-OAuth-2.0/ws/trunk/oauth-2.0/client/target/surefire/surefire_11248237680222115289tmp>
[ERROR] -> [Help 1]
org.apache.maven.lifecycle.LifecycleExecutionException: Failed to execute goal org.apache.maven.plugins:maven-surefire-plugin:2.16:test
(default-test) on project org.apache.oltu.oauth2.client: Execution default-test of goal org.apache.maven.plugins:maven-surefire-plugin:2.16:test
failed: The forked VM terminated without saying properly goodbye. VM crash or System.exit
called ?
Command was/bin/sh -c cd <https://builds.apache.org/job/Oltu-OAuth-2.0/ws/trunk/oauth-2.0/client>
&& /zonestorage/hudson_solaris/home/hudson/hudson-slave/tools/jdk6-u26-auto-install/jre/bin/java
-jar <https://builds.apache.org/job/Oltu-OAuth-2.0/ws/trunk/oauth-2.0/client/target/surefire/surefirebooter3051900944032582141.jar>
<https://builds.apache.org/job/Oltu-OAuth-2.0/ws/trunk/oauth-2.0/client/target/surefire/surefire4767404852482809441tmp>
<https://builds.apache.org/job/Oltu-OAuth-2.0/ws/trunk/oauth-2.0/client/target/surefire/surefire_11248237680222115289tmp>
	at org.apache.maven.lifecycle.internal.MojoExecutor.execute(MojoExecutor.java:225)
	at org.apache.maven.lifecycle.internal.MojoExecutor.execute(MojoExecutor.java:153)
	at org.apache.maven.lifecycle.internal.MojoExecutor.execute(MojoExecutor.java:145)
	at org.apache.maven.lifecycle.internal.LifecycleModuleBuilder.buildProject(LifecycleModuleBuilder.java:84)
	at org.apache.maven.lifecycle.internal.LifecycleModuleBuilder.buildProject(LifecycleModuleBuilder.java:59)
	at org.apache.maven.lifecycle.internal.LifecycleStarter.singleThreadedBuild(LifecycleStarter.java:183)
	at org.apache.maven.lifecycle.internal.LifecycleStarter.execute(LifecycleStarter.java:161)
	at org.apache.maven.DefaultMaven.doExecute(DefaultMaven.java:319)
	at org.apache.maven.DefaultMaven.execute(DefaultMaven.java:156)
	at org.jvnet.hudson.maven3.launcher.Maven3Launcher.main(Maven3Launcher.java:117)
	at sun.reflect.NativeMethodAccessorImpl.invoke0(Native Method)
	at sun.reflect.NativeMethodAccessorImpl.invoke(NativeMethodAccessorImpl.java:39)
	at sun.reflect.DelegatingMethodAccessorImpl.invoke(DelegatingMethodAccessorImpl.java:25)
	at java.lang.reflect.Method.invoke(Method.java:597)
	at org.codehaus.plexus.classworlds.launcher.Launcher.launchStandard(Launcher.java:329)
	at org.codehaus.plexus.classworlds.launcher.Launcher.launch(Launcher.java:239)
	at org.jvnet.hudson.maven3.agent.Maven3Main.launch(Maven3Main.java:178)
	at sun.reflect.NativeMethodAccessorImpl.invoke0(Native Method)
	at sun.reflect.NativeMethodAccessorImpl.invoke(NativeMethodAccessorImpl.java:39)
	at sun.reflect.DelegatingMethodAccessorImpl.invoke(DelegatingMethodAccessorImpl.java:25)
	at java.lang.reflect.Method.invoke(Method.java:597)
	at hudson.maven.Maven3Builder.call(Maven3Builder.java:134)
	at hudson.maven.Maven3Builder.call(Maven3Builder.java:69)
	at hudson.remoting.UserRequest.perform(UserRequest.java:118)
	at hudson.remoting.UserRequest.perform(UserRequest.java:48)
	at hudson.remoting.Request$2.run(Request.java:328)
	at hudson.remoting.InterceptingExecutorService$1.call(InterceptingExecutorService.java:72)
	at java.util.concurrent.FutureTask$Sync.innerRun(FutureTask.java:303)
	at java.util.concurrent.FutureTask.run(FutureTask.java:138)
	at java.util.concurrent.ThreadPoolExecutor$Worker.runTask(ThreadPoolExecutor.java:886)
	at java.util.concurrent.ThreadPoolExecutor$Worker.run(ThreadPoolExecutor.java:908)
	at java.lang.Thread.run(Thread.java:662)
Caused by: org.apache.maven.plugin.PluginExecutionException: Execution default-test of goal
org.apache.maven.plugins:maven-surefire-plugin:2.16:test failed: The forked VM terminated
without saying properly goodbye. VM crash or System.exit called ?
Command was/bin/sh -c cd <https://builds.apache.org/job/Oltu-OAuth-2.0/ws/trunk/oauth-2.0/client>
&& /zonestorage/hudson_solaris/home/hudson/hudson-slave/tools/jdk6-u26-auto-install/jre/bin/java
-jar <https://builds.apache.org/job/Oltu-OAuth-2.0/ws/trunk/oauth-2.0/client/target/surefire/surefirebooter3051900944032582141.jar>
<https://builds.apache.org/job/Oltu-OAuth-2.0/ws/trunk/oauth-2.0/client/target/surefire/surefire4767404852482809441tmp>
<https://builds.apache.org/job/Oltu-OAuth-2.0/ws/trunk/oauth-2.0/client/target/surefire/surefire_11248237680222115289tmp>
	at org.apache.maven.plugin.DefaultBuildPluginManager.executeMojo(DefaultBuildPluginManager.java:110)
	at org.apache.maven.lifecycle.internal.MojoExecutor.execute(MojoExecutor.java:209)
	... 31 more
Caused by: java.lang.RuntimeException: The forked VM terminated without saying properly goodbye.
VM crash or System.exit called ?
Command was/bin/sh -c cd <https://builds.apache.org/job/Oltu-OAuth-2.0/ws/trunk/oauth-2.0/client>
&& /zonestorage/hudson_solaris/home/hudson/hudson-slave/tools/jdk6-u26-auto-install/jre/bin/java
-jar <https://builds.apache.org/job/Oltu-OAuth-2.0/ws/trunk/oauth-2.0/client/target/surefire/surefirebooter3051900944032582141.jar>
<https://builds.apache.org/job/Oltu-OAuth-2.0/ws/trunk/oauth-2.0/client/target/surefire/surefire4767404852482809441tmp>
<https://builds.apache.org/job/Oltu-OAuth-2.0/ws/trunk/oauth-2.0/client/target/surefire/surefire_11248237680222115289tmp>
	at org.apache.maven.plugin.surefire.booterclient.ForkStarter.fork(ForkStarter.java:485)
	at org.apache.maven.plugin.surefire.booterclient.ForkStarter.fork(ForkStarter.java:352)
	at org.apache.maven.plugin.surefire.booterclient.ForkStarter.run(ForkStarter.java:158)
	at org.apache.maven.plugin.surefire.AbstractSurefireMojo.executeProvider(AbstractSurefireMojo.java:958)
	at org.apache.maven.plugin.surefire.AbstractSurefireMojo.executeAfterPreconditionsChecked(AbstractSurefireMojo.java:822)
	at org.apache.maven.plugin.surefire.AbstractSurefireMojo.execute(AbstractSurefireMojo.java:720)
	at org.apache.maven.plugin.DefaultBuildPluginManager.executeMojo(DefaultBuildPluginManager.java:101)
	... 32 more
[ERROR] 
[ERROR] Re-run Maven using the -X switch to enable full debug logging.
[ERROR] 
[ERROR] For more information about the errors and possible solutions, please read the following
articles:
[ERROR] [Help 1] http://cwiki.apache.org/confluence/display/MAVEN/PluginExecutionException
[ERROR] 
[ERROR] After correcting the problems, you can resume the build with the command
[ERROR]   mvn <goals> -rf :org.apache.oltu.oauth2.client

[JENKINS] Archiving <https://builds.apache.org/job/Oltu-OAuth-2.0/ws/trunk/oauth-2.0/integration-tests/pom.xml>
to org.apache.oltu.oauth2/org.apache.oltu.oauth2.integration-tests/1.0.0-SNAPSHOT/org.apache.oltu.oauth2.integration-tests-1.0.0-SNAPSHOT.pom
[JENKINS] Archiving <https://builds.apache.org/job/Oltu-OAuth-2.0/ws/trunk/oauth-2.0/authzserver/pom.xml>
to org.apache.oltu.oauth2/org.apache.oltu.oauth2.authzserver/1.0.0-SNAPSHOT/org.apache.oltu.oauth2.authzserver-1.0.0-SNAPSHOT.pom
[JENKINS] Archiving <https://builds.apache.org/job/Oltu-OAuth-2.0/ws/trunk/oauth-2.0/jwt/pom.xml>
to org.apache.oltu.oauth2/org.apache.oltu.oauth2.jwt/1.0.0-SNAPSHOT/org.apache.oltu.oauth2.jwt-1.0.0-SNAPSHOT.pom
[JENKINS] Archiving <https://builds.apache.org/job/Oltu-OAuth-2.0/ws/trunk/oauth-2.0/resourceserver-filter/pom.xml>
to org.apache.oltu.oauth2/org.apache.oltu.oauth2.resourceserver-filter/1.0.0-SNAPSHOT/org.apache.oltu.oauth2.resourceserver-filter-1.0.0-SNAPSHOT.pom
[JENKINS] Archiving <https://builds.apache.org/job/Oltu-OAuth-2.0/ws/trunk/oauth-2.0/dynamicreg-client/pom.xml>
to org.apache.oltu.oauth2/org.apache.oltu.oauth2.dynamicreg.client/1.0.0-SNAPSHOT/org.apache.oltu.oauth2.dynamicreg.client-1.0.0-SNAPSHOT.pom
[JENKINS] Archiving <https://builds.apache.org/job/Oltu-OAuth-2.0/ws/trunk/oauth-2.0/httpclient4/pom.xml>
to org.apache.oltu.oauth2/org.apache.oltu.oauth2.httpclient4/1.0.0-SNAPSHOT/org.apache.oltu.oauth2.httpclient4-1.0.0-SNAPSHOT.pom
[JENKINS] Archiving <https://builds.apache.org/job/Oltu-OAuth-2.0/ws/trunk/oauth-2.0/dynamicreg-common/pom.xml>
to org.apache.oltu.oauth2/org.apache.oltu.oauth2.dynamicreg.common/1.0.0-SNAPSHOT/org.apache.oltu.oauth2.dynamicreg.common-1.0.0-SNAPSHOT.pom
[JENKINS] Archiving <https://builds.apache.org/job/Oltu-OAuth-2.0/ws/trunk/oauth-2.0/client/pom.xml>
to org.apache.oltu.oauth2/org.apache.oltu.oauth2.client/1.0.0-SNAPSHOT/org.apache.oltu.oauth2.client-1.0.0-SNAPSHOT.pom
[JENKINS] Archiving <https://builds.apache.org/job/Oltu-OAuth-2.0/ws/trunk/oauth-2.0/resourceserver/pom.xml>
to org.apache.oltu.oauth2/org.apache.oltu.oauth2.resourceserver/1.0.0-SNAPSHOT/org.apache.oltu.oauth2.resourceserver-1.0.0-SNAPSHOT.pom
[JENKINS] Archiving <https://builds.apache.org/job/Oltu-OAuth-2.0/ws/trunk/oauth-2.0/dynamicreg-server/pom.xml>
to org.apache.oltu.oauth2/org.apache.oltu.oauth2.dynamicreg.server/1.0.0-SNAPSHOT/org.apache.oltu.oauth2.dynamicreg.server-1.0.0-SNAPSHOT.pom
[JENKINS] Archiving <https://builds.apache.org/job/Oltu-OAuth-2.0/ws/trunk/oauth-2.0/pom.xml>
to org.apache.oltu.oauth2/org.apache.oltu.oauth2.parent/1.0.0-SNAPSHOT/org.apache.oltu.oauth2.parent-1.0.0-SNAPSHOT.pom
[JENKINS] Archiving <https://builds.apache.org/job/Oltu-OAuth-2.0/ws/trunk/oauth-2.0/test-utils/pom.xml>
to org.apache.oltu.oauth2/org.apache.oltu.oauth2.test-utils/1.0.0-SNAPSHOT/org.apache.oltu.oauth2.test-utils-1.0.0-SNAPSHOT.pom
[JENKINS] Archiving <https://builds.apache.org/job/Oltu-OAuth-2.0/ws/trunk/oauth-2.0/common/pom.xml>
to org.apache.oltu.oauth2/org.apache.oltu.oauth2.common/1.0.0-SNAPSHOT/org.apache.oltu.oauth2.common-1.0.0-SNAPSHOT.pom
[JENKINS] Archiving <https://builds.apache.org/job/Oltu-OAuth-2.0/ws/trunk/oauth-2.0/common/target/org.apache.oltu.oauth2.common-1.0.0-SNAPSHOT.jar>
to org.apache.oltu.oauth2/org.apache.oltu.oauth2.common/1.0.0-20140224.144825-85/org.apache.oltu.oauth2.common-1.0.0-20140224.144825-85.jar
Sending e-mails to: dev@oltu.apache.org
channel stopped

Mime
View raw message