oltu-dev mailing list archives

Site index · List index
Message view « Date » · « Thread »
Top « Date » · « Thread »
From Apache Jenkins Server <jenk...@builds.apache.org>
Subject Build failed in Jenkins: Oltu-OpenID-Conect #68
Date Mon, 24 Feb 2014 14:32:48 GMT
See <https://builds.apache.org/job/Oltu-OpenID-Conect/68/changes>

Changes:

[simonetripodi] releng: updated parent to latest stable released version

------------------------------------------
[...truncated 1173 lines...]
Downloaded: http://repo1.maven.org/maven2/org/codehaus/plexus/plexus-compiler-api/2.2/plexus-compiler-api-2.2.jar
(25 KB at 1743.2 KB/sec)
Downloading: http://repo1.maven.org/maven2/log4j/log4j/1.2.12/log4j-1.2.12.jar
Downloaded: http://repo1.maven.org/maven2/org/codehaus/plexus/plexus-compiler-manager/2.2/plexus-compiler-manager-2.2.jar
(5 KB at 742.4 KB/sec)
Downloading: http://repo1.maven.org/maven2/commons-logging/commons-logging-api/1.1/commons-logging-api-1.1.jar
Downloaded: http://repo1.maven.org/maven2/org/apache/maven/shared/maven-shared-utils/0.1/maven-shared-utils-0.1.jar
(151 KB at 8383.2 KB/sec)
Downloading: http://repo1.maven.org/maven2/com/google/collections/google-collections/1.0/google-collections-1.0.jar
Downloaded: http://repo1.maven.org/maven2/org/codehaus/plexus/plexus-compiler-javac/2.2/plexus-compiler-javac-2.2.jar
(19 KB at 3087.7 KB/sec)
Downloading: http://repo1.maven.org/maven2/junit/junit/3.8.2/junit-3.8.2.jar
Downloaded: http://repo1.maven.org/maven2/commons-logging/commons-logging-api/1.1/commons-logging-api-1.1.jar
(44 KB at 7258.8 KB/sec)
Downloaded: http://repo1.maven.org/maven2/org/apache/xbean/xbean-reflect/3.4/xbean-reflect-3.4.jar
(131 KB at 10890.8 KB/sec)
Downloaded: http://repo1.maven.org/maven2/junit/junit/3.8.2/junit-3.8.2.jar (118 KB at 13090.3
KB/sec)
Downloaded: http://repo1.maven.org/maven2/log4j/log4j/1.2.12/log4j-1.2.12.jar (350 KB at 23312.8
KB/sec)
Downloaded: http://repo1.maven.org/maven2/com/google/collections/google-collections/1.0/google-collections-1.0.jar
(625 KB at 27156.6 KB/sec)
[INFO] Nothing to compile - all classes are up to date
[INFO] 
[INFO] --- maven-bundle-plugin:2.3.7:manifest (bundle-manifest) @ org.apache.oltu.openidconnect.common
---
[WARNING] Manifest org.apache.oltu.openidconnect:org.apache.oltu.openidconnect.common:jar:0.1-SNAPSHOT
: Superfluous export-package instructions: [org.apache.oltu.openidconnect*]
[INFO] 
[INFO] --- maven-resources-plugin:2.6:testResources (default-testResources) @ org.apache.oltu.openidconnect.common
---
[INFO] Using 'UTF-8' encoding to copy filtered resources.
[INFO] skip non existing resourceDirectory <https://builds.apache.org/job/Oltu-OpenID-Conect/ws/trunk/openid-connect/common/src/test/resources>
[INFO] Copying 3 resources
[INFO] 
[INFO] --- maven-compiler-plugin:3.1:testCompile (default-testCompile) @ org.apache.oltu.openidconnect.common
---
[INFO] Nothing to compile - all classes are up to date
[INFO] 
[INFO] --- maven-surefire-plugin:2.14.1:test (default-test) @ org.apache.oltu.openidconnect.common
---
Downloading: http://repo1.maven.org/maven2/org/apache/maven/surefire/maven-surefire-common/2.14.1/maven-surefire-common-2.14.1.pom
Downloaded: http://repo1.maven.org/maven2/org/apache/maven/surefire/maven-surefire-common/2.14.1/maven-surefire-common-2.14.1.pom
(6 KB at 687.0 KB/sec)
Downloading: http://repo1.maven.org/maven2/org/apache/maven/plugin-tools/maven-plugin-annotations/3.2/maven-plugin-annotations-3.2.pom
Downloaded: http://repo1.maven.org/maven2/org/apache/maven/plugin-tools/maven-plugin-annotations/3.2/maven-plugin-annotations-3.2.pom
(2 KB at 317.2 KB/sec)
Downloading: http://repo1.maven.org/maven2/org/apache/maven/plugin-tools/maven-plugin-tools/3.2/maven-plugin-tools-3.2.pom
Downloaded: http://repo1.maven.org/maven2/org/apache/maven/plugin-tools/maven-plugin-tools/3.2/maven-plugin-tools-3.2.pom
(17 KB at 2690.1 KB/sec)
Downloading: http://repo1.maven.org/maven2/org/apache/maven/surefire/surefire-api/2.14.1/surefire-api-2.14.1.pom
Downloaded: http://repo1.maven.org/maven2/org/apache/maven/surefire/surefire-api/2.14.1/surefire-api-2.14.1.pom
(3 KB at 609.6 KB/sec)
Downloading: http://repo1.maven.org/maven2/org/apache/maven/surefire/surefire-booter/2.14.1/surefire-booter-2.14.1.pom
Downloaded: http://repo1.maven.org/maven2/org/apache/maven/surefire/surefire-booter/2.14.1/surefire-booter-2.14.1.pom
(3 KB at 591.8 KB/sec)
Downloading: http://repo1.maven.org/maven2/org/apache/maven/maven-toolchain/2.0.9/maven-toolchain-2.0.9.pom
Downloaded: http://repo1.maven.org/maven2/org/apache/maven/maven-toolchain/2.0.9/maven-toolchain-2.0.9.pom
(4 KB at 1131.5 KB/sec)
Downloading: http://repo1.maven.org/maven2/org/apache/commons/commons-lang3/3.1/commons-lang3-3.1.pom
Downloaded: http://repo1.maven.org/maven2/org/apache/commons/commons-lang3/3.1/commons-lang3-3.1.pom
(17 KB at 3263.9 KB/sec)
Downloading: http://repo1.maven.org/maven2/org/apache/commons/commons-parent/22/commons-parent-22.pom
Downloaded: http://repo1.maven.org/maven2/org/apache/commons/commons-parent/22/commons-parent-22.pom
(41 KB at 8187.1 KB/sec)
Downloading: http://repo1.maven.org/maven2/org/apache/maven/surefire/maven-surefire-common/2.14.1/maven-surefire-common-2.14.1.jar
Downloading: http://repo1.maven.org/maven2/org/apache/maven/surefire/surefire-booter/2.14.1/surefire-booter-2.14.1.jar
Downloading: http://repo1.maven.org/maven2/org/apache/commons/commons-lang3/3.1/commons-lang3-3.1.jar
Downloading: http://repo1.maven.org/maven2/org/apache/maven/surefire/surefire-api/2.14.1/surefire-api-2.14.1.jar
Downloading: http://repo1.maven.org/maven2/org/apache/maven/plugin-tools/maven-plugin-annotations/3.2/maven-plugin-annotations-3.2.jar
Downloaded: http://repo1.maven.org/maven2/org/apache/maven/surefire/surefire-booter/2.14.1/surefire-booter-2.14.1.jar
(36 KB at 3903.4 KB/sec)
Downloaded: http://repo1.maven.org/maven2/org/apache/maven/plugin-tools/maven-plugin-annotations/3.2/maven-plugin-annotations-3.2.jar
(15 KB at 1472.6 KB/sec)
Downloaded: http://repo1.maven.org/maven2/org/apache/maven/surefire/surefire-api/2.14.1/surefire-api-2.14.1.jar
(153 KB at 8964.9 KB/sec)
Downloaded: http://repo1.maven.org/maven2/org/apache/maven/surefire/maven-surefire-common/2.14.1/maven-surefire-common-2.14.1.jar
(228 KB at 11375.5 KB/sec)
Downloaded: http://repo1.maven.org/maven2/org/apache/commons/commons-lang3/3.1/commons-lang3-3.1.jar
(309 KB at 14685.9 KB/sec)
[JENKINS] Recording test results
[INFO] 
[INFO] --- maven-jar-plugin:2.4:jar (default-jar) @ org.apache.oltu.openidconnect.common ---
Downloading: http://repo1.maven.org/maven2/org/apache/maven/maven-archiver/2.5/maven-archiver-2.5.pom
Downloaded: http://repo1.maven.org/maven2/org/apache/maven/maven-archiver/2.5/maven-archiver-2.5.pom
(5 KB at 738.6 KB/sec)
Downloading: http://repo1.maven.org/maven2/org/codehaus/plexus/plexus-archiver/2.1/plexus-archiver-2.1.pom
Downloaded: http://repo1.maven.org/maven2/org/codehaus/plexus/plexus-archiver/2.1/plexus-archiver-2.1.pom
(3 KB at 685.8 KB/sec)
Downloading: http://repo1.maven.org/maven2/org/codehaus/plexus/plexus-io/2.0.2/plexus-io-2.0.2.pom
Downloaded: http://repo1.maven.org/maven2/org/codehaus/plexus/plexus-io/2.0.2/plexus-io-2.0.2.pom
(2 KB at 423.1 KB/sec)
Downloading: http://repo1.maven.org/maven2/org/codehaus/plexus/plexus-components/1.1.19/plexus-components-1.1.19.pom
Downloaded: http://repo1.maven.org/maven2/org/codehaus/plexus/plexus-components/1.1.19/plexus-components-1.1.19.pom
(3 KB at 878.3 KB/sec)
Downloading: http://repo1.maven.org/maven2/org/codehaus/plexus/plexus/3.0.1/plexus-3.0.1.pom
Downloaded: http://repo1.maven.org/maven2/org/codehaus/plexus/plexus/3.0.1/plexus-3.0.1.pom
(19 KB at 3635.5 KB/sec)
Downloading: http://repo1.maven.org/maven2/org/codehaus/plexus/plexus-interpolation/1.15/plexus-interpolation-1.15.pom
Downloaded: http://repo1.maven.org/maven2/org/codehaus/plexus/plexus-interpolation/1.15/plexus-interpolation-1.15.pom
(1018 B at 248.5 KB/sec)
Downloading: http://repo1.maven.org/maven2/org/codehaus/plexus/plexus-interpolation/1.15/plexus-interpolation-1.15.jar
Downloading: http://repo1.maven.org/maven2/org/apache/maven/maven-archiver/2.5/maven-archiver-2.5.jar
Downloading: http://repo1.maven.org/maven2/org/codehaus/plexus/plexus-archiver/2.1/plexus-archiver-2.1.jar
Downloading: http://repo1.maven.org/maven2/org/codehaus/plexus/plexus-io/2.0.2/plexus-io-2.0.2.jar
Downloading: http://repo1.maven.org/maven2/commons-lang/commons-lang/2.1/commons-lang-2.1.jar
Downloaded: http://repo1.maven.org/maven2/org/apache/maven/maven-archiver/2.5/maven-archiver-2.5.jar
(22 KB at 4260.4 KB/sec)
Downloaded: http://repo1.maven.org/maven2/org/codehaus/plexus/plexus-interpolation/1.15/plexus-interpolation-1.15.jar
(60 KB at 9842.8 KB/sec)
Downloaded: http://repo1.maven.org/maven2/org/codehaus/plexus/plexus-io/2.0.2/plexus-io-2.0.2.jar
(57 KB at 3793.3 KB/sec)
Downloaded: http://repo1.maven.org/maven2/org/codehaus/plexus/plexus-archiver/2.1/plexus-archiver-2.1.jar
(181 KB at 7504.8 KB/sec)
Downloaded: http://repo1.maven.org/maven2/commons-lang/commons-lang/2.1/commons-lang-2.1.jar
(203 KB at 8114.2 KB/sec)
[INFO] Building jar: <https://builds.apache.org/job/Oltu-OpenID-Conect/ws/trunk/openid-connect/common/target/org.apache.oltu.openidconnect.common-0.1-SNAPSHOT.jar>
[INFO] 
[INFO] --- maven-site-plugin:3.0:attach-descriptor (attach-descriptor) @ org.apache.oltu.openidconnect.common
---
[INFO] 
[INFO] --- maven-install-plugin:2.4:install (default-install) @ org.apache.oltu.openidconnect.common
---
[INFO] Installing <https://builds.apache.org/job/Oltu-OpenID-Conect/ws/trunk/openid-connect/common/target/org.apache.oltu.openidconnect.common-0.1-SNAPSHOT.jar>
to <https://builds.apache.org/job/Oltu-OpenID-Conect/ws/.repository/org/apache/oltu/openidconnect/org.apache.oltu.openidconnect.common/0.1-SNAPSHOT/org.apache.oltu.openidconnect.common-0.1-SNAPSHOT.jar>
[INFO] Installing <https://builds.apache.org/job/Oltu-OpenID-Conect/ws/trunk/openid-connect/common/pom.xml>
to <https://builds.apache.org/job/Oltu-OpenID-Conect/ws/.repository/org/apache/oltu/openidconnect/org.apache.oltu.openidconnect.common/0.1-SNAPSHOT/org.apache.oltu.openidconnect.common-0.1-SNAPSHOT.pom>
[INFO] 
[INFO] --- maven-deploy-plugin:2.7:deploy (default-deploy) @ org.apache.oltu.openidconnect.common
---
Downloading: https://repository.apache.org/content/repositories/snapshots/org/apache/oltu/openidconnect/org.apache.oltu.openidconnect.common/0.1-SNAPSHOT/maven-metadata.xml
Downloaded: https://repository.apache.org/content/repositories/snapshots/org/apache/oltu/openidconnect/org.apache.oltu.openidconnect.common/0.1-SNAPSHOT/maven-metadata.xml
(812 B at 0.6 KB/sec)
Uploading: https://repository.apache.org/content/repositories/snapshots/org/apache/oltu/openidconnect/org.apache.oltu.openidconnect.common/0.1-SNAPSHOT/org.apache.oltu.openidconnect.common-0.1-20140224.142157-77.jar
Uploaded: https://repository.apache.org/content/repositories/snapshots/org/apache/oltu/openidconnect/org.apache.oltu.openidconnect.common/0.1-SNAPSHOT/org.apache.oltu.openidconnect.common-0.1-20140224.142157-77.jar
(8 KB at 1.4 KB/sec)
Uploading: https://repository.apache.org/content/repositories/snapshots/org/apache/oltu/openidconnect/org.apache.oltu.openidconnect.common/0.1-SNAPSHOT/org.apache.oltu.openidconnect.common-0.1-20140224.142157-77.pom
Uploaded: https://repository.apache.org/content/repositories/snapshots/org/apache/oltu/openidconnect/org.apache.oltu.openidconnect.common/0.1-SNAPSHOT/org.apache.oltu.openidconnect.common-0.1-20140224.142157-77.pom
(2 KB at 2.4 KB/sec)
Downloading: https://repository.apache.org/content/repositories/snapshots/org/apache/oltu/openidconnect/org.apache.oltu.openidconnect.common/maven-metadata.xml
Downloaded: https://repository.apache.org/content/repositories/snapshots/org/apache/oltu/openidconnect/org.apache.oltu.openidconnect.common/maven-metadata.xml
(323 B at 0.6 KB/sec)
Uploading: https://repository.apache.org/content/repositories/snapshots/org/apache/oltu/openidconnect/org.apache.oltu.openidconnect.common/0.1-SNAPSHOT/maven-metadata.xml
Uploaded: https://repository.apache.org/content/repositories/snapshots/org/apache/oltu/openidconnect/org.apache.oltu.openidconnect.common/0.1-SNAPSHOT/maven-metadata.xml
(812 B at 1.1 KB/sec)
Uploading: https://repository.apache.org/content/repositories/snapshots/org/apache/oltu/openidconnect/org.apache.oltu.openidconnect.common/maven-metadata.xml
Uploaded: https://repository.apache.org/content/repositories/snapshots/org/apache/oltu/openidconnect/org.apache.oltu.openidconnect.common/maven-metadata.xml
(323 B at 0.4 KB/sec)
[INFO]                                                                         
[INFO] ------------------------------------------------------------------------
[INFO] Building Apache Oltu - OpenId Connect - Client 0.1-SNAPSHOT
[INFO] ------------------------------------------------------------------------
Downloading: http://repository.apache.org/snapshots/org/apache/oltu/oauth2/org.apache.oltu.oauth2.client/1.0.0-SNAPSHOT/maven-metadata.xml
Downloaded: http://repository.apache.org/snapshots/org/apache/oltu/oauth2/org.apache.oltu.oauth2.client/1.0.0-SNAPSHOT/maven-metadata.xml
(2 KB at 0.4 KB/sec)
Downloading: http://repository.apache.org/snapshots/org/apache/oltu/oauth2/org.apache.oltu.oauth2.client/1.0.0-SNAPSHOT/org.apache.oltu.oauth2.client-1.0.0-20140224.014103-83.pom
Downloaded: http://repository.apache.org/snapshots/org/apache/oltu/oauth2/org.apache.oltu.oauth2.client/1.0.0-SNAPSHOT/org.apache.oltu.oauth2.client-1.0.0-20140224.014103-83.pom
(3 KB at 5.1 KB/sec)
Downloading: http://repository.apache.org/snapshots/org/apache/oltu/oauth2/org.apache.oltu.oauth2.parent/1.0.0-SNAPSHOT/maven-metadata.xml
Downloaded: http://repository.apache.org/snapshots/org/apache/oltu/oauth2/org.apache.oltu.oauth2.parent/1.0.0-SNAPSHOT/maven-metadata.xml
(630 B at 0.8 KB/sec)
Downloading: http://repository.apache.org/snapshots/org/apache/oltu/oauth2/org.apache.oltu.oauth2.parent/1.0.0-SNAPSHOT/org.apache.oltu.oauth2.parent-1.0.0-20140224.014050-84.pom
Downloaded: http://repository.apache.org/snapshots/org/apache/oltu/oauth2/org.apache.oltu.oauth2.parent/1.0.0-SNAPSHOT/org.apache.oltu.oauth2.parent-1.0.0-20140224.014050-84.pom
(5 KB at 7.0 KB/sec)
Downloading: http://repository.apache.org/snapshots/org/apache/oltu/oauth2/org.apache.oltu.oauth2.common/1.0.0-SNAPSHOT/maven-metadata.xml
Downloaded: http://repository.apache.org/snapshots/org/apache/oltu/oauth2/org.apache.oltu.oauth2.common/1.0.0-SNAPSHOT/maven-metadata.xml
(804 B at 1.2 KB/sec)
Downloading: http://repository.apache.org/snapshots/org/apache/oltu/oauth2/org.apache.oltu.oauth2.common/1.0.0-SNAPSHOT/org.apache.oltu.oauth2.common-1.0.0-20140224.014055-84.pom
Downloaded: http://repository.apache.org/snapshots/org/apache/oltu/oauth2/org.apache.oltu.oauth2.common/1.0.0-SNAPSHOT/org.apache.oltu.oauth2.common-1.0.0-20140224.014055-84.pom
(3 KB at 4.7 KB/sec)
Downloading: http://repo1.maven.org/maven2/org/json/json/20131018/json-20131018.pom
Downloaded: http://repo1.maven.org/maven2/org/json/json/20131018/json-20131018.pom (5 KB at
255.6 KB/sec)
Downloading: http://repo1.maven.org/maven2/org/sonatype/oss/oss-parent/7/oss-parent-7.pom
Downloaded: http://repo1.maven.org/maven2/org/sonatype/oss/oss-parent/7/oss-parent-7.pom (5
KB at 1177.7 KB/sec)
Downloading: http://repo1.maven.org/maven2/commons-codec/commons-codec/1.8/commons-codec-1.8.pom
Downloaded: http://repo1.maven.org/maven2/commons-codec/commons-codec/1.8/commons-codec-1.8.pom
(12 KB at 2229.9 KB/sec)
Downloading: http://repo1.maven.org/maven2/org/apache/commons/commons-parent/28/commons-parent-28.pom
Downloaded: http://repo1.maven.org/maven2/org/apache/commons/commons-parent/28/commons-parent-28.pom
(49 KB at 8162.3 KB/sec)
Downloading: http://repo1.maven.org/maven2/org/slf4j/slf4j-api/1.6.1/slf4j-api-1.6.1.pom
Downloaded: http://repo1.maven.org/maven2/org/slf4j/slf4j-api/1.6.1/slf4j-api-1.6.1.pom (3
KB at 487.3 KB/sec)
Downloading: http://repo1.maven.org/maven2/org/slf4j/slf4j-parent/1.6.1/slf4j-parent-1.6.1.pom
Downloaded: http://repo1.maven.org/maven2/org/slf4j/slf4j-parent/1.6.1/slf4j-parent-1.6.1.pom
(10 KB at 1820.9 KB/sec)
Downloading: http://repository.apache.org/snapshots/org/apache/oltu/oauth2/org.apache.oltu.oauth2.jwt/1.0.0-SNAPSHOT/maven-metadata.xml
Downloaded: http://repository.apache.org/snapshots/org/apache/oltu/oauth2/org.apache.oltu.oauth2.jwt/1.0.0-SNAPSHOT/maven-metadata.xml
(801 B at 1.0 KB/sec)
Downloading: http://repository.apache.org/snapshots/org/apache/oltu/oauth2/org.apache.oltu.oauth2.jwt/1.0.0-SNAPSHOT/org.apache.oltu.oauth2.jwt-1.0.0-20140203.172703-66.pom
Downloaded: http://repository.apache.org/snapshots/org/apache/oltu/oauth2/org.apache.oltu.oauth2.jwt/1.0.0-SNAPSHOT/org.apache.oltu.oauth2.jwt-1.0.0-20140203.172703-66.pom
(3 KB at 3.6 KB/sec)
Downloading: http://repository.apache.org/snapshots/org/apache/oltu/commons/org.apache.oltu.commons.encodedtoken/1.0.0-SNAPSHOT/maven-metadata.xml
Downloading: http://repository.apache.org/snapshots/org/apache/oltu/commons/org.apache.oltu.commons.encodedtoken/1.0.0-SNAPSHOT/org.apache.oltu.commons.encodedtoken-1.0.0-SNAPSHOT.pom
[WARNING] The POM for org.apache.oltu.commons:org.apache.oltu.commons.encodedtoken:jar:1.0.0-SNAPSHOT
is missing, no dependency information available
Downloading: http://repository.apache.org/snapshots/org/apache/oltu/commons/org.apache.oltu.commons.json/1.0.0-SNAPSHOT/maven-metadata.xml
Downloading: http://repository.apache.org/snapshots/org/apache/oltu/commons/org.apache.oltu.commons.json/1.0.0-SNAPSHOT/org.apache.oltu.commons.json-1.0.0-SNAPSHOT.pom
[WARNING] The POM for org.apache.oltu.commons:org.apache.oltu.commons.json:jar:1.0.0-SNAPSHOT
is missing, no dependency information available
Downloading: http://repo1.maven.org/maven2/junit-addons/junit-addons/1.4/junit-addons-1.4.pom
Downloaded: http://repo1.maven.org/maven2/junit-addons/junit-addons/1.4/junit-addons-1.4.pom
(626 B at 122.3 KB/sec)
Downloading: http://repo1.maven.org/maven2/xerces/xercesImpl/2.6.2/xercesImpl-2.6.2.pom
Downloaded: http://repo1.maven.org/maven2/xerces/xercesImpl/2.6.2/xercesImpl-2.6.2.pom (150
B at 29.3 KB/sec)
Downloading: http://repo1.maven.org/maven2/xerces/xmlParserAPIs/2.6.2/xmlParserAPIs-2.6.2.pom
Downloaded: http://repo1.maven.org/maven2/xerces/xmlParserAPIs/2.6.2/xmlParserAPIs-2.6.2.pom
(153 B at 18.7 KB/sec)
Downloading: http://repository.apache.org/snapshots/org/apache/oltu/oauth2/org.apache.oltu.oauth2.client/1.0.0-SNAPSHOT/org.apache.oltu.oauth2.client-1.0.0-20140224.014103-83.jar
Downloading: http://repository.apache.org/snapshots/org/apache/oltu/oauth2/org.apache.oltu.oauth2.common/1.0.0-SNAPSHOT/org.apache.oltu.oauth2.common-1.0.0-20140224.014055-84.jar
Downloading: http://repository.apache.org/snapshots/org/apache/oltu/oauth2/org.apache.oltu.oauth2.jwt/1.0.0-SNAPSHOT/org.apache.oltu.oauth2.jwt-1.0.0-20140203.172703-66.jar
Downloading: http://repository.apache.org/snapshots/org/apache/oltu/commons/org.apache.oltu.commons.json/1.0.0-SNAPSHOT/org.apache.oltu.commons.json-1.0.0-SNAPSHOT.jar
Downloading: http://repository.apache.org/snapshots/org/apache/oltu/commons/org.apache.oltu.commons.encodedtoken/1.0.0-SNAPSHOT/org.apache.oltu.commons.encodedtoken-1.0.0-SNAPSHOT.jar
Downloaded: http://repository.apache.org/snapshots/org/apache/oltu/oauth2/org.apache.oltu.oauth2.jwt/1.0.0-SNAPSHOT/org.apache.oltu.oauth2.jwt-1.0.0-20140203.172703-66.jar
(19 KB at 19.8 KB/sec)
Downloaded: http://repository.apache.org/snapshots/org/apache/oltu/oauth2/org.apache.oltu.oauth2.client/1.0.0-SNAPSHOT/org.apache.oltu.oauth2.client-1.0.0-20140224.014103-83.jar
(31 KB at 28.8 KB/sec)
Downloaded: http://repository.apache.org/snapshots/org/apache/oltu/oauth2/org.apache.oltu.oauth2.common/1.0.0-SNAPSHOT/org.apache.oltu.oauth2.common-1.0.0-20140224.014055-84.jar
(52 KB at 42.9 KB/sec)
Downloading: http://repo1.maven.org/maven2/org/slf4j/slf4j-api/1.6.1/slf4j-api-1.6.1.jar
Downloading: http://repo1.maven.org/maven2/commons-codec/commons-codec/1.8/commons-codec-1.8.jar
Downloading: http://repo1.maven.org/maven2/junit-addons/junit-addons/1.4/junit-addons-1.4.jar
Downloading: http://repo1.maven.org/maven2/org/json/json/20131018/json-20131018.jar
Downloading: http://repo1.maven.org/maven2/xerces/xercesImpl/2.6.2/xercesImpl-2.6.2.jar
Downloaded: http://repo1.maven.org/maven2/org/slf4j/slf4j-api/1.6.1/slf4j-api-1.6.1.jar (25
KB at 2489.8 KB/sec)
Downloading: http://repo1.maven.org/maven2/xerces/xmlParserAPIs/2.6.2/xmlParserAPIs-2.6.2.jar
Downloaded: http://repo1.maven.org/maven2/org/json/json/20131018/json-20131018.jar (64 KB
at 4543.7 KB/sec)
Downloaded: http://repo1.maven.org/maven2/junit-addons/junit-addons/1.4/junit-addons-1.4.jar
(53 KB at 3782.9 KB/sec)
Downloaded: http://repo1.maven.org/maven2/xerces/xmlParserAPIs/2.6.2/xmlParserAPIs-2.6.2.jar
(122 KB at 12180.1 KB/sec)
Downloaded: http://repo1.maven.org/maven2/commons-codec/commons-codec/1.8/commons-codec-1.8.jar
(258 KB at 11203.5 KB/sec)
Downloaded: http://repo1.maven.org/maven2/xerces/xercesImpl/2.6.2/xercesImpl-2.6.2.jar (987
KB at 26675.3 KB/sec)
[INFO] ------------------------------------------------------------------------
[INFO] Reactor Summary:
[INFO] 
[INFO] Apache Oltu - OpenId Connect - Parent ............. SUCCESS [2:12.579s]
[INFO] Apache Oltu - OpenId Connect - Common ............. SUCCESS [35.585s]
[INFO] Apache Oltu - OpenId Connect - Client ............. FAILURE [12.226s]
[INFO] ------------------------------------------------------------------------
[INFO] BUILD FAILURE
[INFO] ------------------------------------------------------------------------
[INFO] Total time: 18:34.086s
[INFO] Finished at: Mon Feb 24 14:32:29 GMT+00:00 2014
[INFO] Final Memory: 17M/209M
[INFO] ------------------------------------------------------------------------
Waiting for Jenkins to finish collecting data
[ERROR] Failed to execute goal on project org.apache.oltu.openidconnect.client: Could not
resolve dependencies for project org.apache.oltu.openidconnect:org.apache.oltu.openidconnect.client:jar:0.1-SNAPSHOT:
The following artifacts could not be resolved: org.apache.oltu.commons:org.apache.oltu.commons.encodedtoken:jar:1.0.0-SNAPSHOT,
org.apache.oltu.commons:org.apache.oltu.commons.json:jar:1.0.0-SNAPSHOT: Could not find artifact
org.apache.oltu.commons:org.apache.oltu.commons.encodedtoken:jar:1.0.0-SNAPSHOT in Nexus (http://repository.apache.org/snapshots)
-> [Help 1]
org.apache.maven.lifecycle.LifecycleExecutionException: Failed to execute goal on project
org.apache.oltu.openidconnect.client: Could not resolve dependencies for project org.apache.oltu.openidconnect:org.apache.oltu.openidconnect.client:jar:0.1-SNAPSHOT:
The following artifacts could not be resolved: org.apache.oltu.commons:org.apache.oltu.commons.encodedtoken:jar:1.0.0-SNAPSHOT,
org.apache.oltu.commons:org.apache.oltu.commons.json:jar:1.0.0-SNAPSHOT: Could not find artifact
org.apache.oltu.commons:org.apache.oltu.commons.encodedtoken:jar:1.0.0-SNAPSHOT in Nexus (http://repository.apache.org/snapshots)
	at org.apache.maven.lifecycle.internal.LifecycleDependencyResolver.getDependencies(LifecycleDependencyResolver.java:196)
	at org.apache.maven.lifecycle.internal.LifecycleDependencyResolver.resolveProjectDependencies(LifecycleDependencyResolver.java:108)
	at org.apache.maven.lifecycle.internal.MojoExecutor.ensureDependenciesAreResolved(MojoExecutor.java:258)
	at org.apache.maven.lifecycle.internal.MojoExecutor.execute(MojoExecutor.java:201)
	at org.apache.maven.lifecycle.internal.MojoExecutor.execute(MojoExecutor.java:153)
	at org.apache.maven.lifecycle.internal.MojoExecutor.execute(MojoExecutor.java:145)
	at org.apache.maven.lifecycle.internal.LifecycleModuleBuilder.buildProject(LifecycleModuleBuilder.java:84)
	at org.apache.maven.lifecycle.internal.LifecycleModuleBuilder.buildProject(LifecycleModuleBuilder.java:59)
	at org.apache.maven.lifecycle.internal.LifecycleStarter.singleThreadedBuild(LifecycleStarter.java:183)
	at org.apache.maven.lifecycle.internal.LifecycleStarter.execute(LifecycleStarter.java:161)
	at org.apache.maven.DefaultMaven.doExecute(DefaultMaven.java:319)
	at org.apache.maven.DefaultMaven.execute(DefaultMaven.java:156)
	at org.jvnet.hudson.maven3.launcher.Maven3Launcher.main(Maven3Launcher.java:117)
	at sun.reflect.NativeMethodAccessorImpl.invoke0(Native Method)
	at sun.reflect.NativeMethodAccessorImpl.invoke(NativeMethodAccessorImpl.java:39)
	at sun.reflect.DelegatingMethodAccessorImpl.invoke(DelegatingMethodAccessorImpl.java:25)
	at java.lang.reflect.Method.invoke(Method.java:597)
	at org.codehaus.plexus.classworlds.launcher.Launcher.launchStandard(Launcher.java:329)
	at org.codehaus.plexus.classworlds.launcher.Launcher.launch(Launcher.java:239)
	at org.jvnet.hudson.maven3.agent.Maven3Main.launch(Maven3Main.java:178)
	at sun.reflect.NativeMethodAccessorImpl.invoke0(Native Method)
	at sun.reflect.NativeMethodAccessorImpl.invoke(NativeMethodAccessorImpl.java:39)
	at sun.reflect.DelegatingMethodAccessorImpl.invoke(DelegatingMethodAccessorImpl.java:25)
	at java.lang.reflect.Method.invoke(Method.java:597)
	at hudson.maven.Maven3Builder.call(Maven3Builder.java:134)
	at hudson.maven.Maven3Builder.call(Maven3Builder.java:69)
	at hudson.remoting.UserRequest.perform(UserRequest.java:118)
	at hudson.remoting.UserRequest.perform(UserRequest.java:48)
	at hudson.remoting.Request$2.run(Request.java:328)
	at hudson.remoting.InterceptingExecutorService$1.call(InterceptingExecutorService.java:72)
	at java.util.concurrent.FutureTask$Sync.innerRun(FutureTask.java:303)
	at java.util.concurrent.FutureTask.run(FutureTask.java:138)
	at java.util.concurrent.ThreadPoolExecutor$Worker.runTask(ThreadPoolExecutor.java:886)
	at java.util.concurrent.ThreadPoolExecutor$Worker.run(ThreadPoolExecutor.java:908)
	at java.lang.Thread.run(Thread.java:662)
Caused by: org.apache.maven.project.DependencyResolutionException: Could not resolve dependencies
for project org.apache.oltu.openidconnect:org.apache.oltu.openidconnect.client:jar:0.1-SNAPSHOT:
The following artifacts could not be resolved: org.apache.oltu.commons:org.apache.oltu.commons.encodedtoken:jar:1.0.0-SNAPSHOT,
org.apache.oltu.commons:org.apache.oltu.commons.json:jar:1.0.0-SNAPSHOT: Could not find artifact
org.apache.oltu.commons:org.apache.oltu.commons.encodedtoken:jar:1.0.0-SNAPSHOT in Nexus (http://repository.apache.org/snapshots)
	at org.apache.maven.project.DefaultProjectDependenciesResolver.resolve(DefaultProjectDependenciesResolver.java:170)
	at org.apache.maven.lifecycle.internal.LifecycleDependencyResolver.getDependencies(LifecycleDependencyResolver.java:171)
	... 34 more
Caused by: org.sonatype.aether.resolution.DependencyResolutionException: The following artifacts
could not be resolved: org.apache.oltu.commons:org.apache.oltu.commons.encodedtoken:jar:1.0.0-SNAPSHOT,
org.apache.oltu.commons:org.apache.oltu.commons.json:jar:1.0.0-SNAPSHOT: Could not find artifact
org.apache.oltu.commons:org.apache.oltu.commons.encodedtoken:jar:1.0.0-SNAPSHOT in Nexus (http://repository.apache.org/snapshots)
	at org.sonatype.aether.impl.internal.DefaultRepositorySystem.resolveDependencies(DefaultRepositorySystem.java:412)
	at org.apache.maven.project.DefaultProjectDependenciesResolver.resolve(DefaultProjectDependenciesResolver.java:164)
	... 35 more
Caused by: org.sonatype.aether.resolution.ArtifactResolutionException: The following artifacts
could not be resolved: org.apache.oltu.commons:org.apache.oltu.commons.encodedtoken:jar:1.0.0-SNAPSHOT,
org.apache.oltu.commons:org.apache.oltu.commons.json:jar:1.0.0-SNAPSHOT: Could not find artifact
org.apache.oltu.commons:org.apache.oltu.commons.encodedtoken:jar:1.0.0-SNAPSHOT in Nexus (http://repository.apache.org/snapshots)
	at org.sonatype.aether.impl.internal.DefaultArtifactResolver.resolve(DefaultArtifactResolver.java:541)
	at org.sonatype.aether.impl.internal.DefaultArtifactResolver.resolveArtifacts(DefaultArtifactResolver.java:220)
	at org.sonatype.aether.impl.internal.DefaultRepositorySystem.resolveDependencies(DefaultRepositorySystem.java:395)
	... 36 more
Caused by: org.sonatype.aether.transfer.ArtifactNotFoundException: Could not find artifact
org.apache.oltu.commons:org.apache.oltu.commons.encodedtoken:jar:1.0.0-SNAPSHOT in Nexus (http://repository.apache.org/snapshots)
	at org.sonatype.aether.connector.wagon.WagonRepositoryConnector$4.wrap(WagonRepositoryConnector.java:945)
	at org.sonatype.aether.connector.wagon.WagonRepositoryConnector$4.wrap(WagonRepositoryConnector.java:940)
	at org.sonatype.aether.connector.wagon.WagonRepositoryConnector$GetTask.flush(WagonRepositoryConnector.java:695)
	at org.sonatype.aether.connector.wagon.WagonRepositoryConnector$GetTask.flush(WagonRepositoryConnector.java:689)
	at org.sonatype.aether.connector.wagon.WagonRepositoryConnector.get(WagonRepositoryConnector.java:445)
	at org.sonatype.aether.impl.internal.DefaultArtifactResolver.resolve(DefaultArtifactResolver.java:460)
	... 38 more
[ERROR] 
[ERROR] Re-run Maven using the -X switch to enable full debug logging.
[ERROR] 
[ERROR] For more information about the errors and possible solutions, please read the following
articles:
[ERROR] [Help 1] http://cwiki.apache.org/confluence/display/MAVEN/DependencyResolutionException
[ERROR] 
[ERROR] After correcting the problems, you can resume the build with the command
[ERROR]   mvn <goals> -rf :org.apache.oltu.openidconnect.client
[JENKINS] Archiving <https://builds.apache.org/job/Oltu-OpenID-Conect/ws/trunk/openid-connect/pom.xml>
to org.apache.oltu.openidconnect/org.apache.oltu.openidconnect.parent/0.1-SNAPSHOT/org.apache.oltu.openidconnect.parent-0.1-SNAPSHOT.pom
[JENKINS] Archiving <https://builds.apache.org/job/Oltu-OpenID-Conect/ws/trunk/openid-connect/common/pom.xml>
to org.apache.oltu.openidconnect/org.apache.oltu.openidconnect.common/0.1-SNAPSHOT/org.apache.oltu.openidconnect.common-0.1-SNAPSHOT.pom
[JENKINS] Archiving <https://builds.apache.org/job/Oltu-OpenID-Conect/ws/trunk/openid-connect/common/target/org.apache.oltu.openidconnect.common-0.1-SNAPSHOT.jar>
to org.apache.oltu.openidconnect/org.apache.oltu.openidconnect.common/0.1-20140224.142157-77/org.apache.oltu.openidconnect.common-0.1-20140224.142157-77.jar
[JENKINS] Archiving <https://builds.apache.org/job/Oltu-OpenID-Conect/ws/trunk/openid-connect/client/pom.xml>
to org.apache.oltu.openidconnect/org.apache.oltu.openidconnect.client/0.1-SNAPSHOT/org.apache.oltu.openidconnect.client-0.1-SNAPSHOT.pom
Sending e-mails to: dev@oltu.apache.org
channel stopped

Mime
View raw message