oltu-dev mailing list archives

Site index · List index
Message view « Date » · « Thread »
Top « Date » · « Thread »
From Apache Jenkins Server <jenk...@builds.apache.org>
Subject Build failed in Jenkins: Oltu-OAuth-2.0-windows #103
Date Thu, 20 Jun 2013 16:12:31 GMT
See <https://builds.apache.org/job/Oltu-OAuth-2.0-windows/103/changes>

Changes:

[simonetripodi] [maven-release-plugin] prepare release org.apache.oltu.oauth2.parent-0.31

[simonetripodi] [maven-release-plugin] rollback the release of org.apache.oltu.oauth2.parent-0.31

[simonetripodi] [maven-release-plugin] prepare release org.apache.oltu.oauth2.parent-0.31

------------------------------------------
Started by an SCM change
Building remotely on windows1 in workspace <https://builds.apache.org/job/Oltu-OAuth-2.0-windows/ws/>
Updating https://svn.apache.org/repos/asf/oltu/trunk
U         oauth-2.0\resourceserver-filter\pom.xml
U         oauth-2.0\authzserver\pom.xml
U         oauth-2.0\httpclient4\pom.xml
U         oauth-2.0\integration-tests\pom.xml
U         oauth-2.0\jwt\pom.xml
U         oauth-2.0\dynamicreg-server\pom.xml
U         oauth-2.0\common\pom.xml
U         oauth-2.0\dynamicreg-common\pom.xml
U         oauth-2.0\pom.xml
U         oauth-2.0\test-utils\pom.xml
U         oauth-2.0\client\pom.xml
U         oauth-2.0\dynamicreg-client\pom.xml
U         oauth-2.0\resourceserver\pom.xml
At revision 1495073
Parsing POMs
Downloaded artifact http://repo.maven.apache.org/maven2//org/apache/oltu/org.apache.oltu.parent/1/org.apache.oltu.parent-1.pom
Modules changed, recalculating dependency graph
[oauth-2.0] $ f:\hudson\tools\java\latest-1.6-64/bin/java -da -dsa -XX:MaxPermSize=192m -Xmx512M
-cp f:\hudson\hudson-slave\maven3-agent.jar;f:\hudson\tools\maven\latest\boot\plexus-classworlds-2.4.jar
org.jvnet.hudson.maven3.agent.Maven3Main f:\hudson\tools\maven\latest C:\Users\hudson\AppData\LocalLow\Sun\Java\Deployment\cache\6.0\39\4bb6b7e7-33fec62f
f:\hudson\hudson-slave\maven3-interceptor.jar 60612
<===[JENKINS REMOTING CAPACITY]===>   channel started
log4j:WARN No appenders could be found for logger (org.apache.commons.beanutils.converters.BooleanConverter).
log4j:WARN Please initialize the log4j system properly.
Executing Maven:  -B -f <https://builds.apache.org/job/Oltu-OAuth-2.0-windows/ws/trunk\oauth-2.0\pom.xml>
-Dmaven.repo.local=f:\hudson\hudson-slave\maven-repositories\1 -B -e clean deploy
[INFO] Error stacktraces are turned on.
[INFO] Scanning for projects...
[INFO] ------------------------------------------------------------------------
[INFO] Reactor Build Order:
[INFO] 
[INFO] Apache Oltu - OAuth 2.0 - Parent
[INFO] Apache Oltu - OAuth 2.0 - Common
[INFO] Apache Oltu - OAuth 2.0 - Client
[INFO] Apache Oltu - OAuth 2.0 - HttpClient
[INFO] Apache Oltu - OAuth 2.0 - Dynamic Registration Common
[INFO] Apache Oltu - OAuth 2.0 - Dynamic Registration Client
[INFO] Apache Oltu - OAuth 2.0 - Authorization Server
[INFO] Apache Oltu - OAuth 2.0 - Resource Server
[INFO] Apache Oltu - OAuth 2.0 - Resource Server Filter
[INFO] Apache Oltu - OAuth 2.0 - Test Utils
[INFO] Apache Oltu - OAuth 2.0 - Dynamic Registration Server
[INFO] Apache Oltu - OAuth 2.0 - Integration Tests
[INFO] Apache Oltu - OAuth 2.0 - JWT
[INFO]                                                                         
[INFO] ------------------------------------------------------------------------
[INFO] Building Apache Oltu - OAuth 2.0 - Parent 0.31
[INFO] ------------------------------------------------------------------------
Downloading: http://repo1.maven.org/maven2/org/codehaus/mojo/buildnumber-maven-plugin/1.2/buildnumber-maven-plugin-1.2.pom
Downloaded: http://repo1.maven.org/maven2/org/codehaus/mojo/buildnumber-maven-plugin/1.2/buildnumber-maven-plugin-1.2.pom
(13 KB at 77.0 KB/sec)
Downloading: http://repo1.maven.org/maven2/org/codehaus/mojo/buildnumber-maven-plugin/1.2/buildnumber-maven-plugin-1.2.jar
Downloaded: http://repo1.maven.org/maven2/org/codehaus/mojo/buildnumber-maven-plugin/1.2/buildnumber-maven-plugin-1.2.jar
(26 KB at 372.4 KB/sec)
[INFO] 
[INFO] --- maven-clean-plugin:2.5:clean (default-clean) @ org.apache.oltu.oauth2.parent ---
[INFO] Deleting <https://builds.apache.org/job/Oltu-OAuth-2.0-windows/ws/trunk\oauth-2.0\target>
[INFO] 
[INFO] --- maven-enforcer-plugin:1.2:enforce (enforce-java) @ org.apache.oltu.oauth2.parent
---
[INFO] 
[INFO] --- buildnumber-maven-plugin:1.2:create (default) @ org.apache.oltu.oauth2.parent ---
[INFO] Checking for local modifications: skipped.
[INFO] Updating project files from SCM: skipped.
[INFO] Executing: cmd.exe /X /C "svn --non-interactive info"
[INFO] Working directory: <https://builds.apache.org/job/Oltu-OAuth-2.0-windows/ws/trunk\oauth-2.0>
[INFO] Storing buildNumber: 1495071 at timestamp: 1371744735733
[INFO] Executing: cmd.exe /X /C "svn --non-interactive info"
[INFO] Working directory: <https://builds.apache.org/job/Oltu-OAuth-2.0-windows/ws/trunk\oauth-2.0>
[INFO] Storing buildScmBranch: trunk
[INFO] 
[INFO] --- maven-remote-resources-plugin:1.2.1:process (default) @ org.apache.oltu.oauth2.parent
---
[INFO] 
[INFO] --- maven-bundle-plugin:2.3.7:manifest (bundle-manifest) @ org.apache.oltu.oauth2.parent
---
[WARNING] Ignoring project type pom - supportedProjectTypes = [jar, bundle]
[INFO] 
[INFO] --- maven-site-plugin:3.0:attach-descriptor (attach-descriptor) @ org.apache.oltu.oauth2.parent
---
[INFO] 
[INFO] --- maven-install-plugin:2.4:install (default-install) @ org.apache.oltu.oauth2.parent
---
[INFO] Installing <https://builds.apache.org/job/Oltu-OAuth-2.0-windows/ws/trunk\oauth-2.0\pom.xml>
to f:\hudson\hudson-slave\maven-repositories\1\org\apache\oltu\oauth2\org.apache.oltu.oauth2.parent\0.31\org.apache.oltu.oauth2.parent-0.31.pom
[INFO] 
[INFO] --- maven-deploy-plugin:2.7:deploy (default-deploy) @ org.apache.oltu.oauth2.parent
---
Uploading: https://repository.apache.org/service/local/staging/deploy/maven2/org/apache/oltu/oauth2/org.apache.oltu.oauth2.parent/0.31/org.apache.oltu.oauth2.parent-0.31.pom
[INFO] ------------------------------------------------------------------------
[INFO] Reactor Summary:
[INFO] 
[INFO] Apache Oltu - OAuth 2.0 - Parent .................. FAILURE [14.605s]
[INFO] Apache Oltu - OAuth 2.0 - Common .................. SKIPPED
[INFO] Apache Oltu - OAuth 2.0 - Client .................. SKIPPED
[INFO] Apache Oltu - OAuth 2.0 - HttpClient .............. SKIPPED
[INFO] Apache Oltu - OAuth 2.0 - Dynamic Registration Common  SKIPPED
[INFO] Apache Oltu - OAuth 2.0 - Dynamic Registration Client  SKIPPED
[INFO] Apache Oltu - OAuth 2.0 - Authorization Server .... SKIPPED
[INFO] Apache Oltu - OAuth 2.0 - Resource Server ......... SKIPPED
[INFO] Apache Oltu - OAuth 2.0 - Resource Server Filter .. SKIPPED
[INFO] Apache Oltu - OAuth 2.0 - Test Utils .............. SKIPPED
[INFO] Apache Oltu - OAuth 2.0 - Dynamic Registration Server  SKIPPED
[INFO] Apache Oltu - OAuth 2.0 - Integration Tests ....... SKIPPED
[INFO] Apache Oltu - OAuth 2.0 - JWT ..................... SKIPPED
[INFO] ------------------------------------------------------------------------
[INFO] BUILD FAILURE
[INFO] ------------------------------------------------------------------------
[INFO] Total time: 15.895s
[INFO] Finished at: Thu Jun 20 17:12:22 BST 2013
[INFO] Final Memory: 18M/125M
[INFO] ------------------------------------------------------------------------
[JENKINS] Archiving F:\hudson\hudson-slave\workspace\Oltu-OAuth-2.0-windows\trunk\oauth-2.0\client\pom.xml
to /home/hudson/hudson/jobs/Oltu-OAuth-2.0-windows/modules/org.apache.oltu.oauth2$org.apache.oltu.oauth2.client/builds/2013-06-20_16-12-04/archive/org.apache.oltu.oauth2/org.apache.oltu.oauth2.client/0.31/org.apache.oltu.oauth2.client-0.31.pom
[JENKINS] Archiving F:\hudson\hudson-slave\workspace\Oltu-OAuth-2.0-windows\trunk\oauth-2.0\httpclient4\pom.xml
to /home/hudson/hudson/jobs/Oltu-OAuth-2.0-windows/modules/org.apache.oltu.oauth2$org.apache.oltu.oauth2.httpclient4/builds/2013-06-20_16-12-04/archive/org.apache.oltu.oauth2/org.apache.oltu.oauth2.httpclient4/0.31/org.apache.oltu.oauth2.httpclient4-0.31.pom
[JENKINS] Archiving F:\hudson\hudson-slave\workspace\Oltu-OAuth-2.0-windows\trunk\oauth-2.0\test-utils\pom.xml
to /home/hudson/hudson/jobs/Oltu-OAuth-2.0-windows/modules/org.apache.oltu.oauth2$org.apache.oltu.oauth2.test-utils/builds/2013-06-20_16-12-04/archive/org.apache.oltu.oauth2/org.apache.oltu.oauth2.test-utils/0.31/org.apache.oltu.oauth2.test-utils-0.31.pom
[JENKINS] Archiving F:\hudson\hudson-slave\workspace\Oltu-OAuth-2.0-windows\trunk\oauth-2.0\authzserver\pom.xml
to /home/hudson/hudson/jobs/Oltu-OAuth-2.0-windows/modules/org.apache.oltu.oauth2$org.apache.oltu.oauth2.authzserver/builds/2013-06-20_16-12-04/archive/org.apache.oltu.oauth2/org.apache.oltu.oauth2.authzserver/0.31/org.apache.oltu.oauth2.authzserver-0.31.pom
[JENKINS] Archiving F:\hudson\hudson-slave\workspace\Oltu-OAuth-2.0-windows\trunk\oauth-2.0\integration-tests\pom.xml
to /home/hudson/hudson/jobs/Oltu-OAuth-2.0-windows/modules/org.apache.oltu.oauth2$org.apache.oltu.oauth2.integration-tests/builds/2013-06-20_16-12-04/archive/org.apache.oltu.oauth2/org.apache.oltu.oauth2.integration-tests/0.31/org.apache.oltu.oauth2.integration-tests-0.31.pom
[JENKINS] Archiving F:\hudson\hudson-slave\workspace\Oltu-OAuth-2.0-windows\trunk\oauth-2.0\jwt\pom.xml
to /home/hudson/hudson/jobs/Oltu-OAuth-2.0-windows/modules/org.apache.oltu.oauth2$org.apache.oltu.oauth2.jwt/builds/2013-06-20_16-12-04/archive/org.apache.oltu.oauth2/org.apache.oltu.oauth2.jwt/0.31/org.apache.oltu.oauth2.jwt-0.31.pom
[JENKINS] Archiving F:\hudson\hudson-slave\workspace\Oltu-OAuth-2.0-windows\trunk\oauth-2.0\common\pom.xml
to /home/hudson/hudson/jobs/Oltu-OAuth-2.0-windows/modules/org.apache.oltu.oauth2$org.apache.oltu.oauth2.common/builds/2013-06-20_16-12-04/archive/org.apache.oltu.oauth2/org.apache.oltu.oauth2.common/0.31/org.apache.oltu.oauth2.common-0.31.pom
[JENKINS] Archiving F:\hudson\hudson-slave\workspace\Oltu-OAuth-2.0-windows\trunk\oauth-2.0\dynamicreg-client\pom.xml
to /home/hudson/hudson/jobs/Oltu-OAuth-2.0-windows/modules/org.apache.oltu.oauth2$org.apache.oltu.oauth2.dynamicreg.client/builds/2013-06-20_16-12-04/archive/org.apache.oltu.oauth2/org.apache.oltu.oauth2.dynamicreg.client/0.31/org.apache.oltu.oauth2.dynamicreg.client-0.31.pom
[JENKINS] Archiving F:\hudson\hudson-slave\workspace\Oltu-OAuth-2.0-windows\trunk\oauth-2.0\dynamicreg-common\pom.xml
to /home/hudson/hudson/jobs/Oltu-OAuth-2.0-windows/modules/org.apache.oltu.oauth2$org.apache.oltu.oauth2.dynamicreg.common/builds/2013-06-20_16-12-04/archive/org.apache.oltu.oauth2/org.apache.oltu.oauth2.dynamicreg.common/0.31/org.apache.oltu.oauth2.dynamicreg.common-0.31.pom
[JENKINS] Archiving <https://builds.apache.org/job/Oltu-OAuth-2.0-windows/ws/trunk\oauth-2.0\pom.xml>
to /home/hudson/hudson/jobs/Oltu-OAuth-2.0-windows/modules/org.apache.oltu.oauth2$org.apache.oltu.oauth2.parent/builds/2013-06-20_16-12-04/archive/org.apache.oltu.oauth2/org.apache.oltu.oauth2.parent/0.31/org.apache.oltu.oauth2.parent-0.31.pom
[JENKINS] Archiving F:\hudson\hudson-slave\workspace\Oltu-OAuth-2.0-windows\trunk\oauth-2.0\resourceserver\pom.xml
to /home/hudson/hudson/jobs/Oltu-OAuth-2.0-windows/modules/org.apache.oltu.oauth2$org.apache.oltu.oauth2.resourceserver/builds/2013-06-20_16-12-04/archive/org.apache.oltu.oauth2/org.apache.oltu.oauth2.resourceserver/0.31/org.apache.oltu.oauth2.resourceserver-0.31.pom
[JENKINS] Archiving F:\hudson\hudson-slave\workspace\Oltu-OAuth-2.0-windows\trunk\oauth-2.0\dynamicreg-server\pom.xml
to /home/hudson/hudson/jobs/Oltu-OAuth-2.0-windows/modules/org.apache.oltu.oauth2$org.apache.oltu.oauth2.dynamicreg.server/builds/2013-06-20_16-12-04/archive/org.apache.oltu.oauth2/org.apache.oltu.oauth2.dynamicreg.server/0.31/org.apache.oltu.oauth2.dynamicreg.server-0.31.pom
[JENKINS] Archiving F:\hudson\hudson-slave\workspace\Oltu-OAuth-2.0-windows\trunk\oauth-2.0\resourceserver-filter\pom.xml
to /home/hudson/hudson/jobs/Oltu-OAuth-2.0-windows/modules/org.apache.oltu.oauth2$org.apache.oltu.oauth2.resourceserver-filter/builds/2013-06-20_16-12-04/archive/org.apache.oltu.oauth2/org.apache.oltu.oauth2.resourceserver-filter/0.31/org.apache.oltu.oauth2.resourceserver-filter-0.31.pom
Waiting for Jenkins to finish collecting data
mavenExecutionResult exceptions not empty
message : Failed to execute goal org.apache.maven.plugins:maven-deploy-plugin:2.7:deploy (default-deploy)
on project org.apache.oltu.oauth2.parent: Failed to deploy artifacts: Could not transfer artifact
org.apache.oltu.oauth2:org.apache.oltu.oauth2.parent:pom:0.31 from/to apache.releases.https
(https://repository.apache.org/service/local/staging/deploy/maven2): Failed to transfer file:
https://repository.apache.org/service/local/staging/deploy/maven2/org/apache/oltu/oauth2/org.apache.oltu.oauth2.parent/0.31/org.apache.oltu.oauth2.parent-0.31.pom.
Return code is: 401
cause : Failed to deploy artifacts: Could not transfer artifact org.apache.oltu.oauth2:org.apache.oltu.oauth2.parent:pom:0.31
from/to apache.releases.https (https://repository.apache.org/service/local/staging/deploy/maven2):
Failed to transfer file: https://repository.apache.org/service/local/staging/deploy/maven2/org/apache/oltu/oauth2/org.apache.oltu.oauth2.parent/0.31/org.apache.oltu.oauth2.parent-0.31.pom.
Return code is: 401
Stack trace : 
org.apache.maven.lifecycle.LifecycleExecutionException: Failed to execute goal org.apache.maven.plugins:maven-deploy-plugin:2.7:deploy
(default-deploy) on project org.apache.oltu.oauth2.parent: Failed to deploy artifacts: Could
not transfer artifact org.apache.oltu.oauth2:org.apache.oltu.oauth2.parent:pom:0.31 from/to
apache.releases.https (https://repository.apache.org/service/local/staging/deploy/maven2):
Failed to transfer file: https://repository.apache.org/service/local/staging/deploy/maven2/org/apache/oltu/oauth2/org.apache.oltu.oauth2.parent/0.31/org.apache.oltu.oauth2.parent-0.31.pom.
Return code is: 401
	at org.apache.maven.lifecycle.internal.MojoExecutor.execute(MojoExecutor.java:217)
	at org.apache.maven.lifecycle.internal.MojoExecutor.execute(MojoExecutor.java:153)
	at org.apache.maven.lifecycle.internal.MojoExecutor.execute(MojoExecutor.java:145)
	at org.apache.maven.lifecycle.internal.LifecycleModuleBuilder.buildProject(LifecycleModuleBuilder.java:84)
	at org.apache.maven.lifecycle.internal.LifecycleModuleBuilder.buildProject(LifecycleModuleBuilder.java:59)
	at org.apache.maven.lifecycle.internal.LifecycleStarter.singleThreadedBuild(LifecycleStarter.java:183)
	at org.apache.maven.lifecycle.internal.LifecycleStarter.execute(LifecycleStarter.java:161)
	at org.apache.maven.DefaultMaven.doExecute(DefaultMaven.java:319)
	at org.apache.maven.DefaultMaven.execute(DefaultMaven.java:156)
	at org.jvnet.hudson.maven3.launcher.Maven3Launcher.main(Maven3Launcher.java:79)
	at sun.reflect.NativeMethodAccessorImpl.invoke0(Native Method)
	at sun.reflect.NativeMethodAccessorImpl.invoke(NativeMethodAccessorImpl.java:39)
	at sun.reflect.DelegatingMethodAccessorImpl.invoke(DelegatingMethodAccessorImpl.java:25)
	at java.lang.reflect.Method.invoke(Method.java:597)
	at org.codehaus.plexus.classworlds.launcher.Launcher.launchStandard(Launcher.java:329)
	at org.codehaus.plexus.classworlds.launcher.Launcher.launch(Launcher.java:239)
	at org.jvnet.hudson.maven3.agent.Maven3Main.launch(Maven3Main.java:158)
	at hudson.maven.Maven3Builder.call(Maven3Builder.java:100)
	at hudson.maven.Maven3Builder.call(Maven3Builder.java:66)
	at hudson.remoting.UserRequest.perform(UserRequest.java:118)
	at hudson.remoting.UserRequest.perform(UserRequest.java:48)
	at hudson.remoting.Request$2.run(Request.java:326)
	at hudson.remoting.InterceptingExecutorService$1.call(InterceptingExecutorService.java:72)
	at java.util.concurrent.FutureTask$Sync.innerRun(FutureTask.java:303)
	at java.util.concurrent.FutureTask.run(FutureTask.java:138)
	at java.util.concurrent.ThreadPoolExecutor$Worker.runTask(ThreadPoolExecutor.java:886)
	at java.util.concurrent.ThreadPoolExecutor$Worker.run(ThreadPoolExecutor.java:908)
	at java.lang.Thread.run(Thread.java:662)
Caused by: org.apache.maven.plugin.MojoExecutionException: Failed to deploy artifacts: Could
not transfer artifact org.apache.oltu.oauth2:org.apache.oltu.oauth2.parent:pom:0.31 from/to
apache.releases.https (https://repository.apache.org/service/local/staging/deploy/maven2):
Failed to transfer file: https://repository.apache.org/service/local/staging/deploy/maven2/org/apache/oltu/oauth2/org.apache.oltu.oauth2.parent/0.31/org.apache.oltu.oauth2.parent-0.31.pom.
Return code is: 401
	at org.apache.maven.plugin.deploy.DeployMojo.execute(DeployMojo.java:193)
	at org.apache.maven.plugin.DefaultBuildPluginManager.executeMojo(DefaultBuildPluginManager.java:107)
	at org.apache.maven.lifecycle.internal.MojoExecutor.execute(MojoExecutor.java:209)
	... 27 more
Caused by: org.apache.maven.artifact.deployer.ArtifactDeploymentException: Failed to deploy
artifacts: Could not transfer artifact org.apache.oltu.oauth2:org.apache.oltu.oauth2.parent:pom:0.31
from/to apache.releases.https (https://repository.apache.org/service/local/staging/deploy/maven2):
Failed to transfer file: https://repository.apache.org/service/local/staging/deploy/maven2/org/apache/oltu/oauth2/org.apache.oltu.oauth2.parent/0.31/org.apache.oltu.oauth2.parent-0.31.pom.
Return code is: 401
	at org.apache.maven.artifact.deployer.DefaultArtifactDeployer.deploy(DefaultArtifactDeployer.java:140)
	at org.apache.maven.plugin.deploy.AbstractDeployMojo.deploy(AbstractDeployMojo.java:167)
	at org.apache.maven.plugin.deploy.DeployMojo.execute(DeployMojo.java:149)
	... 29 more
Caused by: org.sonatype.aether.deployment.DeploymentException: Failed to deploy artifacts:
Could not transfer artifact org.apache.oltu.oauth2:org.apache.oltu.oauth2.parent:pom:0.31
from/to apache.releases.https (https://repository.apache.org/service/local/staging/deploy/maven2):
Failed to transfer file: https://repository.apache.org/service/local/staging/deploy/maven2/org/apache/oltu/oauth2/org.apache.oltu.oauth2.parent/0.31/org.apache.oltu.oauth2.parent-0.31.pom.
Return code is: 401
	at org.sonatype.aether.impl.internal.DefaultDeployer.deploy(DefaultDeployer.java:259)
	at org.sonatype.aether.impl.internal.DefaultRepositorySystem.deploy(DefaultRepositorySystem.java:380)
	at org.apache.maven.artifact.deployer.DefaultArtifactDeployer.deploy(DefaultArtifactDeployer.java:136)
	... 31 more
Caused by: org.sonatype.aether.transfer.ArtifactTransferException: Could not transfer artifact
org.apache.oltu.oauth2:org.apache.oltu.oauth2.parent:pom:0.31 from/to apache.releases.https
(https://repository.apache.org/service/local/staging/deploy/maven2): Failed to transfer file:
https://repository.apache.org/service/local/staging/deploy/maven2/org/apache/oltu/oauth2/org.apache.oltu.oauth2.parent/0.31/org.apache.oltu.oauth2.parent-0.31.pom.
Return code is: 401
	at org.sonatype.aether.connector.wagon.WagonRepositoryConnector$4.wrap(WagonRepositoryConnector.java:949)
	at org.sonatype.aether.connector.wagon.WagonRepositoryConnector$4.wrap(WagonRepositoryConnector.java:940)
	at org.sonatype.aether.connector.wagon.WagonRepositoryConnector$PutTask.flush(WagonRepositoryConnector.java:864)
	at org.sonatype.aether.connector.wagon.WagonRepositoryConnector.put(WagonRepositoryConnector.java:465)
	at org.sonatype.aether.impl.internal.DefaultDeployer.deploy(DefaultDeployer.java:253)
	... 33 more
Caused by: org.apache.maven.wagon.TransferFailedException: Failed to transfer file: https://repository.apache.org/service/local/staging/deploy/maven2/org/apache/oltu/oauth2/org.apache.oltu.oauth2.parent/0.31/org.apache.oltu.oauth2.parent-0.31.pom.
Return code is: 401
	at org.apache.maven.wagon.providers.http.LightweightHttpWagon.finishPutTransfer(LightweightHttpWagon.java:205)
	at org.apache.maven.wagon.AbstractWagon.putTransfer(AbstractWagon.java:413)
	at org.apache.maven.wagon.AbstractWagon.transfer(AbstractWagon.java:392)
	at org.apache.maven.wagon.AbstractWagon.putTransfer(AbstractWagon.java:365)
	at org.apache.maven.wagon.StreamWagon.put(StreamWagon.java:163)
	at org.sonatype.aether.connector.wagon.WagonRepositoryConnector$PutTask.run(WagonRepositoryConnector.java:825)
	at org.sonatype.aether.connector.wagon.WagonRepositoryConnector.put(WagonRepositoryConnector.java:464)
	... 34 more
Sending e-mails to: dev@oltu.apache.org
channel stopped

Mime
View raw message