oltu-dev mailing list archives

Site index · List index
Message view « Date » · « Thread »
Top « Date » · « Thread »
From Apache Jenkins Server <jenk...@builds.apache.org>
Subject Build failed in Jenkins: Oltu-OAuth-2.0 #104
Date Thu, 09 May 2013 08:02:01 GMT
See <https://builds.apache.org/job/Oltu-OAuth-2.0/104/changes>

Changes:

[simonetripodi] [maven-release-plugin] prepare for next development iteration

[simonetripodi] [maven-release-plugin] prepare release org.apache.oltu.parent-1

[simonetripodi] releng: updated plugins to latest stable released version

[simonetripodi] releng: added missing AL header

[simonetripodi] adjusted ML archives according to Oltu (TLP) and Amber (Incubating)

------------------------------------------
Started by an SCM change
Building remotely on solaris1 in workspace <https://builds.apache.org/job/Oltu-OAuth-2.0/ws/>
Updating https://svn.apache.org/repos/asf/oltu/trunk
U         parent/pom.xml
U         oauth-2.0/authzserver/src/test/java/org/apache/oltu/oauth2/as/OAuthUnauthenticatedRequestTest.java
U         oauth-2.0/authzserver/src/test/java/org/apache/oltu/oauth2/as/OauthMockRequestBuilder.java
U         oauth-2.0/authzserver/src/main/java/org/apache/oltu/oauth2/as/validator/UnauthenticatedAuthorizationCodeValidator.java
U         oauth-2.0/authzserver/src/main/java/org/apache/oltu/oauth2/as/validator/UnauthenticatedRefreshTokenValidator.java
U         oauth-2.0/authzserver/src/main/java/org/apache/oltu/oauth2/as/request/OAuthUnauthenticatedTokenRequest.java
U         oauth-2.0/authzserver/src/main/java/org/apache/oltu/oauth2/as/request/AbstractOAuthTokenRequest.java
At revision 1480551
Parsing POMs
ERROR: Failed to parse POMs
hudson.util.IOException2: remote file operation failed: <https://builds.apache.org/job/Oltu-OAuth-2.0/ws/trunk>
at hudson.remoting.Channel@1a4c409b:solaris1
	at hudson.FilePath.act(FilePath.java:861)
	at hudson.FilePath.act(FilePath.java:838)
	at hudson.maven.MavenModuleSetBuild$MavenModuleSetBuildExecution.parsePoms(MavenModuleSetBuild.java:862)
	at hudson.maven.MavenModuleSetBuild$MavenModuleSetBuildExecution.doRun(MavenModuleSetBuild.java:620)
	at hudson.model.AbstractBuild$AbstractBuildExecution.run(AbstractBuild.java:592)
	at hudson.model.Run.execute(Run.java:1568)
	at hudson.maven.MavenModuleSetBuild.run(MavenModuleSetBuild.java:477)
	at hudson.model.ResourceController.execute(ResourceController.java:88)
	at hudson.model.Executor.run(Executor.java:236)
Caused by: hudson.remoting.ProxyException: hudson.maven.MavenModuleSetBuild$MavenExecutionException:
org.apache.maven.project.ProjectBuildingException: Some problems were encountered while processing
the POMs:
[FATAL] Non-resolvable parent POM: Could not find artifact org.apache.oltu:org.apache.oltu.parent:pom:1-SNAPSHOT
and 'parent.relativePath' points at wrong local POM @ line 21, column 11

	at hudson.maven.MavenModuleSetBuild$PomParser.invoke(MavenModuleSetBuild.java:1229)
	at hudson.maven.MavenModuleSetBuild$PomParser.invoke(MavenModuleSetBuild.java:997)
	at hudson.FilePath$FileCallableWrapper.call(FilePath.java:2348)
	at hudson.remoting.UserRequest.perform(UserRequest.java:118)
	at hudson.remoting.UserRequest.perform(UserRequest.java:48)
	at hudson.remoting.Request$2.run(Request.java:326)
	at hudson.remoting.InterceptingExecutorService$1.call(InterceptingExecutorService.java:72)
	at java.util.concurrent.FutureTask$Sync.innerRun(FutureTask.java:303)
	at java.util.concurrent.FutureTask.run(FutureTask.java:138)
	at java.util.concurrent.ThreadPoolExecutor$Worker.runTask(ThreadPoolExecutor.java:886)
	at java.util.concurrent.ThreadPoolExecutor$Worker.run(ThreadPoolExecutor.java:908)
	at java.lang.Thread.run(Thread.java:662)
Caused by: hudson.remoting.ProxyException: org.apache.maven.project.ProjectBuildingException:
Some problems were encountered while processing the POMs:
[FATAL] Non-resolvable parent POM: Could not find artifact org.apache.oltu:org.apache.oltu.parent:pom:1-SNAPSHOT
and 'parent.relativePath' points at wrong local POM @ line 21, column 11

	at org.apache.maven.project.DefaultProjectBuilder.build(DefaultProjectBuilder.java:363)
	at hudson.maven.MavenEmbedder.buildProjects(MavenEmbedder.java:361)
	at hudson.maven.MavenEmbedder.readProjects(MavenEmbedder.java:331)
	at hudson.maven.MavenModuleSetBuild$PomParser.invoke(MavenModuleSetBuild.java:1179)
	... 11 more

Mime
View raw message