oltu-dev mailing list archives

Site index · List index
Message view « Date » · « Thread »
Top « Date » · « Thread »
From Apache Jenkins Server <jenk...@builds.apache.org>
Subject Build failed in Jenkins: Oltu #87
Date Fri, 10 May 2013 03:22:50 GMT
See <https://builds.apache.org/job/Oltu/87/changes>

Changes:

[asanso] OLTU-37 - Implement OpenID Connect

* added ID Token Validation
* added validation to client demo

[simonetripodi] added missing JWT raw string

[asanso] add svn:ignore

[asanso] OLTU-78 - Implement Plaintext JWT :
*  adapt the client demo to the latest changes

[asanso] OLTU-78 - Implement Plaintext JWT :
*  adapt the client demo to the latest changes

[asanso] OLTU-78 - Implement Plaintext JWT :
*  adapt the client demo to the latest changes

[asanso] OLTU-78 - Implement Plaintext JWT :
*  adapt the client demo to the latest changes

[asanso] OLTU-78 - Implement Plaintext JWT :
*  adapt the client demo to the latest changes

[simonetripodi] releng: no needs to redefine the jettison exclusion section, since it is defined
in the dependencies management

[simonetripodi] OLTU-78 - Implement Plaintext JWT

initial checkin of plaintext JWT support

[simonetripodi] releng: no needs to redefine the jettison exclusion section, since it is defined
in the dependencies management

[simonetripodi] releng: better dependencies management via <dependenciesmanagement/>
section

[simonetripodi] releng: commons-codec updated to latest stable released version

[simonetripodi] updated ignore list

[simonetripodi] trivial: trailing spaces and empty lines

[simonetripodi] code format: no tabs, dropped trailing spaces, dropped empty lines, dropped
empty elements

[simonetripodi] extracted constants

[simonetripodi] JWT class constructor made private - utility classes shall not be instantiated

[simonetripodi] code format: no tabs, dropped trailing spaces, dropped empty lines

[simonetripodi] releng: updated httpclient dependency to latest stable release version

[simonetripodi] [maven-release-plugin] prepare for next development iteration

[simonetripodi] [maven-release-plugin] prepare release org.apache.oltu.parent-1

[simonetripodi] releng: updated plugins to latest stable released version

[simonetripodi] releng: added missing AL header

[simonetripodi] adjusted ML archives according to Oltu (TLP) and Amber (Incubating)

------------------------------------------
Started by an SCM change
Building remotely on ubuntu3 in workspace <https://builds.apache.org/job/Oltu/ws/>
Updating https://svn.apache.org/repos/asf/oltu/trunk
D         openid-connect/common/src/main/java/org/apache/oltu/openidconnect/common/OpenIdConnect.java
A         openid-connect/client/src/main/java/org/apache/oltu/openidconnect/OpenIdConnect.java
U         openid-connect/client/src/main/java/org/apache/oltu/openidconnect/client/response/OpenIdConnectResponse.java
U         openid-connect/client/pom.xml
 U        openid-connect/client
U         demos/client-demo/src/main/java/org/apache/oltu/oauth2/client/demo/model/OAuthParams.java
U         demos/client-demo/src/main/java/org/apache/oltu/oauth2/client/demo/controller/TokenController.java
U         demos/client-demo/src/main/java/org/apache/oltu/oauth2/client/demo/controller/MainController.java
U         demos/client-demo/src/main/webapp/WEB-INF/views/get_resource.jsp
 U        demos
U         parent/pom.xml
A         oauth-2.0/authzserver/src/test/java/org/apache/oltu/oauth2/as/OAuthUnauthenticatedRequestTest.java
U         oauth-2.0/authzserver/src/test/java/org/apache/oltu/oauth2/as/OAuthRequestTest.java
A         oauth-2.0/authzserver/src/test/java/org/apache/oltu/oauth2/as/OauthMockRequestBuilder.java
U         oauth-2.0/authzserver/src/main/java/org/apache/oltu/oauth2/as/validator/ClientCredentialValidator.java
U         oauth-2.0/authzserver/src/main/java/org/apache/oltu/oauth2/as/validator/AuthorizationCodeValidator.java
U         oauth-2.0/authzserver/src/main/java/org/apache/oltu/oauth2/as/validator/RefreshTokenValidator.java
U         oauth-2.0/authzserver/src/main/java/org/apache/oltu/oauth2/as/validator/TokenValidator.java
A         oauth-2.0/authzserver/src/main/java/org/apache/oltu/oauth2/as/validator/UnauthenticatedAuthorizationCodeValidator.java
U         oauth-2.0/authzserver/src/main/java/org/apache/oltu/oauth2/as/validator/PasswordValidator.java
A         oauth-2.0/authzserver/src/main/java/org/apache/oltu/oauth2/as/validator/UnauthenticatedRefreshTokenValidator.java
A         oauth-2.0/authzserver/src/main/java/org/apache/oltu/oauth2/as/validator/UnauthenticatedPasswordValidator.java
A         oauth-2.0/authzserver/src/main/java/org/apache/oltu/oauth2/as/request/OAuthUnauthenticatedTokenRequest.java
U         oauth-2.0/authzserver/src/main/java/org/apache/oltu/oauth2/as/request/OAuthAuthzRequest.java
U         oauth-2.0/authzserver/src/main/java/org/apache/oltu/oauth2/as/request/OAuthRequest.java
U         oauth-2.0/authzserver/src/main/java/org/apache/oltu/oauth2/as/request/OAuthTokenRequest.java
A         oauth-2.0/authzserver/src/main/java/org/apache/oltu/oauth2/as/request/AbstractOAuthTokenRequest.java
U         oauth-2.0/authzserver/pom.xml
U         oauth-2.0/httpclient4/pom.xml
D         oauth-2.0/jwt/src/main/java/org/apache/oltu/oauth2/jwt/JWTUtil.java
AU        oauth-2.0/jwt/src/main/java/org/apache/oltu/oauth2/jwt/ClaimsSet.java
A         oauth-2.0/jwt/src/main/java/org/apache/oltu/oauth2/jwt/JWT.java
A         oauth-2.0/jwt/src/main/java/org/apache/oltu/oauth2/jwt/JWTUtils.java
AU        oauth-2.0/jwt/src/main/java/org/apache/oltu/oauth2/jwt/Header.java
U         oauth-2.0/jwt/pom.xml
 U        oauth-2.0/jwt
U         oauth-2.0/dynamicreg-server/pom.xml
U         oauth-2.0/common/src/test/java/org/apache/oltu/oauth2/common/utils/OAuthUtilsTest.java
U         oauth-2.0/common/src/main/java/org/apache/oltu/oauth2/common/utils/OAuthUtils.java
U         oauth-2.0/common/src/main/java/org/apache/oltu/oauth2/common/validators/OAuthValidator.java
U         oauth-2.0/common/src/main/java/org/apache/oltu/oauth2/common/validators/AbstractValidator.java
U         oauth-2.0/common/pom.xml
U         oauth-2.0/pom.xml
U         oauth-2.0/client/pom.xml
At revision 1480867
Parsing POMs
Downloaded artifact http://repo.maven.apache.org/maven2//org/apache/apache/10/apache-10.pom
ERROR: Failed to parse POMs
hudson.util.IOException2: remote file operation failed: <https://builds.apache.org/job/Oltu/ws/trunk>
at hudson.remoting.Channel@6de6c320:ubuntu3
	at hudson.FilePath.act(FilePath.java:861)
	at hudson.FilePath.act(FilePath.java:838)
	at hudson.maven.MavenModuleSetBuild$MavenModuleSetBuildExecution.parsePoms(MavenModuleSetBuild.java:862)
	at hudson.maven.MavenModuleSetBuild$MavenModuleSetBuildExecution.doRun(MavenModuleSetBuild.java:620)
	at hudson.model.AbstractBuild$AbstractBuildExecution.run(AbstractBuild.java:592)
	at hudson.model.Run.execute(Run.java:1568)
	at hudson.maven.MavenModuleSetBuild.run(MavenModuleSetBuild.java:477)
	at hudson.model.ResourceController.execute(ResourceController.java:88)
	at hudson.model.Executor.run(Executor.java:236)
Caused by: hudson.remoting.ProxyException: hudson.maven.MavenModuleSetBuild$MavenExecutionException:
org.apache.maven.project.ProjectBuildingException: Some problems were encountered while processing
the POMs:
[FATAL] Non-resolvable parent POM: Could not find artifact org.apache.oltu:org.apache.oltu.parent:pom:1-SNAPSHOT
and 'parent.relativePath' points at wrong local POM @ line 21, column 11
[FATAL] Non-resolvable parent POM: Could not find artifact org.apache.oltu:org.apache.oltu.parent:pom:1-SNAPSHOT
and 'parent.relativePath' points at wrong local POM @ line 21, column 11
[FATAL] Non-resolvable parent POM: Could not find artifact org.apache.oltu:org.apache.oltu.parent:pom:1-SNAPSHOT
and 'parent.relativePath' points at wrong local POM @ line 21, column 11

	at hudson.maven.MavenModuleSetBuild$PomParser.invoke(MavenModuleSetBuild.java:1229)
	at hudson.maven.MavenModuleSetBuild$PomParser.invoke(MavenModuleSetBuild.java:997)
	at hudson.FilePath$FileCallableWrapper.call(FilePath.java:2348)
	at hudson.remoting.UserRequest.perform(UserRequest.java:118)
	at hudson.remoting.UserRequest.perform(UserRequest.java:48)
	at hudson.remoting.Request$2.run(Request.java:326)
	at hudson.remoting.InterceptingExecutorService$1.call(InterceptingExecutorService.java:72)
	at java.util.concurrent.FutureTask$Sync.innerRun(FutureTask.java:334)
	at java.util.concurrent.FutureTask.run(FutureTask.java:166)
	at java.util.concurrent.ThreadPoolExecutor.runWorker(ThreadPoolExecutor.java:1146)
	at java.util.concurrent.ThreadPoolExecutor$Worker.run(ThreadPoolExecutor.java:615)
	at java.lang.Thread.run(Thread.java:679)
Caused by: hudson.remoting.ProxyException: org.apache.maven.project.ProjectBuildingException:
Some problems were encountered while processing the POMs:
[FATAL] Non-resolvable parent POM: Could not find artifact org.apache.oltu:org.apache.oltu.parent:pom:1-SNAPSHOT
and 'parent.relativePath' points at wrong local POM @ line 21, column 11
[FATAL] Non-resolvable parent POM: Could not find artifact org.apache.oltu:org.apache.oltu.parent:pom:1-SNAPSHOT
and 'parent.relativePath' points at wrong local POM @ line 21, column 11
[FATAL] Non-resolvable parent POM: Could not find artifact org.apache.oltu:org.apache.oltu.parent:pom:1-SNAPSHOT
and 'parent.relativePath' points at wrong local POM @ line 21, column 11

	at org.apache.maven.project.DefaultProjectBuilder.build(DefaultProjectBuilder.java:363)
	at hudson.maven.MavenEmbedder.buildProjects(MavenEmbedder.java:361)
	at hudson.maven.MavenEmbedder.readProjects(MavenEmbedder.java:331)
	at hudson.maven.MavenModuleSetBuild$PomParser.invoke(MavenModuleSetBuild.java:1179)
	... 11 more

Mime
View raw message