oltu-dev mailing list archives

Site index · List index
Message view « Date » · « Thread »
Top « Date » · « Thread »
From Apache Jenkins Server <jenk...@builds.apache.org>
Subject Build failed in Jenkins: Oltu-OAuth-2.0-windows #76
Date Mon, 25 Mar 2013 16:10:47 GMT
See <https://builds.apache.org/job/Oltu-OAuth-2.0-windows/76/changes>

Changes:

[simonetripodi] [OLTU-89] move artifactId to OSGi-alike taxonomy

[simonetripodi] [OLTU-89] move artifactId to OSGi-alike taxonomy

[simonetripodi] trivial: updated ignore list

[simonetripodi] [OLTU-88] Extract the parent pom from the reactor one

------------------------------------------
Started by an SCM change
Building remotely on windows1 in workspace <https://builds.apache.org/job/Oltu-OAuth-2.0-windows/ws/>
Updating https://svn.apache.org/repos/asf/oltu/trunk
A         parent
A         parent\src
A         parent\src\site
AU        parent\src\site\site.xml
AU        parent\pom.xml
U         pom.xml
U         oauth-2.0\client-demo\pom.xml
U         oauth-2.0\resourceserver-filter\pom.xml
U         oauth-2.0\authzserver\pom.xml
U         oauth-2.0\httpclient4\pom.xml
U         oauth-2.0\integration-tests\pom.xml
U         oauth-2.0\dynamicreg-server\pom.xml
U         oauth-2.0\common\pom.xml
U         oauth-2.0\dynamicreg-common\pom.xml
U         oauth-2.0\pom.xml
U         oauth-2.0\test-utils\pom.xml
U         oauth-2.0\client\pom.xml
U         oauth-2.0\dynamicreg-client\pom.xml
U         oauth-2.0\resourceserver\pom.xml
At revision 1460742
Parsing POMs
ERROR: Failed to parse POMs
hudson.util.IOException2: remote file operation failed: <https://builds.apache.org/job/Oltu-OAuth-2.0-windows/ws/trunk>
at hudson.remoting.Channel@6c8ebcba:windows1
	at hudson.FilePath.act(FilePath.java:861)
	at hudson.FilePath.act(FilePath.java:838)
	at hudson.maven.MavenModuleSetBuild$MavenModuleSetBuildExecution.parsePoms(MavenModuleSetBuild.java:862)
	at hudson.maven.MavenModuleSetBuild$MavenModuleSetBuildExecution.doRun(MavenModuleSetBuild.java:620)
	at hudson.model.AbstractBuild$AbstractBuildExecution.run(AbstractBuild.java:592)
	at hudson.model.Run.execute(Run.java:1568)
	at hudson.maven.MavenModuleSetBuild.run(MavenModuleSetBuild.java:477)
	at hudson.model.ResourceController.execute(ResourceController.java:88)
	at hudson.model.Executor.run(Executor.java:236)
Caused by: hudson.remoting.ProxyException: hudson.maven.MavenModuleSetBuild$MavenExecutionException:
org.apache.maven.project.ProjectBuildingException: Some problems were encountered while processing
the POMs:
[WARNING] 'parent.relativePath' points at org.apache.oltu:org.apache.oltu.reactor instead
of org.apache.oltu:org.apache.oltu.parent, please verify your project structure @ line 21,
column 11
[FATAL] Non-resolvable parent POM: Could not find artifact org.apache.oltu:org.apache.oltu.parent:pom:1-SNAPSHOT
and 'parent.relativePath' points at wrong local POM @ line 21, column 11

	at hudson.maven.MavenModuleSetBuild$PomParser.invoke(MavenModuleSetBuild.java:1229)
	at hudson.maven.MavenModuleSetBuild$PomParser.invoke(MavenModuleSetBuild.java:997)
	at hudson.FilePath$FileCallableWrapper.call(FilePath.java:2348)
	at hudson.remoting.UserRequest.perform(UserRequest.java:118)
	at hudson.remoting.UserRequest.perform(UserRequest.java:48)
	at hudson.remoting.Request$2.run(Request.java:326)
	at hudson.remoting.InterceptingExecutorService$1.call(InterceptingExecutorService.java:72)
	at java.util.concurrent.FutureTask$Sync.innerRun(Unknown Source)
	at java.util.concurrent.FutureTask.run(Unknown Source)
	at java.util.concurrent.ThreadPoolExecutor.runWorker(Unknown Source)
	at java.util.concurrent.ThreadPoolExecutor$Worker.run(Unknown Source)
	at hudson.remoting.Engine$1$1.run(Engine.java:58)
	at java.lang.Thread.run(Unknown Source)
Caused by: hudson.remoting.ProxyException: org.apache.maven.project.ProjectBuildingException:
Some problems were encountered while processing the POMs:
[WARNING] 'parent.relativePath' points at org.apache.oltu:org.apache.oltu.reactor instead
of org.apache.oltu:org.apache.oltu.parent, please verify your project structure @ line 21,
column 11
[FATAL] Non-resolvable parent POM: Could not find artifact org.apache.oltu:org.apache.oltu.parent:pom:1-SNAPSHOT
and 'parent.relativePath' points at wrong local POM @ line 21, column 11

	at org.apache.maven.project.DefaultProjectBuilder.build(DefaultProjectBuilder.java:363)
	at hudson.maven.MavenEmbedder.buildProjects(MavenEmbedder.java:361)
	at hudson.maven.MavenEmbedder.readProjects(MavenEmbedder.java:331)
	at hudson.maven.MavenModuleSetBuild$PomParser.invoke(MavenModuleSetBuild.java:1179)
	... 12 more

Mime
View raw message