olingo-commits mailing list archives

Site index · List index
Message view « Date » · « Thread »
Top « Date » · « Thread »
From Apache Jenkins Server <jenk...@builds.apache.org>
Subject Build failed in Jenkins: olingo-odata4-all-profiles #291
Date Thu, 09 May 2019 00:24:03 GMT
See <https://builds.apache.org/job/olingo-odata4-all-profiles/291/display/redirect?page=changes>

Changes:

[ramya.vasanth] [OLINGO-1356]  not supporting alpha numeric characters

------------------------------------------
[...truncated 768.50 KB...]
[INFO] No tests to run.
[INFO] 
[INFO] --- maven-checkstyle-plugin:2.12.1:check (checkstyle) @ odata-samples ---
[INFO] Starting audit...
Audit done.

[INFO] 
[INFO] --- maven-install-plugin:2.5.2:install (default-install) @ odata-samples ---
[INFO] Installing <https://builds.apache.org/job/olingo-odata4-all-profiles/ws/samples/pom.xml>
to /home/jenkins/.m2/repository/org/apache/olingo/odata-samples/4.7.0-SNAPSHOT/odata-samples-4.7.0-SNAPSHOT.pom
[INFO] 
[INFO] --- apache-rat-plugin:0.11:check (rat-check) @ odata-samples ---
[INFO] 55 implicit excludes (use -debug for more details).
[INFO] Exclude: **/target/**
[INFO] Exclude: **/META-INF/**
[INFO] Exclude: **/*.txt
[INFO] Exclude: **/*.ini
[INFO] Exclude: **/*.bin
[INFO] Exclude: **/MANIFEST.MF
[INFO] Exclude: .gitignore
[INFO] Exclude: .git/**
[INFO] Exclude: bin/**
[INFO] Exclude: **/*.local
[INFO] Exclude: **/*.project
[INFO] Exclude: **/*.classpath
[INFO] Exclude: **/*.json
[INFO] Exclude: **/*.batch
[INFO] Exclude: **/NOTICE
[INFO] Exclude: **/DEPENDENCIES
[INFO] Exclude: **/nb-configuration.xml
[INFO] Exclude: **/.externalToolBuilders/**
[INFO] Exclude: **/maven-eclipse.xml
[INFO] Exclude: **/*.iml
[INFO] Exclude: **/ref/**
[INFO] Exclude: **/server-ref/**
[INFO] Exclude: **/dependency-reduced-pom.xml
[INFO] Exclude: **/.settings/**
[INFO] 1 resources included (use -debug for more details)
[INFO] Rat check: Summary of files. Unapproved: 0 unknown: 0 generated: 0 approved: 1 licence.
[INFO] 
[INFO] -------------< org.apache.olingo:odata-server-osgi-sample >-------------
[INFO] Building odata-server-osgi-sample 4.7.0-SNAPSHOT                 [19/46]
[INFO] -------------------------------[ bundle ]-------------------------------
[INFO] 
[INFO] --- maven-clean-plugin:2.5:clean (default-clean) @ odata-server-osgi-sample ---
[INFO] Deleting <https://builds.apache.org/job/olingo-odata4-all-profiles/ws/samples/osgi/server/target>
[INFO] 
[INFO] --- build-helper-maven-plugin:1.9:add-source (add-source) @ odata-server-osgi-sample
---
[INFO] Source directory: <https://builds.apache.org/job/olingo-odata4-all-profiles/ws/samples/osgi/server/../../server/src/main>
added.
[INFO] 
[INFO] --- maven-remote-resources-plugin:1.5:process (default) @ odata-server-osgi-sample
---
[INFO] 
[INFO] --- maven-resources-plugin:2.6:resources (default-resources) @ odata-server-osgi-sample
---
[INFO] Using 'UTF-8' encoding to copy filtered resources.
[INFO] skip non existing resourceDirectory <https://builds.apache.org/job/olingo-odata4-all-profiles/ws/samples/osgi/server/src/main/resources>
[INFO] Copying 3 resources
[INFO] 
[INFO] --- maven-compiler-plugin:2.3.2:compile (default-compile) @ odata-server-osgi-sample
---
[INFO] Compiling 4 source files to <https://builds.apache.org/job/olingo-odata4-all-profiles/ws/samples/osgi/server/target/classes>
[INFO] 
[INFO] --- maven-resources-plugin:2.6:testResources (default-testResources) @ odata-server-osgi-sample
---
[INFO] Using 'UTF-8' encoding to copy filtered resources.
[INFO] skip non existing resourceDirectory <https://builds.apache.org/job/olingo-odata4-all-profiles/ws/samples/osgi/server/src/test/resources>
[INFO] Copying 3 resources
[INFO] 
[INFO] --- maven-compiler-plugin:2.3.2:testCompile (default-testCompile) @ odata-server-osgi-sample
---
[INFO] No sources to compile
[INFO] 
[INFO] --- maven-surefire-plugin:2.17:test (default-test) @ odata-server-osgi-sample ---
[INFO] 
[INFO] --- maven-bundle-plugin:4.1.0:bundle (default-bundle) @ odata-server-osgi-sample ---
[WARNING] Bundle org.apache.olingo:odata-server-osgi-sample:bundle:4.7.0-SNAPSHOT : Unused
Import-Package instructions: [org.apache.olingo.netty.server.api*] 
[INFO] 
[INFO] --- maven-site-plugin:3.4:attach-descriptor (attach-descriptor) @ odata-server-osgi-sample
---
[INFO] 
[INFO] --- maven-failsafe-plugin:2.17:integration-test (integration-test) @ odata-server-osgi-sample
---
[INFO] 
[INFO] --- maven-source-plugin:2.2.1:jar-no-fork (attach-sources) @ odata-server-osgi-sample
---
[INFO] Building jar: <https://builds.apache.org/job/olingo-odata4-all-profiles/ws/samples/osgi/server/target/odata-server-osgi-sample-4.7.0-SNAPSHOT-sources.jar>
[INFO] 
[INFO] --- maven-failsafe-plugin:2.17:verify (integration-test) @ odata-server-osgi-sample
---
[INFO] Failsafe report directory: <https://builds.apache.org/job/olingo-odata4-all-profiles/ws/samples/osgi/server/target/failsafe-reports>
[INFO] 
[INFO] --- maven-checkstyle-plugin:2.12.1:check (checkstyle) @ odata-server-osgi-sample ---
[INFO] Starting audit...
Audit done.

[INFO] 
[INFO] --- maven-install-plugin:2.5.2:install (default-install) @ odata-server-osgi-sample
---
[INFO] Installing <https://builds.apache.org/job/olingo-odata4-all-profiles/ws/samples/osgi/server/target/odata-server-osgi-sample-4.7.0-SNAPSHOT.jar>
to /home/jenkins/.m2/repository/org/apache/olingo/odata-server-osgi-sample/4.7.0-SNAPSHOT/odata-server-osgi-sample-4.7.0-SNAPSHOT.jar
[INFO] Installing <https://builds.apache.org/job/olingo-odata4-all-profiles/ws/samples/osgi/server/pom.xml>
to /home/jenkins/.m2/repository/org/apache/olingo/odata-server-osgi-sample/4.7.0-SNAPSHOT/odata-server-osgi-sample-4.7.0-SNAPSHOT.pom
[INFO] Installing <https://builds.apache.org/job/olingo-odata4-all-profiles/ws/samples/osgi/server/target/odata-server-osgi-sample-4.7.0-SNAPSHOT-sources.jar>
to /home/jenkins/.m2/repository/org/apache/olingo/odata-server-osgi-sample/4.7.0-SNAPSHOT/odata-server-osgi-sample-4.7.0-SNAPSHOT-sources.jar
[INFO] 
[INFO] --- maven-bundle-plugin:4.1.0:install (default-install) @ odata-server-osgi-sample
---
[INFO] Installing org/apache/olingo/odata-server-osgi-sample/4.7.0-SNAPSHOT/odata-server-osgi-sample-4.7.0-SNAPSHOT.jar
[INFO] Writing OBR metadata
[INFO] 
[INFO] --- apache-rat-plugin:0.11:check (rat-check) @ odata-server-osgi-sample ---
[INFO] 51 implicit excludes (use -debug for more details).
[INFO] Exclude: **/target/**
[INFO] Exclude: **/META-INF/**
[INFO] Exclude: **/*.txt
[INFO] Exclude: **/*.ini
[INFO] Exclude: **/*.bin
[INFO] Exclude: **/MANIFEST.MF
[INFO] Exclude: .gitignore
[INFO] Exclude: .git/**
[INFO] Exclude: bin/**
[INFO] Exclude: **/*.local
[INFO] Exclude: **/*.project
[INFO] Exclude: **/*.classpath
[INFO] Exclude: **/*.json
[INFO] Exclude: **/*.batch
[INFO] Exclude: **/NOTICE
[INFO] Exclude: **/DEPENDENCIES
[INFO] Exclude: **/nb-configuration.xml
[INFO] Exclude: **/.externalToolBuilders/**
[INFO] Exclude: **/maven-eclipse.xml
[INFO] Exclude: **/*.iml
[INFO] Exclude: **/ref/**
[INFO] Exclude: **/server-ref/**
[INFO] Exclude: **/dependency-reduced-pom.xml
[INFO] Exclude: **/.settings/**
[INFO] 1 resources included (use -debug for more details)
[INFO] Rat check: Summary of files. Unapproved: 0 unknown: 0 generated: 0 approved: 1 licence.
[INFO] 
[INFO] -----------------< org.apache.olingo:odata-karaf-fit >------------------
[INFO] Building odata-karaf-fit 4.7.0-SNAPSHOT                          [20/46]
[INFO] --------------------------------[ jar ]---------------------------------
[INFO] 
[INFO] --- maven-clean-plugin:2.5:clean (default-clean) @ odata-karaf-fit ---
[INFO] Deleting <https://builds.apache.org/job/olingo-odata4-all-profiles/ws/ext/karaf/karaf-fit/target>
[INFO] 
[INFO] --- maven-remote-resources-plugin:1.5:process (default) @ odata-karaf-fit ---
[INFO] 
[INFO] --- depends-maven-plugin:1.2:generate-depends-file (generate-depends-file) @ odata-karaf-fit
---
[INFO] Created: <https://builds.apache.org/job/olingo-odata4-all-profiles/ws/ext/karaf/karaf-fit/target/classes/META-INF/maven/dependencies.properties>
[INFO] 
[INFO] --- maven-resources-plugin:2.6:resources (default-resources) @ odata-karaf-fit ---
[INFO] Using 'UTF-8' encoding to copy filtered resources.
[INFO] skip non existing resourceDirectory <https://builds.apache.org/job/olingo-odata4-all-profiles/ws/ext/karaf/karaf-fit/src/main/resources>
[INFO] Copying 3 resources
[INFO] 
[INFO] --- maven-compiler-plugin:2.3.2:compile (default-compile) @ odata-karaf-fit ---
[INFO] No sources to compile
[INFO] 
[INFO] --- maven-resources-plugin:2.6:testResources (default-testResources) @ odata-karaf-fit
---
[INFO] Using 'UTF-8' encoding to copy filtered resources.
[INFO] skip non existing resourceDirectory <https://builds.apache.org/job/olingo-odata4-all-profiles/ws/ext/karaf/karaf-fit/src/test/resources>
[INFO] Copying 3 resources
[INFO] 
[INFO] --- maven-compiler-plugin:2.3.2:testCompile (default-testCompile) @ odata-karaf-fit
---
[INFO] Compiling 3 source files to <https://builds.apache.org/job/olingo-odata4-all-profiles/ws/ext/karaf/karaf-fit/target/test-classes>
[INFO] 
[INFO] --- maven-surefire-plugin:2.17:test (default-test) @ odata-karaf-fit ---
[INFO] Surefire report directory: <https://builds.apache.org/job/olingo-odata4-all-profiles/ws/ext/karaf/karaf-fit/target/surefire-reports>

-------------------------------------------------------
 T E S T S
-------------------------------------------------------
Running org.apache.olingo.osgi.itests.BundlesTest
Tests run: 1, Failures: 1, Errors: 0, Skipped: 0, Time elapsed: 8.409 sec <<< FAILURE!
- in org.apache.olingo.osgi.itests.BundlesTest
test(org.apache.olingo.osgi.itests.BundlesTest)  Time elapsed: 0.115 sec  <<< FAILURE!
java.lang.AssertionError: Bundle org.apache.olingo.odata-client-api should be installed
	at org.junit.Assert.fail(Assert.java:88)
	at org.junit.Assert.assertTrue(Assert.java:41)
	at org.junit.Assert.assertNotNull(Assert.java:621)
	at org.apache.olingo.osgi.itests.OlingoOSGiTestSupport.assertBundleStarted(OlingoOSGiTestSupport.java:122)
	at org.apache.olingo.osgi.itests.BundlesTest.test(BundlesTest.java:44)

Running org.apache.olingo.osgi.itests.server.CarServiceTest
Tests run: 1, Failures: 0, Errors: 0, Skipped: 0, Time elapsed: 8.437 sec - in org.apache.olingo.osgi.itests.server.CarServiceTest

Results :

Failed tests: 
  BundlesTest.test:44->OlingoOSGiTestSupport.assertBundleStarted:122 Bundle org.apache.olingo.odata-client-api
should be installed

Tests run: 2, Failures: 1, Errors: 0, Skipped: 0

[INFO] ------------------------------------------------------------------------
[INFO] Reactor Summary for Olingo-OData 4.7.0-SNAPSHOT:
[INFO] 
[INFO] Olingo-OData ....................................... SUCCESS [  3.609 s]
[INFO] odata-lib .......................................... SUCCESS [  0.370 s]
[INFO] odata-commons-api .................................. SUCCESS [  7.842 s]
[INFO] odata-commons-core ................................. SUCCESS [  7.884 s]
[INFO] odata-client-api ................................... SUCCESS [  2.627 s]
[INFO] odata-client-core .................................. SUCCESS [ 13.451 s]
[INFO] odata-server-api ................................... SUCCESS [  3.581 s]
[INFO] odata-server-core .................................. SUCCESS [ 11.807 s]
[INFO] odata-server-core-ext .............................. SUCCESS [ 11.001 s]
[INFO] odata-server-tecsvc ................................ SUCCESS [  7.253 s]
[INFO] odata-server-test .................................. SUCCESS [ 13.528 s]
[INFO] odata-ext .......................................... SUCCESS [  0.180 s]
[INFO] odata-client-proxy ................................. SUCCESS [  2.731 s]
[INFO] pojogen-maven-plugin ............................... SUCCESS [ 24.865 s]
[INFO] odata-client-android ............................... SUCCESS [  4.067 s]
[INFO] odata-karaf ........................................ SUCCESS [  0.191 s]
[INFO] odata-karaf-features ............................... SUCCESS [  0.205 s]
[INFO] odata-samples ...................................... SUCCESS [  0.197 s]
[INFO] odata-server-osgi-sample ........................... SUCCESS [  4.343 s]
[INFO] odata-karaf-fit .................................... FAILURE [ 21.291 s]
[INFO] odata-fit .......................................... SKIPPED
[INFO] odata-dist ......................................... SKIPPED
[INFO] Olingo-OData-Client-for-Android .................... SKIPPED
[INFO] Olingo-OData-Client-for-Java ....................... SKIPPED
[INFO] Olingo-OData-Server-for-Java ....................... SKIPPED
[INFO] Olingo-OData-Server-Extension-for-Java ............. SKIPPED
[INFO] Olingo-OData-JavaDoc ............................... SKIPPED
[INFO] odata-server-sample ................................ SKIPPED
[INFO] odata-client-sample ................................ SKIPPED
[INFO] DemoService Webapp ................................. SKIPPED
[INFO] DemoService-Read-Webapp ............................ SKIPPED
[INFO] DemoService-ReadEp-Webapp .......................... SKIPPED
[INFO] DemoService-Write-Webapp ........................... SKIPPED
[INFO] DemoService-Navigation-Webapp ...................... SKIPPED
[INFO] DemoService-QueryOptions-TCS-Webapp ................ SKIPPED
[INFO] DemoService-QueryOptions-ES-Webapp ................. SKIPPED
[INFO] DemoService-QueryOptions-O-Webapp .................. SKIPPED
[INFO] DemoService-QueryOptions-F Webapp .................. SKIPPED
[INFO] DemoService-Action-Webapp .......................... SKIPPED
[INFO] DemoService-ActionPreparation-Webapp ............... SKIPPED
[INFO] DemoService-Media-Webapp ........................... SKIPPED
[INFO] DemoService-Batch-Webapp ........................... SKIPPED
[INFO] DemoService-DeepInsert-Webapp ...................... SKIPPED
[INFO] DemoService-DeepInsertPreparation-Webapp ........... SKIPPED
[INFO] DemoService-Streaming-Webapp ....................... SKIPPED
[INFO] odata-tutorials .................................... SKIPPED
[INFO] ------------------------------------------------------------------------
[INFO] BUILD FAILURE
[INFO] ------------------------------------------------------------------------
[INFO] Total time:  02:23 min
[INFO] Finished at: 2019-05-09T00:24:02Z
[INFO] ------------------------------------------------------------------------
[ERROR] Failed to execute goal org.apache.maven.plugins:maven-surefire-plugin:2.17:test (default-test)
on project odata-karaf-fit: There are test failures.
[ERROR] 
[ERROR] Please refer to <https://builds.apache.org/job/olingo-odata4-all-profiles/ws/ext/karaf/karaf-fit/target/surefire-reports>
for the individual test results.
[ERROR] -> [Help 1]
[ERROR] 
[ERROR] To see the full stack trace of the errors, re-run Maven with the -e switch.
[ERROR] Re-run Maven using the -X switch to enable full debug logging.
[ERROR] 
[ERROR] For more information about the errors and possible solutions, please read the following
articles:
[ERROR] [Help 1] http://cwiki.apache.org/confluence/display/MAVEN/MojoFailureException
[ERROR] 
[ERROR] After correcting the problems, you can resume the build with the command
[ERROR]   mvn <goals> -rf :odata-karaf-fit
Build step 'Invoke top-level Maven targets' marked build as failure
Not sending mail to unregistered user ramya.vasanth@sap.com

Mime
View raw message