olingo-commits mailing list archives

Site index · List index
Message view « Date » · « Thread »
Top « Date » · « Thread »
From Apache Jenkins Server <jenk...@builds.apache.org>
Subject Build failed in Jenkins: olingo-odata2 #1392
Date Wed, 03 Oct 2018 13:10:44 GMT
See <https://builds.apache.org/job/olingo-odata2/1392/display/redirect?page=changes>

Changes:

[archana.rai] [OLINGO-1304]ODATA V2.0 :Client serialization fails for

------------------------------------------
[...truncated 411.89 KB...]
[INFO] 
[INFO] --- maven-remote-resources-plugin:1.5:process (default) @ olingo-odata2-annotation-processor
---
[INFO] 
[INFO] --- maven-site-plugin:3.2:attach-descriptor (attach-descriptor) @ olingo-odata2-annotation-processor
---
[INFO] 
[INFO] --- maven-source-plugin:2.2.1:jar-no-fork (attach-sources) @ olingo-odata2-annotation-processor
---
[INFO] 
[INFO] --- maven-checkstyle-plugin:2.10:check (checkstyle) @ olingo-odata2-annotation-processor
---
[INFO] Starting audit...
Audit done.

[INFO] 
[INFO] --- maven-install-plugin:2.3.1:install (default-install) @ olingo-odata2-annotation-processor
---
[INFO] Installing <https://builds.apache.org/job/olingo-odata2/ws/odata2-annotation-processor/pom.xml>
to /home/jenkins/.m2/repository/org/apache/olingo/olingo-odata2-annotation-processor/2.0.11-SNAPSHOT/olingo-odata2-annotation-processor-2.0.11-SNAPSHOT.pom
[INFO] 
[INFO] --- maven-deploy-plugin:2.7:deploy (default-deploy) @ olingo-odata2-annotation-processor
---
Downloading from apache.snapshots.https: https://repository.apache.org/content/repositories/snapshots/org/apache/olingo/olingo-odata2-annotation-processor/2.0.11-SNAPSHOT/maven-metadata.xml
Progress (1): 632 B                   Downloaded from apache.snapshots.https: https://repository.apache.org/content/repositories/snapshots/org/apache/olingo/olingo-odata2-annotation-processor/2.0.11-SNAPSHOT/maven-metadata.xml
(632 B at 996 B/s)
Uploading to apache.snapshots.https: https://repository.apache.org/content/repositories/snapshots/org/apache/olingo/olingo-odata2-annotation-processor/2.0.11-SNAPSHOT/olingo-odata2-annotation-processor-2.0.11-20181003.131025-21.pom
Progress (1): 1.7 kB                    Uploaded to apache.snapshots.https: https://repository.apache.org/content/repositories/snapshots/org/apache/olingo/olingo-odata2-annotation-processor/2.0.11-SNAPSHOT/olingo-odata2-annotation-processor-2.0.11-20181003.131025-21.pom
(1.7 kB at 1.5 kB/s)
Downloading from apache.snapshots.https: https://repository.apache.org/content/repositories/snapshots/org/apache/olingo/olingo-odata2-annotation-processor/maven-metadata.xml
Progress (1): 452 B                   Downloaded from apache.snapshots.https: https://repository.apache.org/content/repositories/snapshots/org/apache/olingo/olingo-odata2-annotation-processor/maven-metadata.xml
(452 B at 725 B/s)
Uploading to apache.snapshots.https: https://repository.apache.org/content/repositories/snapshots/org/apache/olingo/olingo-odata2-annotation-processor/2.0.11-SNAPSHOT/maven-metadata.xml
Progress (1): 632 B                   Uploaded to apache.snapshots.https: https://repository.apache.org/content/repositories/snapshots/org/apache/olingo/olingo-odata2-annotation-processor/2.0.11-SNAPSHOT/maven-metadata.xml
(632 B at 541 B/s)
Uploading to apache.snapshots.https: https://repository.apache.org/content/repositories/snapshots/org/apache/olingo/olingo-odata2-annotation-processor/maven-metadata.xml
Progress (1): 452 B                   Uploaded to apache.snapshots.https: https://repository.apache.org/content/repositories/snapshots/org/apache/olingo/olingo-odata2-annotation-processor/maven-metadata.xml
(452 B at 376 B/s)
[INFO] 
[INFO] ------< org.apache.olingo:olingo-odata2-annotation-processor-api >------
[INFO] Building olingo-odata2-annotation-processor-api 2.0.11-SNAPSHOT  [18/31]
[INFO] --------------------------------[ jar ]---------------------------------
[INFO] 
[INFO] --- maven-clean-plugin:2.5:clean (default-clean) @ olingo-odata2-annotation-processor-api
---
[INFO] 
[INFO] --- buildnumber-maven-plugin:1.2:create (default) @ olingo-odata2-annotation-processor-api
---
[INFO] 
[INFO] --- maven-remote-resources-plugin:1.5:process (default) @ olingo-odata2-annotation-processor-api
---
[INFO] 
[INFO] --- maven-resources-plugin:2.6:resources (default-resources) @ olingo-odata2-annotation-processor-api
---
[INFO] Using 'UTF-8' encoding to copy filtered resources.
[INFO] skip non existing resourceDirectory <https://builds.apache.org/job/olingo-odata2/ws/odata2-annotation-processor/annotation-processor-api/src/main/resources>
[INFO] Copying 3 resources
[INFO] 
[INFO] --- maven-compiler-plugin:2.3.2:compile (default-compile) @ olingo-odata2-annotation-processor-api
---
[INFO] Compiling 2 source files to <https://builds.apache.org/job/olingo-odata2/ws/odata2-annotation-processor/annotation-processor-api/target/classes>
[INFO] 
[INFO] --- maven-bundle-plugin:2.3.7:manifest (bundle-manifest) @ olingo-odata2-annotation-processor-api
---
[WARNING] Manifest org.apache.olingo:olingo-odata2-annotation-processor-api:jar:2.0.11-SNAPSHOT
: Superfluous export-package instructions: [org.apache.olingo.odata2.annotation.processor.api.*]
[INFO] 
[INFO] --- maven-resources-plugin:2.6:testResources (default-testResources) @ olingo-odata2-annotation-processor-api
---
[INFO] Using 'UTF-8' encoding to copy filtered resources.
[INFO] skip non existing resourceDirectory <https://builds.apache.org/job/olingo-odata2/ws/odata2-annotation-processor/annotation-processor-api/src/test/resources>
[INFO] Copying 3 resources
[INFO] 
[INFO] --- maven-compiler-plugin:2.3.2:testCompile (default-testCompile) @ olingo-odata2-annotation-processor-api
---
[INFO] No sources to compile
[INFO] 
[INFO] --- maven-surefire-plugin:2.12.4:test (default-test) @ olingo-odata2-annotation-processor-api
---
[INFO] 
[INFO] --- maven-jar-plugin:2.3.2:jar (default-jar) @ olingo-odata2-annotation-processor-api
---
[INFO] Building jar: <https://builds.apache.org/job/olingo-odata2/ws/odata2-annotation-processor/annotation-processor-api/target/olingo-odata2-annotation-processor-api-2.0.11-SNAPSHOT.jar>
[INFO] 
[INFO] --- maven-site-plugin:3.2:attach-descriptor (attach-descriptor) @ olingo-odata2-annotation-processor-api
---
[INFO] 
[INFO] --- maven-source-plugin:2.2.1:jar-no-fork (attach-sources) @ olingo-odata2-annotation-processor-api
---
[INFO] Building jar: <https://builds.apache.org/job/olingo-odata2/ws/odata2-annotation-processor/annotation-processor-api/target/olingo-odata2-annotation-processor-api-2.0.11-SNAPSHOT-sources.jar>
[INFO] 
[INFO] --- maven-checkstyle-plugin:2.10:check (checkstyle) @ olingo-odata2-annotation-processor-api
---
[INFO] Starting audit...
Audit done.

[INFO] 
[INFO] --- maven-install-plugin:2.3.1:install (default-install) @ olingo-odata2-annotation-processor-api
---
[INFO] Installing <https://builds.apache.org/job/olingo-odata2/ws/odata2-annotation-processor/annotation-processor-api/target/olingo-odata2-annotation-processor-api-2.0.11-SNAPSHOT.jar>
to /home/jenkins/.m2/repository/org/apache/olingo/olingo-odata2-annotation-processor-api/2.0.11-SNAPSHOT/olingo-odata2-annotation-processor-api-2.0.11-SNAPSHOT.jar
[INFO] Installing <https://builds.apache.org/job/olingo-odata2/ws/odata2-annotation-processor/annotation-processor-api/pom.xml>
to /home/jenkins/.m2/repository/org/apache/olingo/olingo-odata2-annotation-processor-api/2.0.11-SNAPSHOT/olingo-odata2-annotation-processor-api-2.0.11-SNAPSHOT.pom
[INFO] Installing <https://builds.apache.org/job/olingo-odata2/ws/odata2-annotation-processor/annotation-processor-api/target/olingo-odata2-annotation-processor-api-2.0.11-SNAPSHOT-sources.jar>
to /home/jenkins/.m2/repository/org/apache/olingo/olingo-odata2-annotation-processor-api/2.0.11-SNAPSHOT/olingo-odata2-annotation-processor-api-2.0.11-SNAPSHOT-sources.jar
[INFO] 
[INFO] --- maven-deploy-plugin:2.7:deploy (default-deploy) @ olingo-odata2-annotation-processor-api
---
Downloading from apache.snapshots.https: https://repository.apache.org/content/repositories/snapshots/org/apache/olingo/olingo-odata2-annotation-processor-api/2.0.11-SNAPSHOT/maven-metadata.xml
Progress (1): 1.0 kB                    Downloaded from apache.snapshots.https: https://repository.apache.org/content/repositories/snapshots/org/apache/olingo/olingo-odata2-annotation-processor-api/2.0.11-SNAPSHOT/maven-metadata.xml
(1.0 kB at 1.6 kB/s)
Uploading to apache.snapshots.https: https://repository.apache.org/content/repositories/snapshots/org/apache/olingo/olingo-odata2-annotation-processor-api/2.0.11-SNAPSHOT/olingo-odata2-annotation-processor-api-2.0.11-20181003.131030-21.jar
Progress (1): 2.0/10 kBProgress (1): 4.1/10 kBProgress (1): 6.1/10 kBProgress (1): 8.2/10
kBProgress (1): 10/10 kB Progress (1): 10 kB                      Uploaded to apache.snapshots.https:
https://repository.apache.org/content/repositories/snapshots/org/apache/olingo/olingo-odata2-annotation-processor-api/2.0.11-SNAPSHOT/olingo-odata2-annotation-processor-api-2.0.11-20181003.131030-21.jar
(10 kB at 9.0 kB/s)
Uploading to apache.snapshots.https: https://repository.apache.org/content/repositories/snapshots/org/apache/olingo/olingo-odata2-annotation-processor-api/2.0.11-SNAPSHOT/olingo-odata2-annotation-processor-api-2.0.11-20181003.131030-21.pom
Progress (1): 2.0/3.1 kBProgress (1): 3.1 kB                        Uploaded to apache.snapshots.https:
https://repository.apache.org/content/repositories/snapshots/org/apache/olingo/olingo-odata2-annotation-processor-api/2.0.11-SNAPSHOT/olingo-odata2-annotation-processor-api-2.0.11-20181003.131030-21.pom
(3.1 kB at 2.7 kB/s)
Downloading from apache.snapshots.https: https://repository.apache.org/content/repositories/snapshots/org/apache/olingo/olingo-odata2-annotation-processor-api/maven-metadata.xml
Progress (1): 456 B                   Downloaded from apache.snapshots.https: https://repository.apache.org/content/repositories/snapshots/org/apache/olingo/olingo-odata2-annotation-processor-api/maven-metadata.xml
(456 B at 739 B/s)
Uploading to apache.snapshots.https: https://repository.apache.org/content/repositories/snapshots/org/apache/olingo/olingo-odata2-annotation-processor-api/2.0.11-SNAPSHOT/maven-metadata.xml
Progress (1): 1.0 kB                    Uploaded to apache.snapshots.https: https://repository.apache.org/content/repositories/snapshots/org/apache/olingo/olingo-odata2-annotation-processor-api/2.0.11-SNAPSHOT/maven-metadata.xml
(1.0 kB at 872 B/s)
Uploading to apache.snapshots.https: https://repository.apache.org/content/repositories/snapshots/org/apache/olingo/olingo-odata2-annotation-processor-api/maven-metadata.xml
Progress (1): 456 B                   Uploaded to apache.snapshots.https: https://repository.apache.org/content/repositories/snapshots/org/apache/olingo/olingo-odata2-annotation-processor-api/maven-metadata.xml
(456 B at 388 B/s)
Uploading to apache.snapshots.https: https://repository.apache.org/content/repositories/snapshots/org/apache/olingo/olingo-odata2-annotation-processor-api/2.0.11-SNAPSHOT/olingo-odata2-annotation-processor-api-2.0.11-20181003.131030-21-sources.jar
Progress (1): 2.0/8.4 kBProgress (1): 4.1/8.4 kBProgress (1): 6.1/8.4 kBProgress (1): 8.2/8.4
kBProgress (1): 8.4 kB                        Uploaded to apache.snapshots.https: https://repository.apache.org/content/repositories/snapshots/org/apache/olingo/olingo-odata2-annotation-processor-api/2.0.11-SNAPSHOT/olingo-odata2-annotation-processor-api-2.0.11-20181003.131030-21-sources.jar
(8.4 kB at 7.2 kB/s)
Uploading to apache.snapshots.https: https://repository.apache.org/content/repositories/snapshots/org/apache/olingo/olingo-odata2-annotation-processor-api/2.0.11-SNAPSHOT/maven-metadata.xml
Progress (1): 1.0 kB                    Uploaded to apache.snapshots.https: https://repository.apache.org/content/repositories/snapshots/org/apache/olingo/olingo-odata2-annotation-processor-api/2.0.11-SNAPSHOT/maven-metadata.xml
(1.0 kB at 883 B/s)
[INFO] 
[INFO] -----< org.apache.olingo:olingo-odata2-annotation-processor-core >------
[INFO] Building olingo-odata2-annotation-processor-core 2.0.11-SNAPSHOT [19/31]
[INFO] --------------------------------[ jar ]---------------------------------
[INFO] 
[INFO] --- maven-clean-plugin:2.5:clean (default-clean) @ olingo-odata2-annotation-processor-core
---
[INFO] 
[INFO] --- buildnumber-maven-plugin:1.2:create (default) @ olingo-odata2-annotation-processor-core
---
[INFO] 
[INFO] --- maven-remote-resources-plugin:1.5:process (default) @ olingo-odata2-annotation-processor-core
---
[INFO] 
[INFO] --- maven-resources-plugin:2.6:resources (default-resources) @ olingo-odata2-annotation-processor-core
---
[INFO] Using 'UTF-8' encoding to copy filtered resources.
[INFO] skip non existing resourceDirectory <https://builds.apache.org/job/olingo-odata2/ws/odata2-annotation-processor/annotation-processor-core/src/main/resources>
[INFO] Copying 3 resources
[INFO] 
[INFO] --- maven-compiler-plugin:2.3.2:compile (default-compile) @ olingo-odata2-annotation-processor-core
---
[INFO] Compiling 13 source files to <https://builds.apache.org/job/olingo-odata2/ws/odata2-annotation-processor/annotation-processor-core/target/classes>
[INFO] 
[INFO] --- maven-bundle-plugin:2.3.7:manifest (bundle-manifest) @ olingo-odata2-annotation-processor-core
---
[INFO] 
[INFO] --- maven-resources-plugin:2.6:testResources (default-testResources) @ olingo-odata2-annotation-processor-core
---
[INFO] Using 'UTF-8' encoding to copy filtered resources.
[INFO] skip non existing resourceDirectory <https://builds.apache.org/job/olingo-odata2/ws/odata2-annotation-processor/annotation-processor-core/src/test/resources>
[INFO] Copying 3 resources
[INFO] 
[INFO] --- maven-compiler-plugin:2.3.2:testCompile (default-testCompile) @ olingo-odata2-annotation-processor-core
---
[INFO] Compiling 21 source files to <https://builds.apache.org/job/olingo-odata2/ws/odata2-annotation-processor/annotation-processor-core/target/test-classes>
[INFO] 
[INFO] --- maven-surefire-plugin:2.12.4:test (default-test) @ olingo-odata2-annotation-processor-core
---
[INFO] Surefire report directory: <https://builds.apache.org/job/olingo-odata2/ws/odata2-annotation-processor/annotation-processor-core/target/surefire-reports>

-------------------------------------------------------
 T E S T S
-------------------------------------------------------
Running org.apache.olingo.odata2.annotation.processor.core.util.ClassHelperTest
Tests run: 4, Failures: 0, Errors: 1, Skipped: 0, Time elapsed: 0.077 sec <<< FAILURE!
loadFromDirWithUnsafeName(org.apache.olingo.odata2.annotation.processor.core.util.ClassHelperTest)
 Time elapsed: 0.019 sec  <<< ERROR!
java.lang.Exception: Unexpected exception, expected<java.lang.ClassFormatError> but
was<java.lang.IllegalArgumentException>
	at org.junit.internal.runners.statements.ExpectException.evaluate(ExpectException.java:31)
	at org.junit.runners.ParentRunner.runLeaf(ParentRunner.java:263)
	at org.junit.runners.BlockJUnit4ClassRunner.runChild(BlockJUnit4ClassRunner.java:68)
	at org.junit.runners.BlockJUnit4ClassRunner.runChild(BlockJUnit4ClassRunner.java:47)
	at org.junit.runners.ParentRunner$3.run(ParentRunner.java:231)
	at org.junit.runners.ParentRunner$1.schedule(ParentRunner.java:60)
	at org.junit.runners.ParentRunner.runChildren(ParentRunner.java:229)
	at org.junit.runners.ParentRunner.access$000(ParentRunner.java:50)
	at org.junit.runners.ParentRunner$2.evaluate(ParentRunner.java:222)
	at org.junit.runners.ParentRunner.run(ParentRunner.java:300)
	at org.apache.maven.surefire.junit4.JUnit4Provider.execute(JUnit4Provider.java:252)
	at org.apache.maven.surefire.junit4.JUnit4Provider.executeTestSet(JUnit4Provider.java:141)
	at org.apache.maven.surefire.junit4.JUnit4Provider.invoke(JUnit4Provider.java:112)
	at sun.reflect.NativeMethodAccessorImpl.invoke0(Native Method)
	at sun.reflect.NativeMethodAccessorImpl.invoke(NativeMethodAccessorImpl.java:62)
	at sun.reflect.DelegatingMethodAccessorImpl.invoke(DelegatingMethodAccessorImpl.java:43)
	at java.lang.reflect.Method.invoke(Method.java:498)
	at org.apache.maven.surefire.util.ReflectionUtils.invokeMethodWithArray(ReflectionUtils.java:189)
	at org.apache.maven.surefire.booter.ProviderFactory$ProviderProxy.invoke(ProviderFactory.java:165)
	at org.apache.maven.surefire.booter.ProviderFactory.invokeProvider(ProviderFactory.java:85)
	at org.apache.maven.surefire.booter.ForkedBooter.runSuitesInProcess(ForkedBooter.java:115)
	at org.apache.maven.surefire.booter.ForkedBooter.main(ForkedBooter.java:75)
Caused by: java.lang.IllegalArgumentException: No folder to scan found for package 'space
space.package'.
	at org.apache.olingo.odata2.annotation.processor.core.util.ClassHelper.getResourceUri(ClassHelper.java:110)
	at org.apache.olingo.odata2.annotation.processor.core.util.ClassHelper.loadClasses(ClassHelper.java:73)
	at org.apache.olingo.odata2.annotation.processor.core.util.ClassHelper.loadClasses(ClassHelper.java:66)
	at org.apache.olingo.odata2.annotation.processor.core.util.ClassHelperTest.loadFromDirWithUnsafeName(ClassHelperTest.java:91)
	at sun.reflect.NativeMethodAccessorImpl.invoke0(Native Method)
	at sun.reflect.NativeMethodAccessorImpl.invoke(NativeMethodAccessorImpl.java:62)
	at sun.reflect.DelegatingMethodAccessorImpl.invoke(DelegatingMethodAccessorImpl.java:43)
	at java.lang.reflect.Method.invoke(Method.java:498)
	at org.junit.runners.model.FrameworkMethod$1.runReflectiveCall(FrameworkMethod.java:45)
	at org.junit.internal.runners.model.ReflectiveCallable.run(ReflectiveCallable.java:15)
	at org.junit.runners.model.FrameworkMethod.invokeExplosively(FrameworkMethod.java:42)
	at org.junit.internal.runners.statements.InvokeMethod.evaluate(InvokeMethod.java:20)
	at org.junit.internal.runners.statements.ExpectException.evaluate(ExpectException.java:22)
	... 21 more

Running org.apache.olingo.odata2.annotation.processor.core.util.AnnotationHelperTest
Tests run: 21, Failures: 0, Errors: 0, Skipped: 0, Time elapsed: 0.075 sec
Running org.apache.olingo.odata2.annotation.processor.core.ListsProcessorTest
Tests run: 4, Failures: 0, Errors: 0, Skipped: 0, Time elapsed: 0.218 sec
Running org.apache.olingo.odata2.annotation.processor.core.datasource.AnnotationsInMemoryDsTest
Tests run: 34, Failures: 0, Errors: 0, Skipped: 2, Time elapsed: 0.662 sec
Running org.apache.olingo.odata2.annotation.processor.core.datasource.BeanPropertyAccessTest
Tests run: 15, Failures: 0, Errors: 0, Skipped: 0, Time elapsed: 0.038 sec
Running org.apache.olingo.odata2.annotation.processor.core.datasource.AnnotationValueAccessTest
Tests run: 17, Failures: 0, Errors: 0, Skipped: 0, Time elapsed: 0.016 sec
Running org.apache.olingo.odata2.annotation.processor.core.AnnotationServiceFactoryImplTest
Tests run: 3, Failures: 0, Errors: 0, Skipped: 0, Time elapsed: 0.017 sec
Running org.apache.olingo.odata2.annotation.processor.core.edm.AnnotationEdmProviderTest
Tests run: 17, Failures: 0, Errors: 0, Skipped: 0, Time elapsed: 0.034 sec
Running org.apache.olingo.odata2.annotation.processor.core.edm.AnnotationEdmProviderNamespacesTest
Tests run: 5, Failures: 0, Errors: 0, Skipped: 1, Time elapsed: 0.044 sec

Results :

Tests in error: 
  loadFromDirWithUnsafeName(org.apache.olingo.odata2.annotation.processor.core.util.ClassHelperTest):
Unexpected exception, expected<java.lang.ClassFormatError> but was<java.lang.IllegalArgumentException>

Tests run: 120, Failures: 0, Errors: 1, Skipped: 3

[INFO] ------------------------------------------------------------------------
[INFO] Reactor Summary:
[INFO] 
[INFO] olingo-odata2-parent 2.0.11-SNAPSHOT ............... SUCCESS [ 11.733 s]
[INFO] olingo-odata2-lib .................................. SUCCESS [  4.986 s]
[INFO] olingo-odata2-api .................................. SUCCESS [ 15.747 s]
[INFO] olingo-odata2-api-annotation ....................... SUCCESS [  9.697 s]
[INFO] olingo-odata2-testutil ............................. SUCCESS [ 14.105 s]
[INFO] olingo-odata2-core ................................. SUCCESS [ 53.521 s]
[INFO] olingo-odata2-ref .................................. SUCCESS [ 13.197 s]
[INFO] olingo-odata2-fit .................................. SUCCESS [05:41 min]
[INFO] olingo-odata2-ref-web .............................. SUCCESS [  2.723 s]
[INFO] olingo-odata2-client-api ........................... SUCCESS [ 10.456 s]
[INFO] olingo-odata2-client-core .......................... SUCCESS [ 32.868 s]
[INFO] olingo-odata2-jpa-processor ........................ SUCCESS [  4.984 s]
[INFO] olingo-odata2-jpa-processor-api .................... SUCCESS [ 11.563 s]
[INFO] olingo-odata2-jpa-processor-core ................... SUCCESS [ 21.481 s]
[INFO] olingo-odata2-jpa-processor-ref .................... SUCCESS [ 12.014 s]
[INFO] olingo-odata2-jpa-processor-ref-web ................ SUCCESS [  3.006 s]
[INFO] olingo-odata2-annotation-processor ................. SUCCESS [  4.878 s]
[INFO] olingo-odata2-annotation-processor-api ............. SUCCESS [  9.049 s]
[INFO] olingo-odata2-annotation-processor-core ............ FAILURE [  5.562 s]
[INFO] olingo-odata2-annotation-processor-ref ............. SKIPPED
[INFO] olingo-odata2-annotation-processor-ref-web ......... SKIPPED
[INFO] olingo-odata2-dist ................................. SKIPPED
[INFO] olingo-odata2-dist-lib ............................. SKIPPED
[INFO] olingo-odata2-dist-jpa ............................. SKIPPED
[INFO] olingo-odata2-dist-janos ........................... SKIPPED
[INFO] olingo-odata2-dist-ref ............................. SKIPPED
[INFO] olingo-odata2-dist-javadoc ......................... SKIPPED
[INFO] olingo-odata2-sample ............................... SKIPPED
[INFO] olingo-odata2-sample-cars-service-archetype ........ SKIPPED
[INFO] olingo-odata2-sample-cars-annotation-archetype ..... SKIPPED
[INFO] olingo-odata2-sample-cars-jpa-archetype 2.0.11-SNAPSHOT SKIPPED
[INFO] ------------------------------------------------------------------------
[INFO] BUILD FAILURE
[INFO] ------------------------------------------------------------------------
[INFO] Total time: 09:44 min
[INFO] Finished at: 2018-10-03T13:10:43Z
[INFO] ------------------------------------------------------------------------
[ERROR] Failed to execute goal org.apache.maven.plugins:maven-surefire-plugin:2.12.4:test
(default-test) on project olingo-odata2-annotation-processor-core: There are test failures.
[ERROR] 
[ERROR] Please refer to <https://builds.apache.org/job/olingo-odata2/ws/odata2-annotation-processor/annotation-processor-core/target/surefire-reports>
for the individual test results.
[ERROR] -> [Help 1]
[ERROR] 
[ERROR] To see the full stack trace of the errors, re-run Maven with the -e switch.
[ERROR] Re-run Maven using the -X switch to enable full debug logging.
[ERROR] 
[ERROR] For more information about the errors and possible solutions, please read the following
articles:
[ERROR] [Help 1] http://cwiki.apache.org/confluence/display/MAVEN/MojoFailureException
[ERROR] 
[ERROR] After correcting the problems, you can resume the build with the command
[ERROR]   mvn <goals> -rf :olingo-odata2-annotation-processor-core
Build step 'Invoke top-level Maven targets' marked build as failure
Not sending mail to unregistered user archana.rai@sap.com

Mime
View raw message