olingo-commits mailing list archives

Site index · List index
Message view « Date » · « Thread »
Top « Date » · « Thread »
From Apache Jenkins Server <jenk...@builds.apache.org>
Subject Build failed in Jenkins: olingo-odata4-all-profiles #260
Date Wed, 23 May 2018 10:09:45 GMT
See <https://builds.apache.org/job/olingo-odata4-all-profiles/260/display/redirect?page=changes>

Changes:

[ramya.vasanth] [OLINGO-1238]Handling Prefer header with values being minimal and

------------------------------------------
[...truncated 1.01 MB...]
  FilterSystemQueryITCase.floor:659->sendRequest:1050->sendRequest:1068 » ODataServerError
  FilterSystemQueryITCase.dateSubDuration:871->sendRequest:1050->sendRequest:1068 »
ODataServerError
  FilterSystemQueryITCase.round:693->sendRequest:1050->sendRequest:1068 » ODataServerError
  FilterSystemQueryITCase.unaryWithWrongTypes:250->fail:1077->sendRequest:1050->sendRequest:1068
» ODataServerError
  FilterSystemQueryITCase.doubleLiteral:140->sendRequest:1050->sendRequest:1068 » ODataServerError
  FilterSystemQueryITCase.errorCodeArithmetic:297->fail:1077->sendRequest:1050->sendRequest:1068
» ODataServerError
  FilterSystemQueryITCase.dateTimeOffsetSubDateTimeOffset:891->sendRequest:1050->sendRequest:1068
» ODataServerError
  FilterSystemQueryITCase.minuteFunctionDateTimeOffset:578->sendRequest:1050->sendRequest:1068
» ODataServerError
  FilterSystemQueryITCase.methodCallsWithNull:258->sendRequest:1050->sendRequest:1068
» ODataServerError
  FilterSystemQueryITCase.simpleEq:149->sendRequest:1050->sendRequest:1068 » ODataServerError
  FilterSystemQueryITCase.minuteFunctionTimeOfDay:587->sendRequest:1050->sendRequest:1068
» ODataServerError
  FilterSystemQueryITCase.ceiling:676->sendRequest:1050->sendRequest:1068 » ODataServerError
  FilterSystemQueryITCase.comparisonOnStringOperands:1010->sendRequest:1050->sendRequest:1068
» ODataServerError
  FilterSystemQueryITCase.secondFunctionTimeOfDay:605->sendRequest:1050->sendRequest:1068
» ODataServerError
  FilterSystemQueryITCase.addNullLiteralEqualsNull:443->sendRequest:1050->sendRequest:1068
» ODataServerError
  FilterSystemQueryITCase.castEdm64ToDouble:807->sendRequest:1050->sendRequest:1068
» ODataServerError
  FilterSystemQueryITCase.nullComplexProperty:977 » ODataServerError HTTP/1.1 50...
  FilterSystemQueryITCase.substringWithNegativeValues:279->sendRequest:1050->sendRequest:1068
» ODataServerError
  FilterSystemQueryITCase.stringFunctionWithoutStringParameters:1046->fail:1077->sendRequest:1050->sendRequest:1068
» ODataServerError
  FilterSystemQueryITCase.filterNotBooleanExpression:995->fail:1077->sendRequest:1050->sendRequest:1068
» ODataServerError
  FilterSystemQueryITCase.dateLiteral:107->sendRequest:1050->sendRequest:1068 » ODataServerError
  FilterSystemQueryITCase.useFilterFactory:63 » ODataServerError HTTP/1.1 500 In...
  FilterSystemQueryITCase.durationAddDuration:824->sendRequest:1050->sendRequest:1068
» ODataServerError
  FilterSystemQueryITCase.stringPropertyEqualsNull:431->sendRequest:1050->sendRequest:1068
» ODataServerError
  FilterSystemQueryITCase.dateTimeOffsetAddDuration:814->sendRequest:1050->sendRequest:1068
» ODataServerError
  FilterSystemQueryITCase.dayFunctionDate:548->sendRequest:1050->sendRequest:1068 »
ODataServerError
  FilterSystemQueryITCase.endsWith:724->sendRequest:1050->sendRequest:1068 » ODataServerError
  FilterSystemQueryITCase.hourFunctionTimeOfDay:569->sendRequest:1050->sendRequest:1068
» ODataServerError
  FilterSystemQueryITCase.stringProperty:196->sendRequest:1050->sendRequest:1068 »
ODataServerError
  FilterSystemQueryITCase.indexOf:737->sendRequest:1050->sendRequest:1068 » ODataServerError
  FilterSystemQueryITCase.dateTimeFunctionsNull:638->sendRequest:1050->sendRequest:1068
» ODataServerError
  FilterSystemQueryITCase.clientEscaping:186 » ODataServerError HTTP/1.1 500 Int...
  FilterSystemQueryITCase.durationLiteral:834->sendRequest:1050->sendRequest:1068 »
ODataServerError
  FilterSystemQueryITCase.secondFunctionDateTimeOffset:596->sendRequest:1050->sendRequest:1068
» ODataServerError
  FilterSystemQueryITCase.dateAddDuration:841->sendRequest:1050->sendRequest:1068 »
ODataServerError
  FunctionImportITCase.FICRTStringTwoParamNotNull:250 » ODataServerError HTTP/1....
  FunctionImportITCase.primitiveValue:225 » ODataServerError HTTP/1.1 500 Intern...
  FunctionImportITCase.allParameterKinds:366 » ODataServerError HTTP/1.1 500 Int...
  FunctionImportITCase.entity:58 » ODataServerError HTTP/1.1 500 Internal Server...
  FunctionImportITCase.entityCollection:101 » ODataServerError HTTP/1.1 500 Inte...
  FunctionImportITCase.FICRTStringTwoParamWithAliases:284 » ODataServerError HTT...
  FunctionImportITCase.FICRTStringTwoParamNull:264 » ODataServerError HTTP/1.1 5...
  FunctionImportITCase.countEntityCollection:171 » ODataServerError HTTP/1.1 500...
  FunctionImportITCase.primitiveCollection:204 » ODataServerError HTTP/1.1 500 I...
  FunctionImportITCase.primitiveValueWithPath:237 » ODataServerError HTTP/1.1 50...
  FunctionImportITCase.complexWithPath:186 » ODataServerError HTTP/1.1 500 Inter...
  FunctionImportITCase.entityWithoutEntitySet:78 » ODataServerError HTTP/1.1 500...
  FunctionImportITCase.test5OLINGO753:517 » ODataServerError HTTP/1.1 500 Intern...
  FunctionImportITCase.test4OLINGO753:490 » ODataServerError HTTP/1.1 500 Intern...
  FunctionImportITCase.test3OLINGO753:463 » ODataServerError HTTP/1.1 500 Intern...
  FunctionImportITCase.FICRTCollCTTwoPrimTwoParamNull:320 » ODataServerError HTT...
  FunctionImportITCase.test2OLINGO753:437 » ODataServerError HTTP/1.1 500 Intern...
  FunctionImportITCase.test1OLINGO753:410 » ODataServerError HTTP/1.1 500 Intern...
  FunctionImportITCase.FICRTCollCTTwoPrimTwoParamNotNull:297 » ODataServerError ...
  FunctionImportITCase.entityCollectionWithAppendedKey:130 » ODataServerError HT...
  FunctionImportITCase.entityCollectionWithAppendedKeyAndProperty:155 » ODataServerError
  FunctionImportITCase.FICRTStringTwoParamNotNull:250 » ODataServerError HTTP/1....
  FunctionImportITCase.primitiveValue:225 » ODataServerError HTTP/1.1 500 Intern...
  FunctionImportITCase.allParameterKinds:366 » ODataServerError HTTP/1.1 500 Int...
  FunctionImportITCase.entity:58 » ODataServerError HTTP/1.1 500 Internal Server...
  FunctionImportITCase.entityCollection:101 » ODataServerError HTTP/1.1 500 Inte...
  FunctionImportITCase.FICRTStringTwoParamWithAliases:284 » ODataServerError HTT...
  FunctionImportITCase.FICRTStringTwoParamNull:264 » ODataServerError HTTP/1.1 5...
  FunctionImportITCase.countEntityCollection:171 » ODataServerError HTTP/1.1 500...
  FunctionImportITCase.primitiveCollection:204 » ODataServerError HTTP/1.1 500 I...
  FunctionImportITCase.primitiveValueWithPath:237 » ODataServerError HTTP/1.1 50...
  FunctionImportITCase.complexWithPath:186 » ODataServerError HTTP/1.1 500 Inter...
  FunctionImportITCase.entityWithoutEntitySet:78 » ODataServerError HTTP/1.1 500...
  FunctionImportITCase.test5OLINGO753:517 » ODataServerError HTTP/1.1 500 Intern...
  FunctionImportITCase.test4OLINGO753:490 » ODataServerError HTTP/1.1 500 Intern...
  FunctionImportITCase.test3OLINGO753:463 » ODataServerError HTTP/1.1 500 Intern...
  FunctionImportITCase.FICRTCollCTTwoPrimTwoParamNull:320 » ODataServerError HTT...
  FunctionImportITCase.test2OLINGO753:437 » ODataServerError HTTP/1.1 500 Intern...
  FunctionImportITCase.test1OLINGO753:410 » ODataServerError HTTP/1.1 500 Intern...
  FunctionImportITCase.FICRTCollCTTwoPrimTwoParamNotNull:297 » ODataServerError ...
  FunctionImportITCase.entityCollectionWithAppendedKey:130 » ODataServerError HT...
  FunctionImportITCase.entityCollectionWithAppendedKeyAndProperty:155 » ODataServerError
  JSONFormatConformanceTestITCase.item1:60 » ODataServerError HTTP/1.1 500 Inter...
  MediaITCase.create:126 » HttpClient java.util.concurrent.ExecutionException: o...
  MediaITCase.delete:76 » ODataServerError HTTP/1.1 500 Internal Server Error
  MediaITCase.update:102 » HttpClient java.util.concurrent.ExecutionException: o...
  MediaITCase.read:58 » ODataServerError HTTP/1.1 500 Internal Server Error
  MediaITCase.create:126 » HttpClient java.util.concurrent.ExecutionException: o...
  MediaITCase.delete:76 » ODataServerError HTTP/1.1 500 Internal Server Error
  MediaITCase.update:102 » HttpClient java.util.concurrent.ExecutionException: o...
  MediaITCase.read:58 » ODataServerError HTTP/1.1 500 Internal Server Error
  NavigationITCase.twoLevelsToEntityWithKey:115 » ODataServerError HTTP/1.1 500 ...
  NavigationITCase.twoLevelsToProperty:157 » ODataServerError HTTP/1.1 500 Inter...
  NavigationITCase.navigationToEntityWithRelativeContextUrl:44 » HttpClient org....
  NavigationITCase.oneLevelToEntityWithKey:96 » ODataServerError HTTP/1.1 500 In...
  NavigationITCase.twoLevelsToEntitySet:134 » ODataServerError HTTP/1.1 500 Inte...
  NavigationITCase.oneLevelToEntity:78 » ODataServerError HTTP/1.1 500 Internal ...
  NavigationITCase.twoLevelsToEntityWithKey:115 » ODataServerError HTTP/1.1 500 ...
  NavigationITCase.twoLevelsToProperty:157 » ODataServerError HTTP/1.1 500 Inter...
  NavigationITCase.navigationToEntityWithRelativeContextUrl:44 » HttpClient org....
  NavigationITCase.oneLevelToEntityWithKey:96 » ODataServerError HTTP/1.1 500 In...
  NavigationITCase.twoLevelsToEntitySet:134 » ODataServerError HTTP/1.1 500 Inte...
  NavigationITCase.oneLevelToEntity:78 » ODataServerError HTTP/1.1 500 Internal ...
  OrderBySystemQueryITCase.orderByInvalidExpression:123->fail:143->sendRequest:136 »
ODataServerError
  OrderBySystemQueryITCase.simpleOrderByDescending:59->sendRequest:136 » ODataServerError
  OrderBySystemQueryITCase.multipleOrderByDescending:90->sendRequest:136 » ODataServerError
  OrderBySystemQueryITCase.orderByWithNull:105->sendRequest:136 » ODataServerError
  OrderBySystemQueryITCase.multipleOrderBy:74->sendRequest:136 » ODataServerError
  OrderBySystemQueryITCase.simpleOrderBy:44->sendRequest:136 » ODataServerError ...
  OrderBySystemQueryITCase.orderByInvalidExpression:123->fail:143->sendRequest:136 »
ODataServerError
  OrderBySystemQueryITCase.simpleOrderByDescending:59->sendRequest:136 » ODataServerError
  OrderBySystemQueryITCase.multipleOrderByDescending:90->sendRequest:136 » ODataServerError
  OrderBySystemQueryITCase.orderByWithNull:105->sendRequest:136 » ODataServerError
  OrderBySystemQueryITCase.multipleOrderBy:74->sendRequest:136 » ODataServerError
  OrderBySystemQueryITCase.simpleOrderBy:44->sendRequest:136 » ODataServerError ...
  PrimitiveComplexITCase.readPrimitiveCollectionCount:416 » ODataServerError HTT...
  PrimitiveComplexITCase.readComplexProperty:157 » ODataServerError HTTP/1.1 500...
  PrimitiveComplexITCase.deletePropertyValue:361 » ODataServerError HTTP/1.1 500...
  PrimitiveComplexITCase.updateComplexCollection:330 » ODataServerError HTTP/1.1...
  PrimitiveComplexITCase.retrieveBooleanPropertyValueTest:461 » ODataServerError
  PrimitiveComplexITCase.readSimpleProperty:68 » ODataServerError HTTP/1.1 500 I...
  PrimitiveComplexITCase.updatePropertyValue:383 » ODataServerError HTTP/1.1 500...
  PrimitiveComplexITCase.deletePrimitive:107 » ODataServerError HTTP/1.1 500 Int...
  PrimitiveComplexITCase.updatePropertyValueMinimalResponse:402 » ODataServerError
  PrimitiveComplexITCase.deletePrimitiveCollection:132 » ODataServerError HTTP/1...
  PrimitiveComplexITCase.retrieveIntPropertyValueTest:452 » ODataServerError HTT...
  PrimitiveComplexITCase.patchComplexProperty:276 » ODataServerError HTTP/1.1 50...
  PrimitiveComplexITCase.updatePrimitiveCollection:305 » ODataServerError HTTP/1...
  PrimitiveComplexITCase.retrieveDecimalPropertyValueTest:480 » ODataServerError
  PrimitiveComplexITCase.readPropertyValue:348 » ODataServerError HTTP/1.1 500 I...
  PrimitiveComplexITCase.updatePrimitiveProperty:251 » ODataServerError HTTP/1.1...
  PrimitiveComplexITCase.retrieveDatePropertyValueTest:470 » ODataServerError HT...
  PrimitiveComplexITCase.readSimplePropertyContextURL:88 » ODataServerError HTTP...
  PrimitiveComplexITCase.deleteComplex:197 » ODataServerError HTTP/1.1 500 Inter...
  PrimitiveComplexITCase.readNoContentProperty:234 » ODataServerError HTTP/1.1 5...
  PrimitiveComplexITCase.readComplexCollectionCount:436 » ODataServerError HTTP/...
  PrimitiveComplexITCase.readUnknownProperty:218 » ODataServerError HTTP/1.1 500...
  PrimitiveComplexITCase.readComplexPropertyContextURL:177 » ODataServerError HT...
  PrimitiveComplexITCase.readPrimitiveCollectionCount:416 » ODataServerError HTT...
  PrimitiveComplexITCase.readComplexProperty:157 » ODataServerError HTTP/1.1 500...
  PrimitiveComplexITCase.deletePropertyValue:361 » ODataServerError HTTP/1.1 500...
  PrimitiveComplexITCase.updateComplexCollection:330 » ODataServerError HTTP/1.1...
  PrimitiveComplexITCase.retrieveBooleanPropertyValueTest:461 » ODataServerError
  PrimitiveComplexITCase.readSimpleProperty:68 » ODataServerError HTTP/1.1 500 I...
  PrimitiveComplexITCase.updatePropertyValue:383 » ODataServerError HTTP/1.1 500...
  PrimitiveComplexITCase.deletePrimitive:107 » ODataServerError HTTP/1.1 500 Int...
  PrimitiveComplexITCase.updatePropertyValueMinimalResponse:402 » ODataServerError
  PrimitiveComplexITCase.deletePrimitiveCollection:132 » ODataServerError HTTP/1...
  PrimitiveComplexITCase.retrieveIntPropertyValueTest:452 » ODataServerError HTT...
  PrimitiveComplexITCase.patchComplexProperty:276 » ODataServerError HTTP/1.1 50...
  PrimitiveComplexITCase.updatePrimitiveCollection:305 » ODataServerError HTTP/1...
  PrimitiveComplexITCase.retrieveDecimalPropertyValueTest:480 » ODataServerError
  PrimitiveComplexITCase.readPropertyValue:348 » ODataServerError HTTP/1.1 500 I...
  PrimitiveComplexITCase.updatePrimitiveProperty:251 » ODataServerError HTTP/1.1...
  PrimitiveComplexITCase.retrieveDatePropertyValueTest:470 » ODataServerError HT...
  PrimitiveComplexITCase.readSimplePropertyContextURL:88 » ODataServerError HTTP...
  PrimitiveComplexITCase.deleteComplex:197 » ODataServerError HTTP/1.1 500 Inter...
  PrimitiveComplexITCase.readNoContentProperty:234 » ODataServerError HTTP/1.1 5...
  PrimitiveComplexITCase.readComplexCollectionCount:436 » ODataServerError HTTP/...
  PrimitiveComplexITCase.readUnknownProperty:218 » ODataServerError HTTP/1.1 500...
  PrimitiveComplexITCase.readComplexPropertyContextURL:177 » ODataServerError HT...
  SystemQueryOptionITCase.searchAndFilterWithTopSkipOrderByAndServerSidePaging:152 » ODataServerError
  SystemQueryOptionITCase.basicSearchPhrase:326 » ODataServerError HTTP/1.1 500 ...
  SystemQueryOptionITCase.nextLinkFormatWithClientPageSize:266 » ODataServerError
  SystemQueryOptionITCase.nextLinkFormat:206 » ODataServerError HTTP/1.1 500 Int...
  SystemQueryOptionITCase.basicSearch:313 » ODataServerError HTTP/1.1 500 Intern...
  SystemQueryOptionITCase.topSimple:80 » ODataServerError HTTP/1.1 500 Internal ...
  SystemQueryOptionITCase.skipSimple:99 » ODataServerError HTTP/1.1 500 Internal...
  SystemQueryOptionITCase.andSearch:338 » ODataServerError HTTP/1.1 500 Internal...
  SystemQueryOptionITCase.negativeTop:298 » ODataServerError HTTP/1.1 500 Intern...
  SystemQueryOptionITCase.negativeSkip:282 » ODataServerError HTTP/1.1 500 Inter...
  SystemQueryOptionITCase.skipNothing:133 » ODataServerError HTTP/1.1 500 Intern...
  SystemQueryOptionITCase.orSearch:350 » ODataServerError HTTP/1.1 500 Internal ...
  SystemQueryOptionITCase.serverSidePagingCount:65 » ODataServerError HTTP/1.1 5...
  SystemQueryOptionITCase.topNothing:119 » ODataServerError HTTP/1.1 500 Interna...
  SystemQueryOptionITCase.nextLinkFormatWithQueryOptions:231 » ODataServerError ...
  SystemQueryOptionITCase.countSimple:50 » ODataServerError HTTP/1.1 500 Interna...
  SystemQueryOptionITCase.searchAndFilterWithTopSkipOrderByAndServerSidePaging:152 » ODataServerError
  SystemQueryOptionITCase.basicSearchPhrase:326 » ODataServerError HTTP/1.1 500 ...
  SystemQueryOptionITCase.nextLinkFormatWithClientPageSize:266 » ODataServerError
  SystemQueryOptionITCase.nextLinkFormat:206 » ODataServerError HTTP/1.1 500 Int...
  SystemQueryOptionITCase.basicSearch:313 » ODataServerError HTTP/1.1 500 Intern...
  SystemQueryOptionITCase.topSimple:80 » ODataServerError HTTP/1.1 500 Internal ...
  SystemQueryOptionITCase.skipSimple:99 » ODataServerError HTTP/1.1 500 Internal...
  SystemQueryOptionITCase.andSearch:338 » ODataServerError HTTP/1.1 500 Internal...
  SystemQueryOptionITCase.negativeTop:298 » ODataServerError HTTP/1.1 500 Intern...
  SystemQueryOptionITCase.negativeSkip:282 » ODataServerError HTTP/1.1 500 Inter...
  SystemQueryOptionITCase.skipNothing:133 » ODataServerError HTTP/1.1 500 Intern...
  SystemQueryOptionITCase.orSearch:350 » ODataServerError HTTP/1.1 500 Internal ...
  SystemQueryOptionITCase.serverSidePagingCount:65 » ODataServerError HTTP/1.1 5...
  SystemQueryOptionITCase.topNothing:119 » ODataServerError HTTP/1.1 500 Interna...
  SystemQueryOptionITCase.nextLinkFormatWithQueryOptions:231 » ODataServerError ...
  SystemQueryOptionITCase.countSimple:50 » ODataServerError HTTP/1.1 500 Interna...
  BasicAsyncITCase.batchAsync:72 » IO Server returned HTTP response code: 500 fo...
  BasicAsyncITCase.asyncChangesetViaPost:116 » IO Server returned HTTP response ...
  BasicBoundActionsITCase.boundActionReturningComplexDerivedTypeWithComplexTypeSegInAction:209
» ODataServerError
  BasicBoundActionsITCase.boundActionReturningDerivedTypeWithTypeCastSegInAction:160 » ODataServerError
  BasicBoundActionsITCase.boundActionReturningColComplexTypeWithComplexTypeSegInAction:185
» ODataServerError
  BasicBoundActionsITCase.boundActionReturningCollComplexTypeWithMixedTypes:257 » ODataServerError

Tests run: 916, Failures: 155, Errors: 643, Skipped: 39

[INFO] ------------------------------------------------------------------------
[INFO] Reactor Summary:
[INFO] 
[INFO] Olingo-OData ....................................... SUCCESS [  3.960 s]
[INFO] odata-lib .......................................... SUCCESS [  0.478 s]
[INFO] odata-commons-api .................................. SUCCESS [  7.464 s]
[INFO] odata-commons-core ................................. SUCCESS [  8.153 s]
[INFO] odata-client-api ................................... SUCCESS [  5.020 s]
[INFO] odata-client-core .................................. SUCCESS [ 10.683 s]
[INFO] odata-server-api ................................... SUCCESS [  3.726 s]
[INFO] odata-server-core .................................. SUCCESS [ 11.357 s]
[INFO] odata-server-core-ext .............................. SUCCESS [ 12.414 s]
[INFO] odata-server-tecsvc ................................ SUCCESS [  8.881 s]
[INFO] odata-server-test .................................. SUCCESS [ 13.822 s]
[INFO] odata-ext .......................................... SUCCESS [  0.302 s]
[INFO] odata-client-proxy ................................. SUCCESS [  2.644 s]
[INFO] pojogen-maven-plugin ............................... SUCCESS [ 30.697 s]
[INFO] odata-client-android ............................... SUCCESS [  3.390 s]
[INFO] odata-fit .......................................... FAILURE [ 50.540 s]
[INFO] odata-dist ......................................... SKIPPED
[INFO] Olingo-OData-Client-for-Android .................... SKIPPED
[INFO] Olingo-OData-Client-for-Java ....................... SKIPPED
[INFO] Olingo-OData-Server-for-Java ....................... SKIPPED
[INFO] Olingo-OData-Server-Extension-for-Java ............. SKIPPED
[INFO] Olingo-OData-JavaDoc ............................... SKIPPED
[INFO] odata-samples ...................................... SKIPPED
[INFO] odata-server-sample ................................ SKIPPED
[INFO] odata-server-osgi-sample ........................... SKIPPED
[INFO] odata-client-sample ................................ SKIPPED
[INFO] ------------------------------------------------------------------------
[INFO] BUILD FAILURE
[INFO] ------------------------------------------------------------------------
[INFO] Total time: 02:56 min
[INFO] Finished at: 2018-05-23T10:09:42Z
[INFO] Final Memory: 234M/4072M
[INFO] ------------------------------------------------------------------------
[ERROR] Failed to execute goal org.apache.maven.plugins:maven-surefire-plugin:2.17:test (default-test)
on project odata-fit: There are test failures.
[ERROR] 
[ERROR] Please refer to <https://builds.apache.org/job/olingo-odata4-all-profiles/ws/fit/target/surefire-reports>
for the individual test results.
[ERROR] -> [Help 1]
[ERROR] 
[ERROR] To see the full stack trace of the errors, re-run Maven with the -e switch.
[ERROR] Re-run Maven using the -X switch to enable full debug logging.
[ERROR] 
[ERROR] For more information about the errors and possible solutions, please read the following
articles:
[ERROR] [Help 1] http://cwiki.apache.org/confluence/display/MAVEN/MojoFailureException
[ERROR] 
[ERROR] After correcting the problems, you can resume the build with the command
[ERROR]   mvn <goals> -rf :odata-fit
Build step 'Invoke top-level Maven targets' marked build as failure
Not sending mail to unregistered user archana.rai@sap.com
Not sending mail to unregistered user ramya.vasanth@sap.com

Mime
View raw message