olingo-commits mailing list archives

Site index · List index
Message view « Date » · « Thread »
Top « Date » · « Thread »
From Apache Jenkins Server <jenk...@builds.apache.org>
Subject Build failed in Jenkins: olingo-odata2-quality #808
Date Mon, 09 Apr 2018 08:03:49 GMT
See <https://builds.apache.org/job/olingo-odata2-quality/808/display/redirect?page=changes>

Changes:

[archana.rai] [OLINGO-1253]Client Module for Olingo v2

------------------------------------------
[...truncated 100.33 KB...]
[INFO] 21 resources included (use -debug for more details)
Compiler warnings:
  WARNING:  'org.apache.xerces.jaxp.SAXParserImpl: Property 'http://javax.xml.XMLConstants/property/accessExternalDTD'
is not recognized.'
[INFO] 
[INFO] --- apache-rat-plugin:0.9:check (rat-check) @ olingo-odata2-client-api ---
[INFO] 51 implicit excludes (use -debug for more details).
[INFO] Exclude: **/MANIFEST.MF
[INFO] Exclude: .gitignore
[INFO] Exclude: .git/**
[INFO] Exclude: bin/**
[INFO] Exclude: **/*.project
[INFO] Exclude: **/*.classpath
[INFO] Exclude: **/*.json
[INFO] Exclude: **/*.batch
[INFO] Exclude: **/NOTICE
[INFO] Exclude: **/DEPENDENCIES
[INFO] Exclude: **/goal.txt
[INFO] Exclude: **/target/**
[INFO] Exclude: **/*.iml
[INFO] Exclude: .repository/**
[INFO] 21 resources included (use -debug for more details)
Compiler warnings:
  WARNING:  'org.apache.xerces.jaxp.SAXParserImpl: Property 'http://javax.xml.XMLConstants/property/accessExternalDTD'
is not recognized.'
[INFO] Rat check: Summary of files. Unapproved: 0 unknown: 0 generated: 0 approved: 21 licence.
[INFO] 
[INFO] --- maven-jar-plugin:2.3.2:jar (default-jar) @ olingo-odata2-client-api ---
[INFO] Building jar: <https://builds.apache.org/job/olingo-odata2-quality/ws/odata2-lib/odata-client-api/target/olingo-odata2-client-api-2.0.11-SNAPSHOT.jar>
[INFO] 
[INFO] --- maven-site-plugin:3.2:attach-descriptor (attach-descriptor) @ olingo-odata2-client-api
---
[INFO] 
[INFO] --- maven-source-plugin:2.2.1:jar-no-fork (attach-sources) @ olingo-odata2-client-api
---
[INFO] Building jar: <https://builds.apache.org/job/olingo-odata2-quality/ws/odata2-lib/odata-client-api/target/olingo-odata2-client-api-2.0.11-SNAPSHOT-sources.jar>
[INFO] 
[INFO] --- maven-checkstyle-plugin:2.10:check (checkstyle) @ olingo-odata2-client-api ---
[INFO] Starting audit...
<https://builds.apache.org/job/olingo-odata2-quality/ws/odata2-lib/odata-client-api/src/main/java/org/apache/olingo/odata2/client/api/ep/DeserializerMetadataProviderInterface.java>:23:8:
Unused import - org.apache.olingo.odata2.api.edm.Edm.
<https://builds.apache.org/job/olingo-odata2-quality/ws/odata2-lib/odata-client-api/src/main/java/org/apache/olingo/odata2/client/api/ep/DeserializerProperties.java>:25:8:
Unused import - org.apache.olingo.odata2.api.ep.EntityProvider.
<https://builds.apache.org/job/olingo-odata2-quality/ws/odata2-lib/odata-client-api/src/main/java/org/apache/olingo/odata2/client/api/ep/DeserializerProperties.java>:26:8:
Unused import - org.apache.olingo.odata2.api.ep.EntityProviderException.
<https://builds.apache.org/job/olingo-odata2-quality/ws/odata2-lib/odata-client-api/src/main/java/org/apache/olingo/odata2/client/api/ep/DeserializerProperties.java>:27:8:
Unused import - org.apache.olingo.odata2.api.ep.EntityProviderReadProperties.
<https://builds.apache.org/job/olingo-odata2-quality/ws/odata2-lib/odata-client-api/src/main/java/org/apache/olingo/odata2/client/api/uri/EdmURIBuilder.java>:22:8:
Unused import - java.util.List.
<https://builds.apache.org/job/olingo-odata2-quality/ws/odata2-lib/odata-client-api/src/main/java/org/apache/olingo/odata2/client/api/edm/EdmUsing.java>:25:8:
Unused import - org.apache.olingo.odata2.api.edm.provider.AnnotationAttribute.
<https://builds.apache.org/job/olingo-odata2-quality/ws/odata2-lib/odata-client-api/src/main/java/org/apache/olingo/odata2/client/api/edm/EdmUsing.java>:26:8:
Unused import - org.apache.olingo.odata2.api.edm.provider.AnnotationElement.
<https://builds.apache.org/job/olingo-odata2-quality/ws/odata2-lib/odata-client-api/src/main/java/org/apache/olingo/odata2/client/api/edm/EdmSchema.java>:22:8:
Unused import - org.apache.olingo.odata2.api.edm.provider.Using.
Audit done.

[INFO] 
[INFO] --- maven-install-plugin:2.3.1:install (default-install) @ olingo-odata2-client-api
---
[INFO] Installing <https://builds.apache.org/job/olingo-odata2-quality/ws/odata2-lib/odata-client-api/target/olingo-odata2-client-api-2.0.11-SNAPSHOT.jar>
to /home/jenkins/.m2/repository/org/apache/olingo/olingo-odata2-client-api/2.0.11-SNAPSHOT/olingo-odata2-client-api-2.0.11-SNAPSHOT.jar
[INFO] Installing <https://builds.apache.org/job/olingo-odata2-quality/ws/odata2-lib/odata-client-api/pom.xml>
to /home/jenkins/.m2/repository/org/apache/olingo/olingo-odata2-client-api/2.0.11-SNAPSHOT/olingo-odata2-client-api-2.0.11-SNAPSHOT.pom
[INFO] Installing <https://builds.apache.org/job/olingo-odata2-quality/ws/odata2-lib/odata-client-api/target/olingo-odata2-client-api-2.0.11-SNAPSHOT-sources.jar>
to /home/jenkins/.m2/repository/org/apache/olingo/olingo-odata2-client-api/2.0.11-SNAPSHOT/olingo-odata2-client-api-2.0.11-SNAPSHOT-sources.jar
[INFO] 
[INFO] ------------------------------------------------------------------------
[INFO] Building olingo-odata2-client-core 2.0.11-SNAPSHOT
[INFO] ------------------------------------------------------------------------
[INFO] 
[INFO] --- maven-clean-plugin:2.5:clean (default-clean) @ olingo-odata2-client-core ---
[INFO] 
[INFO] --- buildnumber-maven-plugin:1.2:create (default) @ olingo-odata2-client-core ---
[INFO] 
[INFO] --- maven-remote-resources-plugin:1.5:process (default) @ olingo-odata2-client-core
---
[INFO] 
[INFO] --- maven-resources-plugin:2.6:resources (default-resources) @ olingo-odata2-client-core
---
[INFO] Using 'UTF-8' encoding to copy filtered resources.
[INFO] skip non existing resourceDirectory <https://builds.apache.org/job/olingo-odata2-quality/ws/odata2-lib/odata-client-core/src/main/resources>
[INFO] Copying 3 resources
[INFO] 
[INFO] --- maven-compiler-plugin:2.3.2:compile (default-compile) @ olingo-odata2-client-core
---
[INFO] Compiling 60 source files to <https://builds.apache.org/job/olingo-odata2-quality/ws/odata2-lib/odata-client-core/target/classes>
[INFO] 
[INFO] --- maven-bundle-plugin:2.3.7:manifest (bundle-manifest) @ olingo-odata2-client-core
---
[INFO] 
[INFO] --- maven-resources-plugin:2.6:testResources (default-testResources) @ olingo-odata2-client-core
---
[INFO] Using 'UTF-8' encoding to copy filtered resources.
[INFO] Copying 47 resources
[INFO] Copying 3 resources
[INFO] 
[INFO] --- maven-compiler-plugin:2.3.2:testCompile (default-testCompile) @ olingo-odata2-client-core
---
[INFO] Compiling 36 source files to <https://builds.apache.org/job/olingo-odata2-quality/ws/odata2-lib/odata-client-core/target/test-classes>
[INFO] 
[INFO] --- maven-surefire-plugin:2.12.4:test (default-test) @ olingo-odata2-client-core ---
[INFO] Surefire report directory: <https://builds.apache.org/job/olingo-odata2-quality/ws/odata2-lib/odata-client-core/target/surefire-reports>

-------------------------------------------------------
 T E S T S
-------------------------------------------------------
Running org.apache.olingo.odata2.client.core.ep.JSON_XMLErrorConsumerTest
SLF4J: Failed to load class "org.slf4j.impl.StaticLoggerBinder".
SLF4J: Defaulting to no-operation (NOP) logger implementation
SLF4J: See http://www.slf4j.org/codes.html#StaticLoggerBinder for further details.
Tests run: 2, Failures: 0, Errors: 0, Skipped: 0, Time elapsed: 0.193 sec
Running org.apache.olingo.odata2.client.core.ep.DeserializerPropertiesTest
Tests run: 2, Failures: 0, Errors: 0, Skipped: 0, Time elapsed: 0.001 sec
Running org.apache.olingo.odata2.client.core.ep.serializer.AtomFeedSerializerTest
Tests run: 42, Failures: 0, Errors: 0, Skipped: 0, Time elapsed: 2.814 sec
Running org.apache.olingo.odata2.client.core.ep.serializer.AtomEntrySerializerTest
Tests run: 130, Failures: 0, Errors: 0, Skipped: 0, Time elapsed: 2.708 sec
Running org.apache.olingo.odata2.client.core.ep.serializer.JsonFeedEntitySerializerTest
Tests run: 24, Failures: 0, Errors: 0, Skipped: 0, Time elapsed: 0.21 sec
Running org.apache.olingo.odata2.client.core.ep.serializer.JsonEntryEntitySerializerTest
Tests run: 37, Failures: 0, Errors: 0, Skipped: 0, Time elapsed: 0.351 sec
Running org.apache.olingo.odata2.client.core.ep.ProducerConsumerIntegrationTest
Tests run: 18, Failures: 0, Errors: 0, Skipped: 0, Time elapsed: 0.176 sec
Running org.apache.olingo.odata2.client.core.ep.SerializerPropertiesTest
Tests run: 4, Failures: 0, Errors: 0, Skipped: 0, Time elapsed: 0.001 sec
Running org.apache.olingo.odata2.client.core.ep.deserializer.JsonFeedDeserializerTest
Tests run: 29, Failures: 0, Errors: 0, Skipped: 0, Time elapsed: 0.263 sec
Running org.apache.olingo.odata2.client.core.ep.deserializer.JsonEntryDeserializerTest
Tests run: 21, Failures: 0, Errors: 0, Skipped: 0, Time elapsed: 0.219 sec
Running org.apache.olingo.odata2.client.core.ep.deserializer.XmlMetadataAssociationTest
Tests run: 11, Failures: 0, Errors: 0, Skipped: 0, Time elapsed: 0.018 sec
Running org.apache.olingo.odata2.client.core.ep.deserializer.JsonPropertyDeserializerTest
Tests run: 46, Failures: 0, Errors: 0, Skipped: 0, Time elapsed: 0.51 sec
Running org.apache.olingo.odata2.client.core.ep.deserializer.XmlFeedDeserializerTest
Tests run: 14, Failures: 0, Errors: 0, Skipped: 0, Time elapsed: 0.534 sec
Running org.apache.olingo.odata2.client.core.ep.deserializer.XmlEntityDeserializerTest
Tests run: 128, Failures: 0, Errors: 0, Skipped: 0, Time elapsed: 3.631 sec
Running org.apache.olingo.odata2.client.core.ep.deserializer.JsonEntryDeepInsertFeedTest
Tests run: 5, Failures: 0, Errors: 0, Skipped: 0, Time elapsed: 0.043 sec
Running org.apache.olingo.odata2.client.core.ep.deserializer.XmlMetadataDeserializerTest
Tests run: 98, Failures: 0, Errors: 0, Skipped: 0, Time elapsed: 0.095 sec
Running org.apache.olingo.odata2.client.core.ep.deserializer.JsonEntryDeepInsertEntryTest
Tests run: 4, Failures: 0, Errors: 0, Skipped: 0, Time elapsed: 0.048 sec
Running org.apache.olingo.odata2.client.core.ep.deserializer.JsonErrorDocumentDeserializerTest
Tests run: 14, Failures: 0, Errors: 0, Skipped: 0, Time elapsed: 0.005 sec
Running org.apache.olingo.odata2.client.core.ep.deserializer.XmlErrorDocumentTest
Tests run: 14, Failures: 0, Errors: 0, Skipped: 0, Time elapsed: 0.005 sec
Running org.apache.olingo.odata2.client.core.ep.deserializer.XMLMetadataFunctionImportDeserializerTest
Tests run: 6, Failures: 0, Errors: 0, Skipped: 0, Time elapsed: 0.005 sec
Running org.apache.olingo.odata2.client.core.uri.UriInfoTest
Tests run: 4, Failures: 0, Errors: 0, Skipped: 0, Time elapsed: 0.013 sec
Running org.apache.olingo.odata2.client.core.uri.UriParserTest
Tests run: 82, Failures: 0, Errors: 0, Skipped: 0, Time elapsed: 0.699 sec
Running org.apache.olingo.odata2.client.core.uri.UriBuilderTest
Tests run: 50, Failures: 0, Errors: 0, Skipped: 0, Time elapsed: 0.014 sec
Running org.apache.olingo.odata2.client.core.uri.UriBuilderIntegrationTest
Tests run: 2, Failures: 0, Errors: 0, Skipped: 0, Time elapsed: 0.016 sec
Running org.apache.olingo.odata2.client.core.uri.EdmUriBuilderTest
Tests run: 73, Failures: 0, Errors: 0, Skipped: 0, Time elapsed: 0.515 sec
Running org.apache.olingo.odata2.client.core.edm.impl.EdmAssociationImplTest
Tests run: 1, Failures: 0, Errors: 0, Skipped: 0, Time elapsed: 0 sec
Running org.apache.olingo.odata2.client.core.edm.impl.EdmEntityImplTest
Tests run: 4, Failures: 0, Errors: 0, Skipped: 0, Time elapsed: 0.001 sec
Running org.apache.olingo.odata2.client.core.edm.impl.EdmOnDeleteImplTest
Tests run: 1, Failures: 0, Errors: 0, Skipped: 0, Time elapsed: 0 sec
Running org.apache.olingo.odata2.client.core.edm.impl.EdmMappingImplTest
Tests run: 1, Failures: 0, Errors: 0, Skipped: 0, Time elapsed: 0 sec
Running org.apache.olingo.odata2.client.core.edm.impl.EdmAnnotationImplTest
Tests run: 3, Failures: 0, Errors: 0, Skipped: 0, Time elapsed: 0 sec
Running org.apache.olingo.odata2.client.core.edm.impl.EdmDocumentationImplTest
Tests run: 1, Failures: 0, Errors: 0, Skipped: 0, Time elapsed: 0 sec

Results :

Tests run: 871, Failures: 0, Errors: 0, Skipped: 0

[INFO] 
[INFO] --- apache-rat-plugin:0.9:rat (rat-check) @ olingo-odata2-client-core ---
[INFO] 51 implicit excludes (use -debug for more details).
[INFO] Exclude: **/MANIFEST.MF
[INFO] Exclude: .gitignore
[INFO] Exclude: .git/**
[INFO] Exclude: bin/**
[INFO] Exclude: **/*.project
[INFO] Exclude: **/*.classpath
[INFO] Exclude: **/*.json
[INFO] Exclude: **/*.batch
[INFO] Exclude: **/NOTICE
[INFO] Exclude: **/DEPENDENCIES
[INFO] Exclude: **/goal.txt
[INFO] Exclude: **/target/**
[INFO] Exclude: **/*.iml
[INFO] Exclude: .repository/**
[INFO] 115 resources included (use -debug for more details)
Compiler warnings:
  WARNING:  'org.apache.xerces.jaxp.SAXParserImpl: Property 'http://javax.xml.XMLConstants/property/accessExternalDTD'
is not recognized.'
[INFO] 
[INFO] --- apache-rat-plugin:0.9:check (rat-check) @ olingo-odata2-client-core ---
[INFO] 51 implicit excludes (use -debug for more details).
[INFO] Exclude: **/MANIFEST.MF
[INFO] Exclude: .gitignore
[INFO] Exclude: .git/**
[INFO] Exclude: bin/**
[INFO] Exclude: **/*.project
[INFO] Exclude: **/*.classpath
[INFO] Exclude: **/*.json
[INFO] Exclude: **/*.batch
[INFO] Exclude: **/NOTICE
[INFO] Exclude: **/DEPENDENCIES
[INFO] Exclude: **/goal.txt
[INFO] Exclude: **/target/**
[INFO] Exclude: **/*.iml
[INFO] Exclude: .repository/**
[INFO] 115 resources included (use -debug for more details)
Compiler warnings:
  WARNING:  'org.apache.xerces.jaxp.SAXParserImpl: Property 'http://javax.xml.XMLConstants/property/accessExternalDTD'
is not recognized.'
[INFO] Rat check: Summary of files. Unapproved: 14 unknown: 14 generated: 0 approved: 101
licence.
[INFO] ------------------------------------------------------------------------
[INFO] Reactor Summary:
[INFO] 
[INFO] olingo-odata2-parent ............................... SUCCESS [  2.954 s]
[INFO] olingo-odata2-lib .................................. SUCCESS [  0.409 s]
[INFO] olingo-odata2-api .................................. SUCCESS [  5.055 s]
[INFO] olingo-odata2-api-annotation ....................... SUCCESS [  1.127 s]
[INFO] olingo-odata2-testutil ............................. SUCCESS [  2.537 s]
[INFO] olingo-odata2-core ................................. SUCCESS [ 29.542 s]
[INFO] olingo-odata2-ref .................................. SUCCESS [  3.566 s]
[INFO] olingo-odata2-fit .................................. SUCCESS [05:34 min]
[INFO] olingo-odata2-ref-web .............................. SUCCESS [  1.192 s]
[INFO] olingo-odata2-client-api ........................... SUCCESS [  1.127 s]
[INFO] olingo-odata2-client-core .......................... FAILURE [ 31.816 s]
[INFO] olingo-odata2-jpa-processor ........................ SKIPPED
[INFO] olingo-odata2-jpa-processor-api .................... SKIPPED
[INFO] olingo-odata2-jpa-processor-core ................... SKIPPED
[INFO] olingo-odata2-jpa-processor-ref .................... SKIPPED
[INFO] olingo-odata2-jpa-processor-ref-web ................ SKIPPED
[INFO] olingo-odata2-annotation-processor ................. SKIPPED
[INFO] olingo-odata2-annotation-processor-api ............. SKIPPED
[INFO] olingo-odata2-annotation-processor-core ............ SKIPPED
[INFO] olingo-odata2-annotation-processor-ref ............. SKIPPED
[INFO] olingo-odata2-annotation-processor-ref-web ......... SKIPPED
[INFO] olingo-odata2-dist ................................. SKIPPED
[INFO] olingo-odata2-dist-lib ............................. SKIPPED
[INFO] olingo-odata2-dist-jpa ............................. SKIPPED
[INFO] olingo-odata2-dist-janos ........................... SKIPPED
[INFO] olingo-odata2-dist-ref ............................. SKIPPED
[INFO] olingo-odata2-dist-javadoc ......................... SKIPPED
[INFO] olingo-odata2-sample ............................... SKIPPED
[INFO] olingo-odata2-sample-cars-service-archetype ........ SKIPPED
[INFO] olingo-odata2-sample-cars-annotation-archetype ..... SKIPPED
[INFO] olingo-odata2-sample-cars-jpa-archetype ............ SKIPPED
[INFO] ------------------------------------------------------------------------
[INFO] BUILD FAILURE
[INFO] ------------------------------------------------------------------------
[INFO] Total time: 06:54 min
[INFO] Finished at: 2018-04-09T08:03:47Z
[INFO] Final Memory: 128M/3203M
[INFO] ------------------------------------------------------------------------
[ERROR] Failed to execute goal org.apache.rat:apache-rat-plugin:0.9:check (rat-check) on project
olingo-odata2-client-core: Too many files with unapproved license: 14 See RAT report in: <https://builds.apache.org/job/olingo-odata2-quality/ws/odata2-lib/odata-client-core/target/rat.txt>
-> [Help 1]
[ERROR] 
[ERROR] To see the full stack trace of the errors, re-run Maven with the -e switch.
[ERROR] Re-run Maven using the -X switch to enable full debug logging.
[ERROR] 
[ERROR] For more information about the errors and possible solutions, please read the following
articles:
[ERROR] [Help 1] http://cwiki.apache.org/confluence/display/MAVEN/MojoFailureException
[ERROR] 
[ERROR] After correcting the problems, you can resume the build with the command
[ERROR]   mvn <goals> -rf :olingo-odata2-client-core
Build step 'Invoke top-level Maven targets' marked build as failure
Not sending mail to unregistered user archana.rai@sap.com

Mime
View raw message