olingo-commits mailing list archives

Site index · List index
Message view « Date » · « Thread »
Top « Date » · « Thread »
From Apache Jenkins Server <jenk...@builds.apache.org>
Subject Build failed in Jenkins: olingo-odata2-quality #807
Date Mon, 09 Apr 2018 07:48:41 GMT
See <https://builds.apache.org/job/olingo-odata2-quality/807/display/redirect?page=changes>

Changes:

[archana.rai] [OLINGO-1253]Client Module for Olingo v2

------------------------------------------
[...truncated 84.77 KB...]
[INFO] Exclude: **/*.batch
[INFO] Exclude: **/NOTICE
[INFO] Exclude: **/DEPENDENCIES
[INFO] Exclude: **/goal.txt
[INFO] Exclude: **/target/**
[INFO] Exclude: **/*.iml
[INFO] Exclude: .repository/**
[INFO] 73 resources included (use -debug for more details)
Compiler warnings:
  WARNING:  'org.apache.xerces.jaxp.SAXParserImpl: Property 'http://javax.xml.XMLConstants/property/accessExternalDTD'
is not recognized.'
[INFO] Rat check: Summary of files. Unapproved: 0 unknown: 0 generated: 0 approved: 72 licence.
[INFO] 
[INFO] --- maven-jar-plugin:2.3.2:jar (default-jar) @ olingo-odata2-fit ---
[INFO] Building jar: <https://builds.apache.org/job/olingo-odata2-quality/ws/odata2-lib/odata-fit/target/olingo-odata2-fit-2.0.11-SNAPSHOT.jar>
[INFO] 
[INFO] --- maven-site-plugin:3.2:attach-descriptor (attach-descriptor) @ olingo-odata2-fit
---
[INFO] 
[INFO] --- maven-source-plugin:2.2.1:jar-no-fork (attach-sources) @ olingo-odata2-fit ---
[INFO] Building jar: <https://builds.apache.org/job/olingo-odata2-quality/ws/odata2-lib/odata-fit/target/olingo-odata2-fit-2.0.11-SNAPSHOT-sources.jar>
[INFO] 
[INFO] --- maven-checkstyle-plugin:2.10:check (checkstyle) @ olingo-odata2-fit ---
[INFO] Starting audit...
Audit done.

[INFO] 
[INFO] --- maven-install-plugin:2.3.1:install (default-install) @ olingo-odata2-fit ---
[INFO] Installing <https://builds.apache.org/job/olingo-odata2-quality/ws/odata2-lib/odata-fit/target/olingo-odata2-fit-2.0.11-SNAPSHOT.jar>
to /home/jenkins/.m2/repository/org/apache/olingo/olingo-odata2-fit/2.0.11-SNAPSHOT/olingo-odata2-fit-2.0.11-SNAPSHOT.jar
[INFO] Installing <https://builds.apache.org/job/olingo-odata2-quality/ws/odata2-lib/odata-fit/pom.xml>
to /home/jenkins/.m2/repository/org/apache/olingo/olingo-odata2-fit/2.0.11-SNAPSHOT/olingo-odata2-fit-2.0.11-SNAPSHOT.pom
[INFO] Installing <https://builds.apache.org/job/olingo-odata2-quality/ws/odata2-lib/odata-fit/target/olingo-odata2-fit-2.0.11-SNAPSHOT-sources.jar>
to /home/jenkins/.m2/repository/org/apache/olingo/olingo-odata2-fit/2.0.11-SNAPSHOT/olingo-odata2-fit-2.0.11-SNAPSHOT-sources.jar
[INFO] 
[INFO] ------------------------------------------------------------------------
[INFO] Building olingo-odata2-ref-web 2.0.11-SNAPSHOT
[INFO] ------------------------------------------------------------------------
[INFO] 
[INFO] --- maven-clean-plugin:2.5:clean (default-clean) @ olingo-odata2-ref-web ---
[INFO] Deleting <https://builds.apache.org/job/olingo-odata2-quality/ws/odata2-lib/odata-web/target>
[INFO] 
[INFO] --- buildnumber-maven-plugin:1.2:create (default) @ olingo-odata2-ref-web ---
[INFO] 
[INFO] --- maven-remote-resources-plugin:1.5:process (default) @ olingo-odata2-ref-web ---
[INFO] 
[INFO] --- maven-resources-plugin:2.6:resources (default-resources) @ olingo-odata2-ref-web
---
[INFO] Using 'UTF-8' encoding to copy filtered resources.
[INFO] Copying 1 resource to ../olingo-odata2-ref-web-2.0.11-SNAPSHOT/gen
[INFO] Copying 1 resource
[INFO] Copying 3 resources
[INFO] 
[INFO] --- maven-compiler-plugin:2.3.2:compile (default-compile) @ olingo-odata2-ref-web ---
[INFO] No sources to compile
[INFO] 
[INFO] --- maven-resources-plugin:2.6:testResources (default-testResources) @ olingo-odata2-ref-web
---
[INFO] Using 'UTF-8' encoding to copy filtered resources.
[INFO] skip non existing resourceDirectory <https://builds.apache.org/job/olingo-odata2-quality/ws/odata2-lib/odata-web/src/test/resources>
[INFO] Copying 3 resources
[INFO] 
[INFO] --- maven-compiler-plugin:2.3.2:testCompile (default-testCompile) @ olingo-odata2-ref-web
---
[INFO] No sources to compile
[INFO] 
[INFO] --- maven-surefire-plugin:2.12.4:test (default-test) @ olingo-odata2-ref-web ---
[INFO] 
[INFO] --- apache-rat-plugin:0.9:rat (rat-check) @ olingo-odata2-ref-web ---
[INFO] 51 implicit excludes (use -debug for more details).
[INFO] Exclude: **/MANIFEST.MF
[INFO] Exclude: .gitignore
[INFO] Exclude: .git/**
[INFO] Exclude: bin/**
[INFO] Exclude: **/*.project
[INFO] Exclude: **/*.classpath
[INFO] Exclude: **/*.json
[INFO] Exclude: **/*.batch
[INFO] Exclude: **/NOTICE
[INFO] Exclude: **/DEPENDENCIES
[INFO] Exclude: **/goal.txt
[INFO] Exclude: **/target/**
[INFO] Exclude: **/*.iml
[INFO] Exclude: .repository/**
[INFO] 6 resources included (use -debug for more details)
Compiler warnings:
  WARNING:  'org.apache.xerces.jaxp.SAXParserImpl: Property 'http://javax.xml.XMLConstants/property/accessExternalDTD'
is not recognized.'
[INFO] 
[INFO] --- apache-rat-plugin:0.9:check (rat-check) @ olingo-odata2-ref-web ---
[INFO] 51 implicit excludes (use -debug for more details).
[INFO] Exclude: **/MANIFEST.MF
[INFO] Exclude: .gitignore
[INFO] Exclude: .git/**
[INFO] Exclude: bin/**
[INFO] Exclude: **/*.project
[INFO] Exclude: **/*.classpath
[INFO] Exclude: **/*.json
[INFO] Exclude: **/*.batch
[INFO] Exclude: **/NOTICE
[INFO] Exclude: **/DEPENDENCIES
[INFO] Exclude: **/goal.txt
[INFO] Exclude: **/target/**
[INFO] Exclude: **/*.iml
[INFO] Exclude: .repository/**
[INFO] 6 resources included (use -debug for more details)
Compiler warnings:
  WARNING:  'org.apache.xerces.jaxp.SAXParserImpl: Property 'http://javax.xml.XMLConstants/property/accessExternalDTD'
is not recognized.'
[INFO] Rat check: Summary of files. Unapproved: 0 unknown: 0 generated: 0 approved: 5 licence.
[INFO] 
[INFO] --- maven-war-plugin:2.4:war (default-war) @ olingo-odata2-ref-web ---
[INFO] Packaging webapp
[INFO] Assembling webapp [olingo-odata2-ref-web] in [<https://builds.apache.org/job/olingo-odata2-quality/ws/odata2-lib/odata-web/target/olingo-odata2-ref-web-2.0.11-SNAPSHOT]>
[INFO] Processing war project
[INFO] Copying webapp webResources [<https://builds.apache.org/job/olingo-odata2-quality/ws/odata2-lib/odata-web/target/maven-shared-archive-resources]>
to [<https://builds.apache.org/job/olingo-odata2-quality/ws/odata2-lib/odata-web/target/olingo-odata2-ref-web-2.0.11-SNAPSHOT]>
[INFO] Copying webapp resources [<https://builds.apache.org/job/olingo-odata2-quality/ws/odata2-lib/odata-web/src/main/webapp]>
[INFO] Webapp assembled in [51 msecs]
[INFO] Building war: <https://builds.apache.org/job/olingo-odata2-quality/ws/odata2-lib/odata-web/target/olingo-odata2-ref-web-2.0.11-SNAPSHOT.war>
[INFO] 
[INFO] --- maven-site-plugin:3.2:attach-descriptor (attach-descriptor) @ olingo-odata2-ref-web
---
[INFO] 
[INFO] --- maven-source-plugin:2.2.1:jar-no-fork (attach-sources) @ olingo-odata2-ref-web
---
[INFO] Building jar: <https://builds.apache.org/job/olingo-odata2-quality/ws/odata2-lib/odata-web/target/olingo-odata2-ref-web-2.0.11-SNAPSHOT-sources.jar>
[INFO] 
[INFO] --- maven-checkstyle-plugin:2.10:check (checkstyle) @ olingo-odata2-ref-web ---
[INFO] Starting audit...
Audit done.

[INFO] 
[INFO] --- maven-install-plugin:2.3.1:install (default-install) @ olingo-odata2-ref-web ---
[INFO] Installing <https://builds.apache.org/job/olingo-odata2-quality/ws/odata2-lib/odata-web/target/olingo-odata2-ref-web-2.0.11-SNAPSHOT.war>
to /home/jenkins/.m2/repository/org/apache/olingo/olingo-odata2-ref-web/2.0.11-SNAPSHOT/olingo-odata2-ref-web-2.0.11-SNAPSHOT.war
[INFO] Installing <https://builds.apache.org/job/olingo-odata2-quality/ws/odata2-lib/odata-web/pom.xml>
to /home/jenkins/.m2/repository/org/apache/olingo/olingo-odata2-ref-web/2.0.11-SNAPSHOT/olingo-odata2-ref-web-2.0.11-SNAPSHOT.pom
[INFO] Installing <https://builds.apache.org/job/olingo-odata2-quality/ws/odata2-lib/odata-web/target/olingo-odata2-ref-web-2.0.11-SNAPSHOT-sources.jar>
to /home/jenkins/.m2/repository/org/apache/olingo/olingo-odata2-ref-web/2.0.11-SNAPSHOT/olingo-odata2-ref-web-2.0.11-SNAPSHOT-sources.jar
[INFO] 
[INFO] ------------------------------------------------------------------------
[INFO] Building olingo-odata2-client-api 2.0.11-SNAPSHOT
[INFO] ------------------------------------------------------------------------
[INFO] 
[INFO] --- maven-clean-plugin:2.5:clean (default-clean) @ olingo-odata2-client-api ---
[INFO] Deleting <https://builds.apache.org/job/olingo-odata2-quality/ws/odata2-lib/odata-client-api/target>
[INFO] 
[INFO] --- buildnumber-maven-plugin:1.2:create (default) @ olingo-odata2-client-api ---
[INFO] 
[INFO] --- maven-remote-resources-plugin:1.5:process (default) @ olingo-odata2-client-api
---
[INFO] 
[INFO] --- maven-resources-plugin:2.6:resources (default-resources) @ olingo-odata2-client-api
---
[INFO] Using 'UTF-8' encoding to copy filtered resources.
[INFO] skip non existing resourceDirectory <https://builds.apache.org/job/olingo-odata2-quality/ws/odata2-lib/odata-client-api/src/main/resources>
[INFO] Copying 3 resources
[INFO] 
[INFO] --- maven-compiler-plugin:2.3.2:compile (default-compile) @ olingo-odata2-client-api
---
[INFO] Compiling 20 source files to <https://builds.apache.org/job/olingo-odata2-quality/ws/odata2-lib/odata-client-api/target/classes>
[INFO] 
[INFO] --- maven-bundle-plugin:2.3.7:manifest (bundle-manifest) @ olingo-odata2-client-api
---
[INFO] 
[INFO] --- maven-resources-plugin:2.6:testResources (default-testResources) @ olingo-odata2-client-api
---
[INFO] Using 'UTF-8' encoding to copy filtered resources.
[INFO] skip non existing resourceDirectory <https://builds.apache.org/job/olingo-odata2-quality/ws/odata2-lib/odata-client-api/src/test/resources>
[INFO] Copying 3 resources
[INFO] 
[INFO] --- maven-compiler-plugin:2.3.2:testCompile (default-testCompile) @ olingo-odata2-client-api
---
[INFO] No sources to compile
[INFO] 
[INFO] --- maven-surefire-plugin:2.12.4:test (default-test) @ olingo-odata2-client-api ---
[INFO] 
[INFO] --- apache-rat-plugin:0.9:rat (rat-check) @ olingo-odata2-client-api ---
[INFO] 51 implicit excludes (use -debug for more details).
[INFO] Exclude: **/MANIFEST.MF
[INFO] Exclude: .gitignore
[INFO] Exclude: .git/**
[INFO] Exclude: bin/**
[INFO] Exclude: **/*.project
[INFO] Exclude: **/*.classpath
[INFO] Exclude: **/*.json
[INFO] Exclude: **/*.batch
[INFO] Exclude: **/NOTICE
[INFO] Exclude: **/DEPENDENCIES
[INFO] Exclude: **/goal.txt
[INFO] Exclude: **/target/**
[INFO] Exclude: **/*.iml
[INFO] Exclude: .repository/**
[INFO] 21 resources included (use -debug for more details)
Compiler warnings:
  WARNING:  'org.apache.xerces.jaxp.SAXParserImpl: Property 'http://javax.xml.XMLConstants/property/accessExternalDTD'
is not recognized.'
[INFO] 
[INFO] --- apache-rat-plugin:0.9:check (rat-check) @ olingo-odata2-client-api ---
[INFO] 51 implicit excludes (use -debug for more details).
[INFO] Exclude: **/MANIFEST.MF
[INFO] Exclude: .gitignore
[INFO] Exclude: .git/**
[INFO] Exclude: bin/**
[INFO] Exclude: **/*.project
[INFO] Exclude: **/*.classpath
[INFO] Exclude: **/*.json
[INFO] Exclude: **/*.batch
[INFO] Exclude: **/NOTICE
[INFO] Exclude: **/DEPENDENCIES
[INFO] Exclude: **/goal.txt
[INFO] Exclude: **/target/**
[INFO] Exclude: **/*.iml
[INFO] Exclude: .repository/**
[INFO] 21 resources included (use -debug for more details)
Compiler warnings:
  WARNING:  'org.apache.xerces.jaxp.SAXParserImpl: Property 'http://javax.xml.XMLConstants/property/accessExternalDTD'
is not recognized.'
[INFO] Rat check: Summary of files. Unapproved: 1 unknown: 1 generated: 0 approved: 20 licence.
[INFO] ------------------------------------------------------------------------
[INFO] Reactor Summary:
[INFO] 
[INFO] olingo-odata2-parent ............................... SUCCESS [  3.299 s]
[INFO] olingo-odata2-lib .................................. SUCCESS [  0.452 s]
[INFO] olingo-odata2-api .................................. SUCCESS [  5.440 s]
[INFO] olingo-odata2-api-annotation ....................... SUCCESS [  1.185 s]
[INFO] olingo-odata2-testutil ............................. SUCCESS [  2.776 s]
[INFO] olingo-odata2-core ................................. SUCCESS [ 29.853 s]
[INFO] olingo-odata2-ref .................................. SUCCESS [  3.159 s]
[INFO] olingo-odata2-fit .................................. SUCCESS [05:37 min]
[INFO] olingo-odata2-ref-web .............................. SUCCESS [  1.030 s]
[INFO] olingo-odata2-client-api ........................... FAILURE [  0.880 s]
[INFO] olingo-odata2-client-core .......................... SKIPPED
[INFO] olingo-odata2-jpa-processor ........................ SKIPPED
[INFO] olingo-odata2-jpa-processor-api .................... SKIPPED
[INFO] olingo-odata2-jpa-processor-core ................... SKIPPED
[INFO] olingo-odata2-jpa-processor-ref .................... SKIPPED
[INFO] olingo-odata2-jpa-processor-ref-web ................ SKIPPED
[INFO] olingo-odata2-annotation-processor ................. SKIPPED
[INFO] olingo-odata2-annotation-processor-api ............. SKIPPED
[INFO] olingo-odata2-annotation-processor-core ............ SKIPPED
[INFO] olingo-odata2-annotation-processor-ref ............. SKIPPED
[INFO] olingo-odata2-annotation-processor-ref-web ......... SKIPPED
[INFO] olingo-odata2-dist ................................. SKIPPED
[INFO] olingo-odata2-dist-lib ............................. SKIPPED
[INFO] olingo-odata2-dist-jpa ............................. SKIPPED
[INFO] olingo-odata2-dist-janos ........................... SKIPPED
[INFO] olingo-odata2-dist-ref ............................. SKIPPED
[INFO] olingo-odata2-dist-javadoc ......................... SKIPPED
[INFO] olingo-odata2-sample ............................... SKIPPED
[INFO] olingo-odata2-sample-cars-service-archetype ........ SKIPPED
[INFO] olingo-odata2-sample-cars-annotation-archetype ..... SKIPPED
[INFO] olingo-odata2-sample-cars-jpa-archetype ............ SKIPPED
[INFO] ------------------------------------------------------------------------
[INFO] BUILD FAILURE
[INFO] ------------------------------------------------------------------------
[INFO] Total time: 06:26 min
[INFO] Finished at: 2018-04-09T07:48:39Z
[INFO] Final Memory: 111M/3291M
[INFO] ------------------------------------------------------------------------
[ERROR] Failed to execute goal org.apache.rat:apache-rat-plugin:0.9:check (rat-check) on project
olingo-odata2-client-api: Too many files with unapproved license: 1 See RAT report in: <https://builds.apache.org/job/olingo-odata2-quality/ws/odata2-lib/odata-client-api/target/rat.txt>
-> [Help 1]
[ERROR] 
[ERROR] To see the full stack trace of the errors, re-run Maven with the -e switch.
[ERROR] Re-run Maven using the -X switch to enable full debug logging.
[ERROR] 
[ERROR] For more information about the errors and possible solutions, please read the following
articles:
[ERROR] [Help 1] http://cwiki.apache.org/confluence/display/MAVEN/MojoFailureException
[ERROR] 
[ERROR] After correcting the problems, you can resume the build with the command
[ERROR]   mvn <goals> -rf :olingo-odata2-client-api
Build step 'Invoke top-level Maven targets' marked build as failure
Not sending mail to unregistered user archana.rai@sap.com

Mime
View raw message