olingo-commits mailing list archives

Site index · List index
Message view « Date » · « Thread »
Top « Date » · « Thread »
From Apache Jenkins Server <jenk...@builds.apache.org>
Subject Build failed in Jenkins: olingo-odata2 #1343
Date Sat, 08 Jul 2017 11:24:26 GMT
See <https://builds.apache.org/job/olingo-odata2/1343/display/redirect>

------------------------------------------
[...truncated 713 B...]
Cloning repository https://git-wip-us.apache.org/repos/asf/olingo-odata2.git
 > git init <https://builds.apache.org/job/olingo-odata2/ws/> # timeout=10
Fetching upstream changes from https://git-wip-us.apache.org/repos/asf/olingo-odata2.git
 > git --version # timeout=10
 > git fetch --tags --progress https://git-wip-us.apache.org/repos/asf/olingo-odata2.git +refs/heads/*:refs/remotes/origin/*
 > git config remote.origin.url https://git-wip-us.apache.org/repos/asf/olingo-odata2.git # timeout=10
 > git config --add remote.origin.fetch +refs/heads/*:refs/remotes/origin/* # timeout=10
 > git config remote.origin.url https://git-wip-us.apache.org/repos/asf/olingo-odata2.git # timeout=10
Fetching upstream changes from https://git-wip-us.apache.org/repos/asf/olingo-odata2.git
 > git fetch --tags --progress https://git-wip-us.apache.org/repos/asf/olingo-odata2.git +refs/heads/master:refs/remotes/origin/master
 > git rev-parse origin/master^{commit} # timeout=10
Checking out Revision 220b289c54b17ce449ad1bc80f45f8c41a930083 (origin/master)
 > git config core.sparsecheckout # timeout=10
 > git checkout -f 220b289c54b17ce449ad1bc80f45f8c41a930083
 > git rev-list 220b289c54b17ce449ad1bc80f45f8c41a930083 # timeout=10
[olingo-odata2] $ /home/jenkins/tools/maven/latest3/bin/mvn clean deploy
[INFO] Scanning for projects...
Downloading: https://repo.maven.apache.org/maven2/org/apache/maven/archetype/archetype-packaging/2.2/archetype-packaging-2.2.pom
Progress (1): 1.5 kB                    Downloaded: https://repo.maven.apache.org/maven2/org/apache/maven/archetype/archetype-packaging/2.2/archetype-packaging-2.2.pom (1.5 kB at 4.0 kB/s)
Downloading: https://repo.maven.apache.org/maven2/org/apache/maven/archetype/maven-archetype/2.2/maven-archetype-2.2.pom
Progress (1): 2.1/15 kBProgress (1): 4.9/15 kBProgress (1): 7.7/15 kBProgress (1): 10/15 kB Progress (1): 13/15 kBProgress (1): 15 kB                      Downloaded: https://repo.maven.apache.org/maven2/org/apache/maven/archetype/maven-archetype/2.2/maven-archetype-2.2.pom (15 kB at 720 kB/s)
Downloading: https://repo.maven.apache.org/maven2/org/apache/maven/archetype/archetype-packaging/2.2/archetype-packaging-2.2.jar
Downloading: https://repo.maven.apache.org/maven2/org/codehaus/plexus/plexus-utils/1.1/plexus-utils-1.1.jar
Progress (1): 2.8/169 kBProgress (1): 5.5/169 kBProgress (1): 8.3/169 kBProgress (1): 11/169 kB Progress (1): 14/169 kBProgress (1): 16/169 kBProgress (1): 19/169 kBProgress (1): 22/169 kBProgress (1): 25/169 kBProgress (1): 27/169 kBProgress (1): 30/169 kBProgress (1): 33/169 kBProgress (1): 37/169 kBProgress (1): 41/169 kBProgress (1): 45/169 kBProgress (1): 49/169 kBProgress (1): 53/169 kBProgress (1): 57/169 kBProgress (1): 61/169 kBProgress (1): 66/169 kBProgress (1): 70/169 kBProgress (1): 74/169 kBProgress (1): 78/169 kBProgress (1): 82/169 kBProgress (1): 86/169 kBProgress (1): 90/169 kBProgress (1): 94/169 kBProgress (1): 98/169 kBProgress (1): 102/169 kBProgress (1): 106/169 kBProgress (1): 111/169 kBProgress (1): 115/169 kBProgress (1): 119/169 kBProgress (1): 123/169 kBProgress (1): 127/169 kBProgress (1): 131/169 kBProgress (1): 135/169 kBProgress (1): 139/169 kBProgress (1): 143/169 kBProgress (1): 147/169 kBProgress (1): 152/169 kBProgress (1): 156/169 kBProgress (1): 160/169 kBProgress (1): 164/169 kBProgress (1): 168/169 kBProgress (1): 169 kB    Progress (2): 169 kB | 2.8/7.4 kBProgress (2): 169 kB | 3.4/7.4 kBProgress (2): 169 kB | 6.2/7.4 kBProgress (2): 169 kB | 7.4 kB                                 Downloaded: https://repo.maven.apache.org/maven2/org/codehaus/plexus/plexus-utils/1.1/plexus-utils-1.1.jar (169 kB at 3.6 MB/s)
Downloaded: https://repo.maven.apache.org/maven2/org/apache/maven/archetype/archetype-packaging/2.2/archetype-packaging-2.2.jar (7.4 kB at 148 kB/s)
[INFO] ------------------------------------------------------------------------
[INFO] Reactor Build Order:
[INFO] 
[INFO] olingo-odata2-parent
[INFO] olingo-odata2-lib
[INFO] olingo-odata2-api
[INFO] olingo-odata2-api-annotation
[INFO] olingo-odata2-testutil
[INFO] olingo-odata2-core
[INFO] olingo-odata2-ref
[INFO] olingo-odata2-fit
[INFO] olingo-odata2-ref-web
[INFO] olingo-odata2-jpa-processor
[INFO] olingo-odata2-jpa-processor-api
[INFO] olingo-odata2-jpa-processor-core
[INFO] olingo-odata2-jpa-processor-ref
[INFO] olingo-odata2-jpa-processor-ref-web
[INFO] olingo-odata2-annotation-processor
[INFO] olingo-odata2-annotation-processor-api
[INFO] olingo-odata2-annotation-processor-core
[INFO] olingo-odata2-annotation-processor-ref
[INFO] olingo-odata2-annotation-processor-ref-web
[INFO] olingo-odata2-dist
[INFO] olingo-odata2-dist-lib
[INFO] olingo-odata2-dist-jpa
[INFO] olingo-odata2-dist-janos
[INFO] olingo-odata2-dist-ref
[INFO] olingo-odata2-dist-javadoc
[INFO] olingo-odata2-sample
[INFO] olingo-odata2-sample-cars-service-archetype
[INFO] olingo-odata2-sample-cars-annotation-archetype
[INFO] olingo-odata2-sample-cars-jpa-archetype
[INFO] 
[INFO] ------------------------------------------------------------------------
[INFO] Building olingo-odata2-parent 2.0.9
[INFO] ------------------------------------------------------------------------
Downloading: https://repo.maven.apache.org/maven2/org/codehaus/mojo/buildnumber-maven-plugin/1.2/buildnumber-maven-plugin-1.2.pom
Progress (1): 2.1/13 kBProgress (1): 4.9/13 kBProgress (1): 7.7/13 kBProgress (1): 10/13 kB Progress (1): 13 kB                      Downloaded: https://repo.maven.apache.org/maven2/org/codehaus/mojo/buildnumber-maven-plugin/1.2/buildnumber-maven-plugin-1.2.pom (13 kB at 706 kB/s)
Downloading: https://repo.maven.apache.org/maven2/org/codehaus/mojo/mojo-parent/30/mojo-parent-30.pom
Progress (1): 2.1/27 kBProgress (1): 4.9/27 kBProgress (1): 7.7/27 kBProgress (1): 10/27 kB Progress (1): 13/27 kBProgress (1): 16/27 kBProgress (1): 19/27 kBProgress (1): 21/27 kBProgress (1): 24/27 kBProgress (1): 27 kB                      Downloaded: https://repo.maven.apache.org/maven2/org/codehaus/mojo/mojo-parent/30/mojo-parent-30.pom (27 kB at 1.3 MB/s)
Downloading: https://repo.maven.apache.org/maven2/org/codehaus/mojo/buildnumber-maven-plugin/1.2/buildnumber-maven-plugin-1.2.jar
Progress (1): 2.1/26 kBProgress (1): 4.9/26 kBProgress (1): 7.7/26 kBProgress (1): 10/26 kB Progress (1): 13/26 kBProgress (1): 16/26 kBProgress (1): 19/26 kBProgress (1): 21/26 kBProgress (1): 24/26 kBProgress (1): 26 kB                      Downloaded: https://repo.maven.apache.org/maven2/org/codehaus/mojo/buildnumber-maven-plugin/1.2/buildnumber-maven-plugin-1.2.jar (26 kB at 1.3 MB/s)
Downloading: https://repo.maven.apache.org/maven2/org/apache/maven/plugins/maven-checkstyle-plugin/2.10/maven-checkstyle-plugin-2.10.pom
Progress (1): 2.1/11 kBProgress (1): 4.9/11 kBProgress (1): 7.7/11 kBProgress (1): 10/11 kB Progress (1): 11 kB                      Downloaded: https://repo.maven.apache.org/maven2/org/apache/maven/plugins/maven-checkstyle-plugin/2.10/maven-checkstyle-plugin-2.10.pom (11 kB at 634 kB/s)
Downloading: https://repo.maven.apache.org/maven2/org/apache/maven/plugins/maven-checkstyle-plugin/2.10/maven-checkstyle-plugin-2.10.jar
Progress (1): 2.1/93 kBProgress (1): 4.9/93 kBProgress (1): 7.7/93 kBProgress (1): 10/93 kB Progress (1): 13/93 kBProgress (1): 16/93 kBProgress (1): 19/93 kBProgress (1): 21/93 kBProgress (1): 24/93 kBProgress (1): 27/93 kBProgress (1): 30/93 kBProgress (1): 32/93 kBProgress (1): 36/93 kBProgress (1): 40/93 kBProgress (1): 44/93 kBProgress (1): 49/93 kBProgress (1): 53/93 kBProgress (1): 57/93 kBProgress (1): 61/93 kBProgress (1): 65/93 kBProgress (1): 69/93 kBProgress (1): 73/93 kBProgress (1): 77/93 kBProgress (1): 81/93 kBProgress (1): 85/93 kBProgress (1): 89/93 kBProgress (1): 93 kB                      Downloaded: https://repo.maven.apache.org/maven2/org/apache/maven/plugins/maven-checkstyle-plugin/2.10/maven-checkstyle-plugin-2.10.jar (93 kB at 2.9 MB/s)
Downloading: https://repo.maven.apache.org/maven2/org/apache/maven/plugins/maven-install-plugin/2.3.1/maven-install-plugin-2.3.1.pom
Progress (1): 4.1/4.9 kBProgress (1): 4.9 kB                        Downloaded: https://repo.maven.apache.org/maven2/org/apache/maven/plugins/maven-install-plugin/2.3.1/maven-install-plugin-2.3.1.pom (4.9 kB at 305 kB/s)
Downloading: https://repo.maven.apache.org/maven2/org/apache/maven/plugins/maven-install-plugin/2.3.1/maven-install-plugin-2.3.1.jar
Progress (1): 2.1/23 kBProgress (1): 4.9/23 kBProgress (1): 7.7/23 kBProgress (1): 10/23 kB Progress (1): 13/23 kBProgress (1): 16/23 kBProgress (1): 19/23 kBProgress (1): 21/23 kBProgress (1): 23 kB                      Downloaded: https://repo.maven.apache.org/maven2/org/apache/maven/plugins/maven-install-plugin/2.3.1/maven-install-plugin-2.3.1.jar (23 kB at 1.3 MB/s)
Downloading: https://repo.maven.apache.org/maven2/org/apache/maven/plugins/maven-deploy-plugin/2.7/maven-deploy-plugin-2.7.pom
Progress (1): 2.1/5.6 kBProgress (1): 4.9/5.6 kBProgress (1): 5.6 kB                        Downloaded: https://repo.maven.apache.org/maven2/org/apache/maven/plugins/maven-deploy-plugin/2.7/maven-deploy-plugin-2.7.pom (5.6 kB at 351 kB/s)
Downloading: https://repo.maven.apache.org/maven2/org/apache/maven/plugins/maven-deploy-plugin/2.7/maven-deploy-plugin-2.7.jar
Progress (1): 2.8/27 kBProgress (1): 5.5/27 kBProgress (1): 8.3/27 kBProgress (1): 11/27 kB Progress (1): 14/27 kBProgress (1): 16/27 kBProgress (1): 19/27 kBProgress (1): 22/27 kBProgress (1): 25/27 kBProgress (1): 27 kB                      Downloaded: https://repo.maven.apache.org/maven2/org/apache/maven/plugins/maven-deploy-plugin/2.7/maven-deploy-plugin-2.7.jar (27 kB at 1.4 MB/s)
[INFO] 
[INFO] --- maven-clean-plugin:2.5:clean (default-clean) @ olingo-odata2-parent ---
[INFO] 
[INFO] --- buildnumber-maven-plugin:1.2:create (default) @ olingo-odata2-parent ---
Downloading: https://repo.maven.apache.org/maven2/org/apache/maven/scm/maven-scm-api/1.8/maven-scm-api-1.8.pom
Progress (1): 1.6 kB                    Downloaded: https://repo.maven.apache.org/maven2/org/apache/maven/scm/maven-scm-api/1.8/maven-scm-api-1.8.pom (1.6 kB at 99 kB/s)
Downloading: https://repo.maven.apache.org/maven2/org/apache/maven/scm/maven-scm/1.8/maven-scm-1.8.pom
Progress (1): 2.1/21 kBProgress (1): 4.9/21 kBProgress (1): 7.7/21 kBProgress (1): 10/21 kB Progress (1): 13/21 kBProgress (1): 16/21 kBProgress (1): 19/21 kBProgress (1): 21/21 kBProgress (1): 21 kB                      Downloaded: https://repo.maven.apache.org/maven2/org/apache/maven/scm/maven-scm/1.8/maven-scm-1.8.pom (21 kB at 1.1 MB/s)
Downloading: https://repo.maven.apache.org/maven2/org/codehaus/plexus/plexus-utils/3.0.3/plexus-utils-3.0.3.pom
Progress (1): 2.1/2.5 kBProgress (1): 2.5 kB                        Downloaded: https://repo.maven.apache.org/maven2/org/codehaus/plexus/plexus-utils/3.0.3/plexus-utils-3.0.3.pom (2.5 kB at 179 kB/s)
Downloading: https://repo.maven.apache.org/maven2/org/apache/maven/scm/maven-scm-manager-plexus/1.8/maven-scm-manager-plexus-1.8.pom
Progress (1): 2.1/2.2 kBProgress (1): 2.2 kB                        Downloaded: https://repo.maven.apache.org/maven2/org/apache/maven/scm/maven-scm-manager-plexus/1.8/maven-scm-manager-plexus-1.8.pom (2.2 kB at 144 kB/s)
Downloading: https://repo.maven.apache.org/maven2/org/apache/maven/scm/maven-scm-managers/1.8/maven-scm-managers-1.8.pom
Progress (1): 1.5 kB                    Downloaded: https://repo.maven.apache.org/maven2/org/apache/maven/scm/maven-scm-managers/1.8/maven-scm-managers-1.8.pom (1.5 kB at 106 kB/s)
Downloading: https://repo.maven.apache.org/maven2/org/apache/maven/scm/maven-scm-provider-bazaar/1.8/maven-scm-provider-bazaar-1.8.pom
Progress (1): 2.1 kB                    Downloaded: https://repo.maven.apache.org/maven2/org/apache/maven/scm/maven-scm-provider-bazaar/1.8/maven-scm-provider-bazaar-1.8.pom (2.1 kB at 137 kB/s)
Downloading: https://repo.maven.apache.org/maven2/org/apache/maven/scm/maven-scm-providers/1.8/maven-scm-providers-1.8.pom
Progress (1): 1.6/3.7 kBProgress (1): 3.7 kB                        Downloaded: https://repo.maven.apache.org/maven2/org/apache/maven/scm/maven-scm-providers/1.8/maven-scm-providers-1.8.pom (3.7 kB at 249 kB/s)
Downloading: https://repo.maven.apache.org/maven2/org/apache/maven/scm/maven-scm-provider-svnexe/1.8/maven-scm-provider-svnexe-1.8.pom
Progress (1): 2.1/2.5 kBProgress (1): 2.5 kB                        Downloaded: https://repo.maven.apache.org/maven2/org/apache/maven/scm/maven-scm-provider-svnexe/1.8/maven-scm-provider-svnexe-1.8.pom (2.5 kB at 157 kB/s)
Downloading: https://repo.maven.apache.org/maven2/org/apache/maven/scm/maven-scm-providers-svn/1.8/maven-scm-providers-svn-1.8.pom
Progress (1): 2.1 kB                    Downloaded: https://repo.maven.apache.org/maven2/org/apache/maven/scm/maven-scm-providers-svn/1.8/maven-scm-providers-svn-1.8.pom (2.1 kB at 163 kB/s)
Downloading: https://repo.maven.apache.org/maven2/org/apache/maven/scm/maven-scm-provider-svn-commons/1.8/maven-scm-provider-svn-commons-1.8.pom
Progress (1): 2.1/2.7 kBProgress (1): 2.7 kB                        Downloaded: https://repo.maven.apache.org/maven2/org/apache/maven/scm/maven-scm-provider-svn-commons/1.8/maven-scm-provider-svn-commons-1.8.pom (2.7 kB at 208 kB/s)
Downloading: https://repo.maven.apache.org/maven2/org/apache/maven/scm/maven-scm-provider-gitexe/1.8/maven-scm-provider-gitexe-1.8.pom
Progress (1): 2.1/2.4 kBProgress (1): 2.4 kB                        Downloaded: https://repo.maven.apache.org/maven2/org/apache/maven/scm/maven-scm-provider-gitexe/1.8/maven-scm-provider-gitexe-1.8.pom (2.4 kB at 171 kB/s)
Downloading: https://repo.maven.apache.org/maven2/org/apache/maven/scm/maven-scm-providers-git/1.8/maven-scm-providers-git-1.8.pom
Progress (1): 2.1/2.2 kBProgress (1): 2.2 kB                        Downloaded: https://repo.maven.apache.org/maven2/org/apache/maven/scm/maven-scm-providers-git/1.8/maven-scm-providers-git-1.8.pom (2.2 kB at 158 kB/s)
Downloading: https://repo.maven.apache.org/maven2/org/apache/maven/scm/maven-scm-provider-git-commons/1.8/maven-scm-provider-git-commons-1.8.pom
Progress (1): 2.2/2.3 kBProgress (1): 2.3 kB                        Downloaded: https://repo.maven.apache.org/maven2/org/apache/maven/scm/maven-scm-provider-git-commons/1.8/maven-scm-provider-git-commons-1.8.pom (2.3 kB at 161 kB/s)
Downloading: https://repo.maven.apache.org/maven2/org/apache/maven/scm/maven-scm-provider-cvsexe/1.8/maven-scm-provider-cvsexe-1.8.pom
Progress (1): 2.1/2.7 kBProgress (1): 2.7 kB                        Downloaded: https://repo.maven.apache.org/maven2/org/apache/maven/scm/maven-scm-provider-cvsexe/1.8/maven-scm-provider-cvsexe-1.8.pom (2.7 kB at 179 kB/s)
Downloading: https://repo.maven.apache.org/maven2/org/apache/maven/scm/maven-scm-providers-cvs/1.8/maven-scm-providers-cvs-1.8.pom
Progress (1): 1.7 kB                    Downloaded: https://repo.maven.apache.org/maven2/org/apache/maven/scm/maven-scm-providers-cvs/1.8/maven-scm-providers-cvs-1.8.pom (1.7 kB at 131 kB/s)
Downloading: https://repo.maven.apache.org/maven2/org/apache/maven/scm/maven-scm-provider-cvs-commons/1.8/maven-scm-provider-cvs-commons-1.8.pom
Progress (1): 2.2/2.4 kBProgress (1): 2.4 kB                        Downloaded: https://repo.maven.apache.org/maven2/org/apache/maven/scm/maven-scm-provider-cvs-commons/1.8/maven-scm-provider-cvs-commons-1.8.pom (2.4 kB at 173 kB/s)
Downloading: https://repo.maven.apache.org/maven2/org/apache/maven/scm/maven-scm-provider-starteam/1.8/maven-scm-provider-starteam-1.8.pom
Progress (1): 2.1/2.6 kBProgress (1): 2.6 kB                        Downloaded: https://repo.maven.apache.org/maven2/org/apache/maven/scm/maven-scm-provider-starteam/1.8/maven-scm-provider-starteam-1.8.pom (2.6 kB at 184 kB/s)
Downloading: https://repo.maven.apache.org/maven2/org/apache/maven/scm/maven-scm-provider-clearcase/1.8/maven-scm-provider-clearcase-1.8.pom
Progress (1): 2.1/2.7 kBProgress (1): 2.7 kB                        Downloaded: https://repo.maven.apache.org/maven2/org/apache/maven/scm/maven-scm-provider-clearcase/1.8/maven-scm-provider-clearcase-1.8.pom (2.7 kB at 194 kB/s)
Downloading: https://repo.maven.apache.org/maven2/org/apache/maven/scm/maven-scm-provider-perforce/1.8/maven-scm-provider-perforce-1.8.pom
Progress (1): 2.2/2.6 kBProgress (1): 2.6 kB                        Downloaded: https://repo.maven.apache.org/maven2/org/apache/maven/scm/maven-scm-provider-perforce/1.8/maven-scm-provider-perforce-1.8.pom (2.6 kB at 175 kB/s)
Downloading: https://repo.maven.apache.org/maven2/org/apache/maven/scm/maven-scm-provider-hg/1.8/maven-scm-provider-hg-1.8.pom
Progress (1): 2.2/2.4 kBProgress (1): 2.4 kB                        Downloaded: https://repo.maven.apache.org/maven2/org/apache/maven/scm/maven-scm-provider-hg/1.8/maven-scm-provider-hg-1.8.pom (2.4 kB at 144 kB/s)
Downloading: https://repo.maven.apache.org/maven2/org/apache/maven/scm/maven-scm-api/1.8/maven-scm-api-1.8.jar
Downloading: https://repo.maven.apache.org/maven2/org/apache/maven/scm/maven-scm-manager-plexus/1.8/maven-scm-manager-plexus-1.8.jar
Downloading: https://repo.maven.apache.org/maven2/org/apache/maven/scm/maven-scm-provider-bazaar/1.8/maven-scm-provider-bazaar-1.8.jar
Downloading: https://repo.maven.apache.org/maven2/org/apache/maven/scm/maven-scm-provider-svnexe/1.8/maven-scm-provider-svnexe-1.8.jar
Downloading: https://repo.maven.apache.org/maven2/org/apache/maven/scm/maven-scm-provider-gitexe/1.8/maven-scm-provider-gitexe-1.8.jar
Progress (1): 2.1/105 kBProgress (1): 4.9/105 kBProgress (1): 7.7/105 kBProgress (1): 10/105 kB Progress (1): 13/105 kBProgress (1): 16/105 kBProgress (1): 19/105 kBProgress (1): 21/105 kBProgress (1): 24/105 kBProgress (2): 24/105 kB | 4.1/55 kBProgress (2): 27/105 kB | 4.1/55 kBProgress (2): 27/105 kB | 7.6/55 kBProgress (2): 27/105 kB | 12/55 kB Progress (2): 30/105 kB | 12/55 kBProgress (2): 30/105 kB | 16/55 kBProgress (2): 32/105 kB | 16/55 kBProgress (2): 32/105 kB | 20/55 kBProgress (2): 32/105 kB | 24/55 kBProgress (2): 32/105 kB | 28/55 kBProgress (2): 32/105 kB | 32/55 kBProgress (2): 36/105 kB | 32/55 kBProgress (2): 36/105 kB | 36/55 kBProgress (2): 40/105 kB | 36/55 kBProgress (2): 40/105 kB | 40/55 kBProgress (2): 44/105 kB | 40/55 kBProgress (2): 44/105 kB | 44/55 kBProgress (2): 49/105 kB | 44/55 kBProgress (2): 49/105 kB | 49/55 kBProgress (2): 49/105 kB | 53/55 kBProgress (2): 49/105 kB | 55 kB   Progress (2): 53/105 kB | 55 kBProgress (2): 57/105 kB | 55 kBProgress (2): 61/105 kB | 55 kBProgress (2): 65/105 kB | 55 kBProgress (2): 69/105 kB | 55 kBProgress (2): 73/105 kB | 55 kBProgress (2): 77/105 kB | 55 kBProgress (2): 81/105 kB | 55 kBProgress (2): 85/105 kB | 55 kBProgress (2): 89/105 kB | 55 kBProgress (2): 94/105 kB | 55 kBProgress (2): 98/105 kB | 55 kBProgress (2): 102/105 kB | 55 kBProgress (2): 105 kB | 55 kB    Progress (3): 105 kB | 55 kB | 1.5/63 kBProgress (3): 105 kB | 55 kB | 4.2/63 kBProgress (4): 105 kB | 55 kB | 4.2/63 kB | 2.1/11 kBProgress (4): 105 kB | 55 kB | 5.6/63 kB | 2.1/11 kBProgress (4): 105 kB | 55 kB | 5.6/63 kB | 4.9/11 kBProgress (4): 105 kB | 55 kB | 8.3/63 kB | 4.9/11 kBProgress (4): 105 kB | 55 kB | 8.3/63 kB | 7.7/11 kBProgress (4): 105 kB | 55 kB | 9.7/63 kB | 7.7/11 kBProgress (4): 105 kB | 55 kB | 9.7/63 kB | 10/11 kB Progress (4): 105 kB | 55 kB | 12/63 kB | 10/11 kB Progress (4): 105 kB | 55 kB | 12/63 kB | 11 kB   Progress (4): 105 kB | 55 kB | 14/63 kB | 11 kBProgress (4): 105 kB | 55 kB | 17/63 kB | 11 kBProgress (5): 105 kB | 55 kB | 17/63 kB | 11 kB | 1.4/77 kBProgress (5): 105 kB | 55 kB | 18/63 kB | 11 kB | 1.4/77 kBProgress (5): 105 kB | 55 kB | 18/63 kB | 11 kB | 4.2/77 kBProgress (5): 105 kB | 55 kB | 21/63 kB | 11 kB | 4.2/77 kBProgress (5): 105 kB | 55 kB | 21/63 kB | 11 kB | 5.5/77 kBProgress (5): 105 kB | 55 kB | 22/63 kB | 11 kB | 5.5/77 kBProgress (5): 105 kB | 55 kB | 22/63 kB | 11 kB | 8.3/77 kBProgress (5): 105 kB | 55 kB | 25/63 kB | 11 kB | 8.3/77 kBProgress (5): 105 kB | 55 kB | 25/63 kB | 11 kB | 11/77 kB Progress (5): 105 kB | 55 kB | 26/63 kB | 11 kB | 11/77 kBProgress (5): 105 kB | 55 kB | 29/63 kB | 11 kB | 11/77 kBProgress (5): 105 kB | 55 kB | 30/63 kB | 11 kB | 11/77 kBProgress (5): 105 kB | 55 kB | 33/63 kB | 11 kB | 11/77 kBProgress (5): 105 kB | 55 kB | 34/63 kB | 11 kB | 11/77 kBProgress (5): 105 kB | 55 kB | 37/63 kB | 11 kB | 11/77 kB                                                          Downloaded: https://repo.maven.apache.org/maven2/org/apache/maven/scm/maven-scm-provider-bazaar/1.8/maven-scm-provider-bazaar-1.8.jar (55 kB at 1.3 MB/s)
Progress (4): 105 kB | 38/63 kB | 11 kB | 11/77 kB                                                  Downloading: https://repo.maven.apache.org/maven2/org/apache/maven/scm/maven-scm-provider-git-commons/1.8/maven-scm-provider-git-commons-1.8.jar
Progress (4): 105 kB | 38/63 kB | 11 kB | 14/77 kBProgress (4): 105 kB | 41/63 kB | 11 kB | 14/77 kB                                                  Downloaded: https://repo.maven.apache.org/maven2/org/apache/maven/scm/maven-scm-api/1.8/maven-scm-api-1.8.jar (105 kB at 2.4 MB/s)
Progress (3): 41/63 kB | 11 kB | 16/77 kBProgress (3): 42/63 kB | 11 kB | 16/77 kB                                         Downloading: https://repo.maven.apache.org/maven2/org/apache/maven/scm/maven-scm-provider-svn-commons/1.8/maven-scm-provider-svn-commons-1.8.jar
Progress (3): 42/63 kB | 11 kB | 18/77 kBProgress (3): 45/63 kB | 11 kB | 18/77 kBProgress (3): 45/63 kB | 11 kB | 21/77 kBProgress (3): 47/63 kB | 11 kB | 21/77 kBProgress (3): 47/63 kB | 11 kB | 22/77 kBProgress (3): 49/63 kB | 11 kB | 22/77 kBProgress (3): 49/63 kB | 11 kB | 25/77 kBProgress (3): 51/63 kB | 11 kB | 25/77 kBProgress (3): 51/63 kB | 11 kB | 26/77 kB                                         Downloaded: https://repo.maven.apache.org/maven2/org/apache/maven/scm/maven-scm-manager-plexus/1.8/maven-scm-manager-plexus-1.8.jar (11 kB at 240 kB/s)
Progress (2): 53/63 kB | 26/77 kB                                 Downloading: https://repo.maven.apache.org/maven2/org/apache/maven/scm/maven-scm-provider-cvsexe/1.8/maven-scm-provider-cvsexe-1.8.jar
Progress (2): 53/63 kB | 29/77 kBProgress (2): 55/63 kB | 29/77 kBProgress (2): 55/63 kB | 30/77 kBProgress (2): 57/63 kB | 30/77 kBProgress (2): 57/63 kB | 33/77 kBProgress (2): 59/63 kB | 33/77 kBProgress (2): 59/63 kB | 34/77 kBProgress (2): 62/63 kB | 34/77 kBProgress (2): 62/63 kB | 37/77 kBProgress (2): 63 kB | 37/77 kB   Progress (2): 63 kB | 38/77 kBProgress (2): 63 kB | 41/77 kBProgress (2): 63 kB | 42/77 kBProgress (2): 63 kB | 45/77 kBProgress (2): 63 kB | 46/77 kBProgress (2): 63 kB | 49/77 kBProgress (2): 63 kB | 51/77 kBProgress (2): 63 kB | 53/77 kBProgress (2): 63 kB | 55/77 kBProgress (2): 63 kB | 57/77 kBProgress (2): 63 kB | 59/77 kBProgress (2): 63 kB | 62/77 kBProgress (2): 63 kB | 63/77 kBProgress (2): 63 kB | 66/77 kBProgress (2): 63 kB | 68/77 kBProgress (2): 63 kB | 71/77 kBProgress (2): 63 kB | 74/77 kBProgress (3): 63 kB | 74/77 kB | 4.1/40 kBProgress (3): 63 kB | 77/77 kB | 4.1/40 kBProgress (3): 63 kB | 77/77 kB | 7.6/40 kBProgress (3): 63 kB | 77 kB | 7.6/40 kB   Progress (4): 63 kB | 77 kB | 7.6/40 kB | 1.8/30 kBProgress (4): 63 kB | 77 kB | 12/40 kB | 1.8/30 kB Progress (4): 63 kB | 77 kB | 16/40 kB | 1.8/30 kBProgress (4): 63 kB | 77 kB | 16/40 kB | 4.5/30 kBProgress (4): 63 kB | 77 kB | 16/40 kB | 5.9/30 kBProgress (5): 63 kB | 77 kB | 16/40 kB | 5.9/30 kB | 4.1/38 kBProgress (5): 63 kB | 77 kB | 20/40 kB | 5.9/30 kB | 4.1/38 kBProgress (5): 63 kB | 77 kB | 20/40 kB | 8.6/30 kB | 4.1/38 kBProgress (5): 63 kB | 77 kB | 24/40 kB | 8.6/30 kB | 4.1/38 kB                                                              Downloaded: https://repo.maven.apache.org/maven2/org/apache/maven/scm/maven-scm-provider-gitexe/1.8/maven-scm-provider-gitexe-1.8.jar (63 kB at 1.2 MB/s)
Progress (4): 77 kB | 24/40 kB | 8.6/30 kB | 7.6/38 kBProgress (4): 77 kB | 24/40 kB | 11/30 kB | 7.6/38 kB Progress (4): 77 kB | 24/40 kB | 11/30 kB | 12/38 kB                                                     Downloading: https://repo.maven.apache.org/maven2/org/apache/maven/scm/maven-scm-provider-cvs-commons/1.8/maven-scm-provider-cvs-commons-1.8.jar
Progress (4): 77 kB | 28/40 kB | 11/30 kB | 12/38 kBProgress (4): 77 kB | 28/40 kB | 14/30 kB | 12/38 kBProgress (4): 77 kB | 28/40 kB | 14/30 kB | 16/38 kBProgress (4): 77 kB | 32/40 kB | 14/30 kB | 16/38 kBProgress (4): 77 kB | 32/40 kB | 17/30 kB | 16/38 kBProgress (4): 77 kB | 36/40 kB | 17/30 kB | 16/38 kBProgress (4): 77 kB | 36/40 kB | 18/30 kB | 16/38 kBProgress (4): 77 kB | 40/40 kB | 18/30 kB | 16/38 kBProgress (4): 77 kB | 40/40 kB | 18/30 kB | 20/38 kBProgress (4): 77 kB | 40 kB | 18/30 kB | 20/38 kB   Progress (4): 77 kB | 40 kB | 18/30 kB | 24/38 kBProgress (4): 77 kB | 40 kB | 21/30 kB | 24/38 kBProgress (4): 77 kB | 40 kB | 21/30 kB | 28/38 kBProgress (4): 77 kB | 40 kB | 21/30 kB | 32/38 kBProgress (4): 77 kB | 40 kB | 22/30 kB | 32/38 kBProgress (4): 77 kB | 40 kB | 25/30 kB | 32/38 kBProgress (4): 77 kB | 40 kB | 25/30 kB | 36/38 kBProgress (4): 77 kB | 40 kB | 25/30 kB | 38 kB   Progress (4): 77 kB | 40 kB | 26/30 kB | 38 kBProgress (4): 77 kB | 40 kB | 29/30 kB | 38 kBProgress (4): 77 kB | 40 kB | 30 kB | 38 kB                                              Downloaded: https://repo.maven.apache.org/maven2/org/apache/maven/scm/maven-scm-provider-svnexe/1.8/maven-scm-provider-svnexe-1.8.jar (77 kB at 1.3 MB/s)
Downloading: https://repo.maven.apache.org/maven2/org/apache/maven/scm/maven-scm-provider-starteam/1.8/maven-scm-provider-starteam-1.8.jar
Progress (4): 40 kB | 30 kB | 38 kB | 2.1/80 kB                                               Downloaded: https://repo.maven.apache.org/maven2/org/apache/maven/scm/maven-scm-provider-svn-commons/1.8/maven-scm-provider-svn-commons-1.8.jar (40 kB at 686 kB/s)
Progress (3): 30 kB | 38 kB | 4.9/80 kB                                       Downloading: https://repo.maven.apache.org/maven2/org/apache/maven/scm/maven-scm-provider-clearcase/1.8/maven-scm-provider-clearcase-1.8.jar
Progress (3): 30 kB | 38 kB | 7.7/80 kB                                       Downloaded: https://repo.maven.apache.org/maven2/org/apache/maven/scm/maven-scm-provider-git-commons/1.8/maven-scm-provider-git-commons-1.8.jar (38 kB at 630 kB/s)
Progress (2): 30 kB | 10/80 kB                              Downloading: https://repo.maven.apache.org/maven2/org/apache/maven/scm/maven-scm-provider-perforce/1.8/maven-scm-provider-perforce-1.8.jar
Progress (2): 30 kB | 13/80 kBProgress (2): 30 kB | 16/80 kBProgress (2): 30 kB | 19/80 kBProgress (2): 30 kB | 21/80 kBProgress (2): 30 kB | 24/80 kB                              Downloaded: https://repo.maven.apache.org/maven2/org/apache/maven/scm/maven-scm-provider-cvsexe/1.8/maven-scm-provider-cvsexe-1.8.jar (30 kB at 489 kB/s)
Downloading: https://repo.maven.apache.org/maven2/org/apache/maven/scm/maven-scm-provider-hg/1.8/maven-scm-provider-hg-1.8.jar
Progress (1): 27/80 kBProgress (1): 30/80 kBProgress (1): 32/80 kBProgress (1): 36/80 kBProgress (1): 40/80 kBProgress (1): 44/80 kBProgress (1): 49/80 kBProgress (1): 53/80 kBProgress (1): 57/80 kBProgress (1): 61/80 kBProgress (1): 65/80 kBProgress (2): 65/80 kB | 2.1/74 kBProgress (2): 65/80 kB | 4.9/74 kBProgress (2): 65/80 kB | 7.7/74 kBProgress (2): 69/80 kB | 7.7/74 kBProgress (2): 73/80 kB | 7.7/74 kBProgress (2): 73/80 kB | 10/74 kB Progress (2): 77/80 kB | 10/74 kBProgress (2): 80 kB | 10/74 kB   Progress (2): 80 kB | 13/74 kBProgress (2): 80 kB | 16/74 kBProgress (2): 80 kB | 19/74 kBProgress (2): 80 kB | 21/74 kBProgress (2): 80 kB | 24/74 kBProgress (2): 80 kB | 27/74 kBProgress (2): 80 kB | 30/74 kBProgress (3): 80 kB | 30/74 kB | 0.6/66 kBProgress (3): 80 kB | 32/74 kB | 0.6/66 kBProgress (3): 80 kB | 32/74 kB | 3.4/66 kBProgress (4): 80 kB | 32/74 kB | 3.4/66 kB | 4.1/71 kBProgress (4): 80 kB | 32/74 kB | 4.7/66 kB | 4.1/71 kBProgress (4): 80 kB | 32/74 kB | 4.7/66 kB | 7.6/71 kBProgress (5): 80 kB | 32/74 kB | 4.7/66 kB | 7.6/71 kB | 4.1/82 kBProgress (5): 80 kB | 32/74 kB | 7.5/66 kB | 7.6/71 kB | 4.1/82 kBProgress (5): 80 kB | 32/74 kB | 7.5/66 kB | 12/71 kB | 4.1/82 kB Progress (5): 80 kB | 36/74 kB | 7.5/66 kB | 12/71 kB | 4.1/82 kBProgress (5): 80 kB | 36/74 kB | 7.5/66 kB | 16/71 kB | 4.1/82 kBProgress (5): 80 kB | 36/74 kB | 8.8/66 kB | 16/71 kB | 4.1/82 kBProgress (5): 80 kB | 36/74 kB | 8.8/66 kB | 16/71 kB | 7.6/82 kBProgress (5): 80 kB | 40/74 kB | 8.8/66 kB | 16/71 kB | 7.6/82 kBProgress (5): 80 kB | 40/74 kB | 12/66 kB | 16/71 kB | 7.6/82 kB Progress (5): 80 kB | 40/74 kB | 12/66 kB | 16/71 kB | 12/82 kB Progress (5): 80 kB | 40/74 kB | 12/66 kB | 20/71 kB | 12/82 kBProgress (5): 80 kB | 44/74 kB | 12/66 kB | 20/71 kB | 12/82 kBProgress (5): 80 kB | 44/74 kB | 12/66 kB | 24/71 kB | 12/82 kBProgress (5): 80 kB | 44/74 kB | 13/66 kB | 24/71 kB | 12/82 kBProgress (5): 80 kB | 44/74 kB | 13/66 kB | 24/71 kB | 16/82 kBProgress (5): 80 kB | 44/74 kB | 13/66 kB | 28/71 kB | 16/82 kBProgress (5): 80 kB | 49/74 kB | 13/66 kB | 28/71 kB | 16/82 kBProgress (5): 80 kB | 49/74 kB | 13/66 kB | 32/71 kB | 16/82 kBProgress (5): 80 kB | 49/74 kB | 16/66 kB | 32/71 kB | 16/82 kBProgress (5): 80 kB | 49/74 kB | 16/66 kB | 32/71 kB | 20/82 kBProgress (5): 80 kB | 49/74 kB | 17/66 kB | 32/71 kB | 20/82 kBProgress (5): 80 kB | 53/74 kB | 17/66 kB | 32/71 kB | 20/82 kBProgress (5): 80 kB | 53/74 kB | 17/66 kB | 32/71 kB | 24/82 kBProgress (5): 80 kB | 57/74 kB | 17/66 kB | 32/71 kB | 24/82 kBProgress (5): 80 kB | 57/74 kB | 20/66 kB | 32/71 kB | 24/82 kBProgress (5): 80 kB | 57/74 kB | 20/66 kB | 36/71 kB | 24/82 kBProgress (5): 80 kB | 61/74 kB | 20/66 kB | 36/71 kB | 24/82 kBProgress (5): 80 kB | 61/74 kB | 20/66 kB | 36/71 kB | 28/82 kBProgress (5): 80 kB | 65/74 kB | 20/66 kB | 36/71 kB | 28/82 kBProgress (5): 80 kB | 65/74 kB | 23/66 kB | 36/71 kB | 28/82 kBProgress (5): 80 kB | 65/74 kB | 23/66 kB | 40/71 kB | 28/82 kB                                                               Downloaded: https://repo.maven.apache.org/maven2/org/apache/maven/scm/maven-scm-provider-cvs-commons/1.8/maven-scm-provider-cvs-commons-1.8.jar (80 kB at 1.1 MB/s)
Progress (4): 65/74 kB | 23/66 kB | 40/71 kB | 32/82 kBProgress (4): 65/74 kB | 25/66 kB | 40/71 kB | 32/82 kBProgress (4): 65/74 kB | 25/66 kB | 44/71 kB | 32/82 kBProgress (4): 69/74 kB | 25/66 kB | 44/71 kB | 32/82 kBProgress (4): 69/74 kB | 25/66 kB | 49/71 kB | 32/82 kBProgress (4): 73/74 kB | 25/66 kB | 49/71 kB | 32/82 kBProgress (4): 73/74 kB | 28/66 kB | 49/71 kB | 32/82 kBProgress (4): 74 kB | 28/66 kB | 49/71 kB | 32/82 kB   Progress (4): 74 kB | 28/66 kB | 49/71 kB | 36/82 kBProgress (4): 74 kB | 29/66 kB | 49/71 kB | 36/82 kBProgress (4): 74 kB | 29/66 kB | 49/71 kB | 40/82 kBProgress (4): 74 kB | 29/66 kB | 53/71 kB | 40/82 kBProgress (4): 74 kB | 32/66 kB | 53/71 kB | 40/82 kBProgress (4): 74 kB | 32/66 kB | 53/71 kB | 44/82 kBProgress (4): 74 kB | 32/66 kB | 57/71 kB | 44/82 kBProgress (4): 74 kB | 33/66 kB | 57/71 kB | 44/82 kBProgress (4): 74 kB | 33/66 kB | 57/71 kB | 49/82 kBProgress (4): 74 kB | 33/66 kB | 61/71 kB | 49/82 kBProgress (4): 74 kB | 36/66 kB | 61/71 kB | 49/82 kBProgress (4): 74 kB | 36/66 kB | 65/71 kB | 49/82 kBProgress (4): 74 kB | 37/66 kB | 65/71 kB | 49/82 kBProgress (4): 74 kB | 37/66 kB | 65/71 kB | 53/82 kBProgress (4): 74 kB | 37/66 kB | 69/71 kB | 53/82 kBProgress (4): 74 kB | 37/66 kB | 69/71 kB | 57/82 kBProgress (4): 74 kB | 37/66 kB | 71 kB | 57/82 kB   Progress (4): 74 kB | 40/66 kB | 71 kB | 57/82 kBProgress (4): 74 kB | 40/66 kB | 71 kB | 61/82 kBProgress (4): 74 kB | 40/66 kB | 71 kB | 65/82 kBProgress (4): 74 kB | 43/66 kB | 71 kB | 65/82 kBProgress (4): 74 kB | 46/66 kB | 71 kB | 65/82 kBProgress (4): 74 kB | 49/66 kB | 71 kB | 65/82 kBProgress (4): 74 kB | 49/66 kB | 71 kB | 69/82 kBProgress (4): 74 kB | 49/66 kB | 71 kB | 73/82 kBProgress (4): 74 kB | 51/66 kB | 71 kB | 73/82 kBProgress (4): 74 kB | 51/66 kB | 71 kB | 77/82 kBProgress (4): 74 kB | 51/66 kB | 71 kB | 81/82 kBProgress (4): 74 kB | 54/66 kB | 71 kB | 81/82 kBProgress (4): 74 kB | 54/66 kB | 71 kB | 82 kB   Progress (4): 74 kB | 57/66 kB | 71 kB | 82 kBProgress (4): 74 kB | 59/66 kB | 71 kB | 82 kBProgress (4): 74 kB | 62/66 kB | 71 kB | 82 kBProgress (4): 74 kB | 65/66 kB | 71 kB | 82 kBProgress (4): 74 kB | 66 kB | 71 kB | 82 kB                                              Downloaded: https://repo.maven.apache.org/maven2/org/apache/maven/scm/maven-scm-provider-starteam/1.8/maven-scm-provider-starteam-1.8.jar (74 kB at 929 kB/s)
Downloaded: https://repo.maven.apache.org/maven2/org/apache/maven/scm/maven-scm-provider-clearcase/1.8/maven-scm-provider-clearcase-1.8.jar (71 kB at 867 kB/s)
Downloaded: https://repo.maven.apache.org/maven2/org/apache/maven/scm/maven-scm-provider-perforce/1.8/maven-scm-provider-perforce-1.8.jar (82 kB at 974 kB/s)
Downloaded: https://repo.maven.apache.org/maven2/org/apache/maven/scm/maven-scm-provider-hg/1.8/maven-scm-provider-hg-1.8.jar (66 kB at 778 kB/s)
[INFO] Checking for local modifications: skipped.
[INFO] Updating project files from SCM: skipped.
[INFO] Executing: /bin/sh -c cd <https://builds.apache.org/job/olingo-odata2/ws/> && svn --non-interactive info
[INFO] Working directory: <https://builds.apache.org/job/olingo-odata2/ws/>
[INFO] Storing buildNumber: ? at timestamp: 2017-07-08T11:24:21+0000
[INFO] Executing: /bin/sh -c cd <https://builds.apache.org/job/olingo-odata2/ws/> && svn --non-interactive info
[INFO] Working directory: <https://builds.apache.org/job/olingo-odata2/ws/>
[INFO] Storing buildScmBranch: UNKNOWN_BRANCH
[INFO] 
[INFO] --- maven-remote-resources-plugin:1.5:process (default) @ olingo-odata2-parent ---
[INFO] 
[INFO] --- maven-site-plugin:3.2:attach-descriptor (attach-descriptor) @ olingo-odata2-parent ---
[INFO] 
[INFO] --- maven-source-plugin:2.2.1:jar-no-fork (attach-sources) @ olingo-odata2-parent ---
[INFO] 
[INFO] --- maven-checkstyle-plugin:2.10:check (checkstyle) @ olingo-odata2-parent ---
Downloading: https://repo.maven.apache.org/maven2/org/apache/maven/doxia/doxia-sink-api/1.1.3/doxia-sink-api-1.1.3.pom
Progress (1): 1.6 kB                    Downloaded: https://repo.maven.apache.org/maven2/org/apache/maven/doxia/doxia-sink-api/1.1.3/doxia-sink-api-1.1.3.pom (1.6 kB at 98 kB/s)
Downloading: https://repo.maven.apache.org/maven2/org/apache/maven/doxia/doxia-site-renderer/1.1.3/doxia-site-renderer-1.1.3.pom
Progress (1): 2.1/6.1 kBProgress (1): 4.9/6.1 kBProgress (1): 6.1 kB                        Downloaded: https://repo.maven.apache.org/maven2/org/apache/maven/doxia/doxia-site-renderer/1.1.3/doxia-site-renderer-1.1.3.pom (6.1 kB at 437 kB/s)
Downloading: https://repo.maven.apache.org/maven2/org/apache/maven/doxia/doxia-core/1.1.3/doxia-core-1.1.3.pom
Progress (1): 2.1/3.7 kBProgress (1): 3.7 kB                        Downloaded: https://repo.maven.apache.org/maven2/org/apache/maven/doxia/doxia-core/1.1.3/doxia-core-1.1.3.pom (3.7 kB at 286 kB/s)
Downloading: https://repo.maven.apache.org/maven2/org/apache/maven/doxia/doxia-module-xhtml/1.1.3/doxia-module-xhtml-1.1.3.pom
Progress (1): 1.6 kB                    Downloaded: https://repo.maven.apache.org/maven2/org/apache/maven/doxia/doxia-module-xhtml/1.1.3/doxia-module-xhtml-1.1.3.pom (1.6 kB at 134 kB/s)
Downloading: https://repo.maven.apache.org/maven2/org/apache/maven/doxia/doxia-modules/1.1.3/doxia-modules-1.1.3.pom
Progress (1): 2.2/2.4 kBProgress (1): 2.4 kB                        Downloaded: https://repo.maven.apache.org/maven2/org/apache/maven/doxia/doxia-modules/1.1.3/doxia-modules-1.1.3.pom (2.4 kB at 187 kB/s)
Downloading: https://repo.maven.apache.org/maven2/org/apache/maven/doxia/doxia-module-fml/1.1.3/doxia-module-fml-1.1.3.pom
Progress (1): 2.2/5.5 kBProgress (1): 4.9/5.5 kBProgress (1): 5.5 kB                        Downloaded: https://repo.maven.apache.org/maven2/org/apache/maven/doxia/doxia-module-fml/1.1.3/doxia-module-fml-1.1.3.pom (5.5 kB at 423 kB/s)
Downloading: https://repo.maven.apache.org/maven2/com/puppycrawl/tools/checkstyle/5.6/checkstyle-5.6.pom
Progress (1): 2.2/19 kBProgress (1): 4.9/19 kBProgress (1): 7.7/19 kBProgress (1): 10/19 kB Progress (1): 13/19 kBProgress (1): 16/19 kBProgress (1): 19/19 kBProgress (1): 19 kB                      Downloaded: https://repo.maven.apache.org/maven2/com/puppycrawl/tools/checkstyle/5.6/checkstyle-5.6.pom (19 kB at 1.4 MB/s)
Downloading: https://repo.maven.apache.org/maven2/org/apache/maven/doxia/doxia-sink-api/1.1.3/doxia-sink-api-1.1.3.jar
Downloading: https://repo.maven.apache.org/maven2/org/apache/maven/doxia/doxia-logging-api/1.1.3/doxia-logging-api-1.1.3.jar
Downloading: https://repo.maven.apache.org/maven2/org/apache/maven/doxia/doxia-decoration-model/1.1.3/doxia-decoration-model-1.1.3.jar
Downloading: https://repo.maven.apache.org/maven2/org/apache/maven/doxia/doxia-site-renderer/1.1.3/doxia-site-renderer-1.1.3.jar
Downloading: https://repo.maven.apache.org/maven2/org/apache/maven/doxia/doxia-module-xhtml/1.1.3/doxia-module-xhtml-1.1.3.jar
Progress (1): 0/13 kBProgress (1): 2.8/13 kBProgress (1): 4.1/13 kBProgress (1): 6.9/13 kBProgress (2): 6.9/13 kB | 2.1/52 kBProgress (3): 6.9/13 kB | 2.1/52 kB | 2.1/11 kBProgress (3): 9.6/13 kB | 2.1/52 kB | 2.1/11 kBProgress (4): 9.6/13 kB | 2.1/52 kB | 2.1/11 kB | 2.1/15 kBProgress (4): 9.6/13 kB | 2.1/52 kB | 4.9/11 kB | 2.1/15 kBProgress (4): 9.6/13 kB | 4.9/52 kB | 4.9/11 kB | 2.1/15 kBProgress (4): 9.6/13 kB | 4.9/52 kB | 4.9/11 kB | 4.9/15 kBProgress (4): 12/13 kB | 4.9/52 kB | 4.9/11 kB | 4.9/15 kB Progress (4): 12/13 kB | 7.7/52 kB | 4.9/11 kB | 4.9/15 kBProgress (4): 12/13 kB | 7.7/52 kB | 7.7/11 kB | 4.9/15 kBProgress (4): 13 kB | 7.7/52 kB | 7.7/11 kB | 4.9/15 kB   Progress (4): 13 kB | 7.7/52 kB | 7.7/11 kB | 7.7/15 kBProgress (5): 13 kB | 7.7/52 kB | 7.7/11 kB | 7.7/15 kB | 2.1/51 kBProgress (5): 13 kB | 7.7/52 kB | 10/11 kB | 7.7/15 kB | 2.1/51 kB Progress (5): 13 kB | 10/52 kB | 10/11 kB | 7.7/15 kB | 2.1/51 kB Progress (5): 13 kB | 10/52 kB | 10/11 kB | 7.7/15 kB | 4.9/51 kBProgress (5): 13 kB | 10/52 kB | 11 kB | 7.7/15 kB | 4.9/51 kB   Progress (5): 13 kB | 10/52 kB | 11 kB | 10/15 kB | 4.9/51 kB Progress (5): 13 kB | 10/52 kB | 11 kB | 10/15 kB | 7.7/51 kBProgress (5): 13 kB | 13/52 kB | 11 kB | 10/15 kB | 7.7/51 kBProgress (5): 13 kB | 13/52 kB | 11 kB | 10/15 kB | 10/51 kB Progress (5): 13 kB | 13/52 kB | 11 kB | 13/15 kB | 10/51 kBProgress (5): 13 kB | 16/52 kB | 11 kB | 13/15 kB | 10/51 kBProgress (5): 13 kB | 16/52 kB | 11 kB | 13/15 kB | 13/51 kBProgress (5): 13 kB | 16/52 kB | 11 kB | 15 kB | 13/51 kB   Progress (5): 13 kB | 16/52 kB | 11 kB | 15 kB | 16/51 kBProgress (5): 13 kB | 19/52 kB | 11 kB | 15 kB | 16/51 kBProgress (5): 13 kB | 19/52 kB | 11 kB | 15 kB | 19/51 kBProgress (5): 13 kB | 21/52 kB | 11 kB | 15 kB | 19/51 kBProgress (5): 13 kB | 21/52 kB | 11 kB | 15 kB | 21/51 kBProgress (5): 13 kB | 24/52 kB | 11 kB | 15 kB | 21/51 kBProgress (5): 13 kB | 24/52 kB | 11 kB | 15 kB | 24/51 kBProgress (5): 13 kB | 27/52 kB | 11 kB | 15 kB | 24/51 kBProgress (5): 13 kB | 27/52 kB | 11 kB | 15 kB | 27/51 kBProgress (5): 13 kB | 30/52 kB | 11 kB | 15 kB | 27/51 kBProgress (5): 13 kB | 30/52 kB | 11 kB | 15 kB | 30/51 kBProgress (5): 13 kB | 32/52 kB | 11 kB | 15 kB | 30/51 kBProgress (5): 13 kB | 32/52 kB | 11 kB | 15 kB | 32/51 kBProgress (5): 13 kB | 36/52 kB | 11 kB | 15 kB | 32/51 kBProgress (5): 13 kB | 40/52 kB | 11 kB | 15 kB | 32/51 kBProgress (5): 13 kB | 44/52 kB | 11 kB | 15 kB | 32/51 kBProgress (5): 13 kB | 49/52 kB | 11 kB | 15 kB | 32/51 kBProgress (5): 13 kB | 52 kB | 11 kB | 15 kB | 32/51 kB   Progress (5): 13 kB | 52 kB | 11 kB | 15 kB | 36/51 kBProgress (5): 13 kB | 52 kB | 11 kB | 15 kB | 40/51 kB                                                      Downloaded: https://repo.maven.apache.org/maven2/org/apache/maven/doxia/doxia-sink-api/1.1.3/doxia-sink-api-1.1.3.jar (13 kB at 705 kB/s)
Progress (4): 52 kB | 11 kB | 15 kB | 44/51 kB                                              Downloading: https://repo.maven.apache.org/maven2/org/apache/maven/doxia/doxia-module-fml/1.1.3/doxia-module-fml-1.1.3.jar
Progress (4): 52 kB | 11 kB | 15 kB | 49/51 kB                                              Downloaded: https://repo.maven.apache.org/maven2/org/apache/maven/doxia/doxia-logging-api/1.1.3/doxia-logging-api-1.1.3.jar (11 kB at 597 kB/s)
Downloading: https://repo.maven.apache.org/maven2/com/puppycrawl/tools/checkstyle/5.6/checkstyle-5.6.jar
Progress (3): 52 kB | 15 kB | 51 kB                                   Downloaded: https://repo.maven.apache.org/maven2/org/apache/maven/doxia/doxia-module-xhtml/1.1.3/doxia-module-xhtml-1.1.3.jar (15 kB at 834 kB/s)
Downloaded: https://repo.maven.apache.org/maven2/org/apache/maven/doxia/doxia-decoration-model/1.1.3/doxia-decoration-model-1.1.3.jar (52 kB at 2.2 MB/s)
Downloaded: https://repo.maven.apache.org/maven2/org/apache/maven/doxia/doxia-site-renderer/1.1.3/doxia-site-renderer-1.1.3.jar (51 kB at 2.0 MB/s)
Progress (1): 4.1/37 kBProgress (1): 7.6/37 kBProgress (1): 12/37 kB Progress (1): 16/37 kBProgress (1): 20/37 kBProgress (1): 24/37 kBProgress (1): 28/37 kBProgress (1): 32/37 kBProgress (1): 36/37 kBProgress (1): 37 kB   Progress (2): 37 kB | 2.1/651 kBProgress (2): 37 kB | 4.9/651 kBProgress (2): 37 kB | 7.7/651 kBProgress (2): 37 kB | 10/651 kB Progress (2): 37 kB | 13/651 kBProgress (2): 37 kB | 16/651 kBProgress (2): 37 kB | 19/651 kBProgress (2): 37 kB | 21/651 kB                               Downloaded: https://repo.maven.apache.org/maven2/org/apache/maven/doxia/doxia-module-fml/1.1.3/doxia-module-fml-1.1.3.jar (37 kB at 1.2 MB/s)
Progress (1): 24/651 kBProgress (1): 27/651 kBProgress (1): 30/651 kBProgress (1): 32/651 kBProgress (1): 36/651 kBProgress (1): 40/651 kBProgress (1): 44/651 kBProgress (1): 49/651 kBProgress (1): 53/651 kBProgress (1): 57/651 kBProgress (1): 61/651 kBProgress (1): 65/651 kBProgress (1): 69/651 kBProgress (1): 73/651 kBProgress (1): 77/651 kBProgress (1): 81/651 kBProgress (1): 85/651 kBProgress (1): 89/651 kBProgress (1): 94/651 kBProgress (1): 98/651 kBProgress (1): 102/651 kBProgress (1): 106/651 kBProgress (1): 110/651 kBProgress (1): 114/651 kBProgress (1): 118/651 kBProgress (1): 122/651 kBProgress (1): 126/651 kBProgress (1): 130/651 kBProgress (1): 135/651 kBProgress (1): 139/651 kBProgress (1): 143/651 kBProgress (1): 147/651 kBProgress (1): 151/651 kBProgress (1): 155/651 kBProgress (1): 159/651 kBProgress (1): 163/651 kBProgress (1): 167/651 kBProgress (1): 171/651 kBProgress (1): 176/651 kBProgress (1): 180/651 kBProgress (1): 184/651 kBProgress (1): 188/651 kBProgress (1): 192/651 kBProgress (1): 196/651 kBProgress (1): 200/651 kBProgress (1): 204/651 kBProgress (1): 208/651 kBProgress (1): 212/651 kBProgress (1): 216/651 kBProgress (1): 221/651 kBProgress (1): 225/651 kBProgress (1): 229/651 kBProgress (1): 233/651 kBProgress (1): 237/651 kBProgress (1): 241/651 kBProgress (1): 245/651 kBProgress (1): 249/651 kBProgress (1): 253/651 kBProgress (1): 257/651 kBProgress (1): 262/651 kBProgress (1): 266/651 kBProgress (1): 270/651 kBProgress (1): 274/651 kBProgress (1): 278/651 kBProgress (1): 282/651 kBProgress (1): 286/651 kBProgress (1): 290/651 kBProgress (1): 294/651 kBProgress (1): 298/651 kBProgress (1): 302/651 kBProgress (1): 307/651 kBProgress (1): 311/651 kBProgress (1): 315/651 kBProgress (1): 319/651 kBProgress (1): 323/651 kBProgress (1): 327/651 kBProgress (1): 331/651 kBProgress (1): 335/651 kBProgress (1): 339/651 kBProgress (1): 343/651 kBProgress (1): 348/651 kBProgress (1): 352/651 kBProgress (1): 356/651 kBProgress (1): 360/651 kBProgress (1): 364/651 kBProgress (1): 368/651 kBProgress (1): 372/651 kBProgress (1): 376/651 kBProgress (1): 380/651 kBProgress (1): 384/651 kBProgress (1): 388/651 kBProgress (1): 393/651 kBProgress (1): 397/651 kBProgress (1): 401/651 kBProgress (1): 405/651 kBProgress (1): 409/651 kBProgress (1): 413/651 kBProgress (1): 417/651 kBProgress (1): 421/651 kBProgress (1): 425/651 kBProgress (1): 429/651 kBProgress (1): 434/651 kBProgress (1): 438/651 kBProgress (1): 442/651 kBProgress (1): 446/651 kBProgress (1): 450/651 kBProgress (1): 454/651 kBProgress (1): 458/651 kBProgress (1): 462/651 kBProgress (1): 466/651 kBProgress (1): 470/651 kBProgress (1): 475/651 kBProgress (1): 479/651 kBProgress (1): 483/651 kBProgress (1): 487/651 kBProgress (1): 491/651 kBProgress (1): 495/651 kBProgress (1): 499/651 kBProgress (1): 503/651 kBProgress (1): 507/651 kBProgress (1): 511/651 kBProgress (1): 515/651 kBProgress (1): 520/651 kBProgress (1): 524/651 kBProgress (1): 528/651 kBProgress (1): 532/651 kBProgress (1): 536/651 kBProgress (1): 540/651 kBProgress (1): 544/651 kBProgress (1): 548/651 kBProgress (1): 552/651 kBProgress (1): 556/651 kBProgress (1): 561/651 kBProgress (1): 565/651 kBProgress (1): 569/651 kBProgress (1): 573/651 kBProgress (1): 577/651 kBProgress (1): 581/651 kBProgress (1): 585/651 kBProgress (1): 589/651 kBProgress (1): 593/651 kBProgress (1): 597/651 kBProgress (1): 601/651 kBProgress (1): 606/651 kBProgress (1): 610/651 kBProgress (1): 614/651 kBProgress (1): 618/651 kBProgress (1): 622/651 kBProgress (1): 626/651 kBProgress (1): 630/651 kBProgress (1): 634/651 kBProgress (1): 638/651 kBProgress (1): 642/651 kBProgress (1): 647/651 kBProgress (1): 651/651 kBProgress (1): 651 kB                        Downloaded: https://repo.maven.apache.org/maven2/com/puppycrawl/tools/checkstyle/5.6/checkstyle-5.6.jar (651 kB at 7.4 MB/s)
[INFO] Starting audit...
Audit done.

[INFO] 
[INFO] --- maven-install-plugin:2.3.1:install (default-install) @ olingo-odata2-parent ---
[INFO] Installing <https://builds.apache.org/job/olingo-odata2/ws/pom.xml> to /home/jenkins/.m2/repository/org/apache/olingo/olingo-odata2-parent/2.0.9/olingo-odata2-parent-2.0.9.pom
[INFO] 
[INFO] --- maven-deploy-plugin:2.7:deploy (default-deploy) @ olingo-odata2-parent ---
Uploading: https://repository.apache.org/service/local/staging/deploy/maven2/org/apache/olingo/olingo-odata2-parent/2.0.9/olingo-odata2-parent-2.0.9.pom
Progress (1): 2.0/15 kBProgress (1): 4.1/15 kBProgress (1): 6.1/15 kBProgress (1): 8.2/15 kBProgress (1): 10/15 kB Progress (1): 12/15 kBProgress (1): 14/15 kBProgress (1): 15 kB                      [INFO] ------------------------------------------------------------------------
[INFO] Reactor Summary:
[INFO] 
[INFO] olingo-odata2-parent ............................... FAILURE [  3.176 s]
[INFO] olingo-odata2-lib .................................. SKIPPED
[INFO] olingo-odata2-api .................................. SKIPPED
[INFO] olingo-odata2-api-annotation ....................... SKIPPED
[INFO] olingo-odata2-testutil ............................. SKIPPED
[INFO] olingo-odata2-core ................................. SKIPPED
[INFO] olingo-odata2-ref .................................. SKIPPED
[INFO] olingo-odata2-fit .................................. SKIPPED
[INFO] olingo-odata2-ref-web .............................. SKIPPED
[INFO] olingo-odata2-jpa-processor ........................ SKIPPED
[INFO] olingo-odata2-jpa-processor-api .................... SKIPPED
[INFO] olingo-odata2-jpa-processor-core ................... SKIPPED
[INFO] olingo-odata2-jpa-processor-ref .................... SKIPPED
[INFO] olingo-odata2-jpa-processor-ref-web ................ SKIPPED
[INFO] olingo-odata2-annotation-processor ................. SKIPPED
[INFO] olingo-odata2-annotation-processor-api ............. SKIPPED
[INFO] olingo-odata2-annotation-processor-core ............ SKIPPED
[INFO] olingo-odata2-annotation-processor-ref ............. SKIPPED
[INFO] olingo-odata2-annotation-processor-ref-web ......... SKIPPED
[INFO] olingo-odata2-dist ................................. SKIPPED
[INFO] olingo-odata2-dist-lib ............................. SKIPPED
[INFO] olingo-odata2-dist-jpa ............................. SKIPPED
[INFO] olingo-odata2-dist-janos ........................... SKIPPED
[INFO] olingo-odata2-dist-ref ............................. SKIPPED
[INFO] olingo-odata2-dist-javadoc ......................... SKIPPED
[INFO] olingo-odata2-sample ............................... SKIPPED
[INFO] olingo-odata2-sample-cars-service-archetype ........ SKIPPED
[INFO] olingo-odata2-sample-cars-annotation-archetype ..... SKIPPED
[INFO] olingo-odata2-sample-cars-jpa-archetype ............ SKIPPED
[INFO] ------------------------------------------------------------------------
[INFO] BUILD FAILURE
[INFO] ------------------------------------------------------------------------
[INFO] Total time: 4.942 s
[INFO] Finished at: 2017-07-08T11:24:23Z
[INFO] Final Memory: 36M/1100M
[INFO] ------------------------------------------------------------------------
[ERROR] Failed to execute goal org.apache.maven.plugins:maven-deploy-plugin:2.7:deploy (default-deploy) on project olingo-odata2-parent: Failed to deploy artifacts: Could not transfer artifact org.apache.olingo:olingo-odata2-parent:pom:2.0.9 from/to apache.releases.https (https://repository.apache.org/service/local/staging/deploy/maven2): Failed to transfer file: https://repository.apache.org/service/local/staging/deploy/maven2/org/apache/olingo/olingo-odata2-parent/2.0.9/olingo-odata2-parent-2.0.9.pom. Return code is: 401, ReasonPhrase: Unauthorized. -> [Help 1]
[ERROR] 
[ERROR] To see the full stack trace of the errors, re-run Maven with the -e switch.
[ERROR] Re-run Maven using the -X switch to enable full debug logging.
[ERROR] 
[ERROR] For more information about the errors and possible solutions, please read the following articles:
[ERROR] [Help 1] http://cwiki.apache.org/confluence/display/MAVEN/MojoExecutionException
Build step 'Invoke top-level Maven targets' marked build as failure

Mime
View raw message