olingo-commits mailing list archives

Site index · List index
Message view « Date » · « Thread »
Top « Date » · « Thread »
From Apache Jenkins Server <jenk...@builds.apache.org>
Subject Build failed in Jenkins: olingo-odata4 #1426
Date Wed, 05 Jul 2017 08:52:38 GMT
See <https://builds.apache.org/job/olingo-odata4/1426/display/redirect?page=changes>

Changes:

[ramya.vasanth] [OLINGO-1062]Fix in API for Casting Types to Derived Types

------------------------------------------
[...truncated 312.02 KB...]
[INFO] Exclude: **/ref/**
[INFO] Exclude: **/server-ref/**
[INFO] Exclude: **/dependency-reduced-pom.xml
[INFO] 178 resources included (use -debug for more details)
Compiler warnings:
  WARNING:  'org.apache.xerces.jaxp.SAXParserImpl: Property 'http://javax.xml.XMLConstants/property/accessExternalDTD'
is not recognized.'
[INFO] Rat check: Summary of files. Unapproved: 0 unknown: 0 generated: 0 approved: 178 licence.
[INFO] 
[INFO] --- maven-deploy-plugin:2.8.2:deploy (default-deploy) @ odata-samples ---
[INFO] Skipping artifact deployment
[INFO] 
[INFO] ------------------------------------------------------------------------
[INFO] Building odata-server-osgi-sample 4.4.0-SNAPSHOT
[INFO] ------------------------------------------------------------------------
[INFO] 
[INFO] --- maven-clean-plugin:2.5:clean (default-clean) @ odata-server-osgi-sample ---
[INFO] Deleting <https://builds.apache.org/job/olingo-odata4/ws/samples/osgi/server/target>
[INFO] 
[INFO] --- build-helper-maven-plugin:1.9:add-source (add-source) @ odata-server-osgi-sample
---
[INFO] Source directory: <https://builds.apache.org/job/olingo-odata4/ws/samples/osgi/server/../../server/src/main>
added.
[INFO] 
[INFO] --- maven-remote-resources-plugin:1.5:process (default) @ odata-server-osgi-sample
---
[INFO] 
[INFO] --- maven-resources-plugin:2.6:resources (default-resources) @ odata-server-osgi-sample
---
[INFO] Using 'UTF-8' encoding to copy filtered resources.
[INFO] skip non existing resourceDirectory <https://builds.apache.org/job/olingo-odata4/ws/samples/osgi/server/src/main/resources>
[INFO] Copying 3 resources
[INFO] 
[INFO] --- maven-compiler-plugin:2.3.2:compile (default-compile) @ odata-server-osgi-sample
---
[INFO] Compiling 4 source files to <https://builds.apache.org/job/olingo-odata4/ws/samples/osgi/server/target/classes>
[INFO] 
[INFO] --- maven-resources-plugin:2.6:testResources (default-testResources) @ odata-server-osgi-sample
---
[INFO] Using 'UTF-8' encoding to copy filtered resources.
[INFO] skip non existing resourceDirectory <https://builds.apache.org/job/olingo-odata4/ws/samples/osgi/server/src/test/resources>
[INFO] Copying 3 resources
[INFO] 
[INFO] --- maven-compiler-plugin:2.3.2:testCompile (default-testCompile) @ odata-server-osgi-sample
---
[INFO] No sources to compile
[INFO] 
[INFO] --- maven-surefire-plugin:2.17:test (default-test) @ odata-server-osgi-sample ---
[INFO] 
[INFO] --- maven-bundle-plugin:3.2.0:bundle (default-bundle) @ odata-server-osgi-sample ---
[INFO] 
[INFO] --- maven-site-plugin:3.4:attach-descriptor (attach-descriptor) @ odata-server-osgi-sample
---
[INFO] 
[INFO] --- maven-failsafe-plugin:2.17:integration-test (integration-test) @ odata-server-osgi-sample
---
[INFO] 
[INFO] --- maven-source-plugin:2.2.1:jar-no-fork (attach-sources) @ odata-server-osgi-sample
---
[INFO] Building jar: <https://builds.apache.org/job/olingo-odata4/ws/samples/osgi/server/target/odata-server-osgi-sample-4.4.0-SNAPSHOT-sources.jar>
[INFO] 
[INFO] --- maven-failsafe-plugin:2.17:verify (integration-test) @ odata-server-osgi-sample
---
[INFO] Failsafe report directory: <https://builds.apache.org/job/olingo-odata4/ws/samples/osgi/server/target/failsafe-reports>
[INFO] 
[INFO] --- maven-checkstyle-plugin:2.12.1:check (checkstyle) @ odata-server-osgi-sample ---
[INFO] Starting audit...
Audit done.

[INFO] 
[INFO] --- maven-install-plugin:2.5.2:install (default-install) @ odata-server-osgi-sample
---
[INFO] Installing <https://builds.apache.org/job/olingo-odata4/ws/samples/osgi/server/target/odata-server-osgi-sample-4.4.0-SNAPSHOT.jar>
to /home/jenkins/.m2/repository/org/apache/olingo/odata-server-osgi-sample/4.4.0-SNAPSHOT/odata-server-osgi-sample-4.4.0-SNAPSHOT.jar
[INFO] Installing <https://builds.apache.org/job/olingo-odata4/ws/samples/osgi/server/pom.xml>
to /home/jenkins/.m2/repository/org/apache/olingo/odata-server-osgi-sample/4.4.0-SNAPSHOT/odata-server-osgi-sample-4.4.0-SNAPSHOT.pom
[INFO] Installing <https://builds.apache.org/job/olingo-odata4/ws/samples/osgi/server/target/odata-server-osgi-sample-4.4.0-SNAPSHOT-sources.jar>
to /home/jenkins/.m2/repository/org/apache/olingo/odata-server-osgi-sample/4.4.0-SNAPSHOT/odata-server-osgi-sample-4.4.0-SNAPSHOT-sources.jar
[INFO] 
[INFO] --- maven-bundle-plugin:3.2.0:install (default-install) @ odata-server-osgi-sample
---
[INFO] Installing org/apache/olingo/odata-server-osgi-sample/4.4.0-SNAPSHOT/odata-server-osgi-sample-4.4.0-SNAPSHOT.jar
[INFO] Writing OBR metadata
[INFO] 
[INFO] --- apache-rat-plugin:0.11:check (rat-check) @ odata-server-osgi-sample ---
[INFO] 51 implicit excludes (use -debug for more details).
[INFO] Exclude: **/target/**
[INFO] Exclude: **/META-INF/**
[INFO] Exclude: **/*.txt
[INFO] Exclude: **/*.ini
[INFO] Exclude: **/*.bin
[INFO] Exclude: **/MANIFEST.MF
[INFO] Exclude: .gitignore
[INFO] Exclude: .git/**
[INFO] Exclude: bin/**
[INFO] Exclude: **/*.local
[INFO] Exclude: **/*.project
[INFO] Exclude: **/*.classpath
[INFO] Exclude: **/*.json
[INFO] Exclude: **/*.batch
[INFO] Exclude: **/NOTICE
[INFO] Exclude: **/DEPENDENCIES
[INFO] Exclude: **/nb-configuration.xml
[INFO] Exclude: **/.externalToolBuilders/**
[INFO] Exclude: **/maven-eclipse.xml
[INFO] Exclude: **/*.iml
[INFO] Exclude: **/ref/**
[INFO] Exclude: **/server-ref/**
[INFO] Exclude: **/dependency-reduced-pom.xml
[INFO] 1 resources included (use -debug for more details)
Compiler warnings:
  WARNING:  'org.apache.xerces.jaxp.SAXParserImpl: Property 'http://javax.xml.XMLConstants/property/accessExternalDTD'
is not recognized.'
[INFO] Rat check: Summary of files. Unapproved: 0 unknown: 0 generated: 0 approved: 1 licence.
[INFO] 
[INFO] --- maven-deploy-plugin:2.8.2:deploy (default-deploy) @ odata-server-osgi-sample ---
[INFO] Skipping artifact deployment
[INFO] 
[INFO] --- maven-bundle-plugin:3.2.0:deploy (default-deploy) @ odata-server-osgi-sample ---
[INFO] Remote OBR update disabled (enable with -DremoteOBR)
[INFO] 
[INFO] ------------------------------------------------------------------------
[INFO] Building odata-karaf-fit 4.4.0-SNAPSHOT
[INFO] ------------------------------------------------------------------------
[INFO] 
[INFO] --- maven-clean-plugin:2.5:clean (default-clean) @ odata-karaf-fit ---
[INFO] Deleting <https://builds.apache.org/job/olingo-odata4/ws/ext/karaf/karaf-fit/target>
[INFO] 
[INFO] --- maven-remote-resources-plugin:1.5:process (default) @ odata-karaf-fit ---
[INFO] 
[INFO] --- depends-maven-plugin:1.2:generate-depends-file (generate-depends-file) @ odata-karaf-fit
---
[INFO] Created: <https://builds.apache.org/job/olingo-odata4/ws/ext/karaf/karaf-fit/target/classes/META-INF/maven/dependencies.properties>
[INFO] 
[INFO] --- maven-resources-plugin:2.6:resources (default-resources) @ odata-karaf-fit ---
[INFO] Using 'UTF-8' encoding to copy filtered resources.
[INFO] skip non existing resourceDirectory <https://builds.apache.org/job/olingo-odata4/ws/ext/karaf/karaf-fit/src/main/resources>
[INFO] Copying 3 resources
[INFO] 
[INFO] --- maven-compiler-plugin:2.3.2:compile (default-compile) @ odata-karaf-fit ---
[INFO] No sources to compile
[INFO] 
[INFO] --- maven-resources-plugin:2.6:testResources (default-testResources) @ odata-karaf-fit
---
[INFO] Using 'UTF-8' encoding to copy filtered resources.
[INFO] skip non existing resourceDirectory <https://builds.apache.org/job/olingo-odata4/ws/ext/karaf/karaf-fit/src/test/resources>
[INFO] Copying 3 resources
[INFO] 
[INFO] --- maven-compiler-plugin:2.3.2:testCompile (default-testCompile) @ odata-karaf-fit
---
[INFO] Compiling 3 source files to <https://builds.apache.org/job/olingo-odata4/ws/ext/karaf/karaf-fit/target/test-classes>
[INFO] 
[INFO] --- maven-surefire-plugin:2.17:test (default-test) @ odata-karaf-fit ---
[INFO] Surefire report directory: <https://builds.apache.org/job/olingo-odata4/ws/ext/karaf/karaf-fit/target/surefire-reports>

-------------------------------------------------------
 T E S T S
-------------------------------------------------------
Running org.apache.olingo.osgi.itests.BundlesTest
Tests run: 1, Failures: 0, Errors: 0, Skipped: 0, Time elapsed: 11.061 sec - in org.apache.olingo.osgi.itests.BundlesTest
Running org.apache.olingo.osgi.itests.server.CarServiceTest
Tests run: 1, Failures: 0, Errors: 1, Skipped: 0, Time elapsed: 180.323 sec <<< FAILURE!
- in org.apache.olingo.osgi.itests.server.CarServiceTest
testServiceStarted(org.apache.olingo.osgi.itests.server.CarServiceTest)  Time elapsed: 180.302
sec  <<< ERROR!
java.rmi.NotBoundException: cd3570cb-3f7a-4190-ae13-f11f6ad9d697
	at sun.rmi.registry.RegistryImpl.lookup(RegistryImpl.java:209)
	at sun.rmi.registry.RegistryImpl_Skel.dispatch(Unknown Source)
	at sun.rmi.server.UnicastServerRef.oldDispatch(UnicastServerRef.java:450)
	at sun.rmi.server.UnicastServerRef.dispatch(UnicastServerRef.java:294)
	at sun.rmi.transport.Transport$1.run(Transport.java:200)
	at sun.rmi.transport.Transport$1.run(Transport.java:197)
	at java.security.AccessController.doPrivileged(Native Method)
	at sun.rmi.transport.Transport.serviceCall(Transport.java:196)
	at sun.rmi.transport.tcp.TCPTransport.handleMessages(TCPTransport.java:568)
	at sun.rmi.transport.tcp.TCPTransport$ConnectionHandler.run0(TCPTransport.java:826)
	at sun.rmi.transport.tcp.TCPTransport$ConnectionHandler.lambda$run$0(TCPTransport.java:683)
	at java.security.AccessController.doPrivileged(Native Method)
	at sun.rmi.transport.tcp.TCPTransport$ConnectionHandler.run(TCPTransport.java:682)
	at java.util.concurrent.ThreadPoolExecutor.runWorker(ThreadPoolExecutor.java:1142)
	at java.util.concurrent.ThreadPoolExecutor$Worker.run(ThreadPoolExecutor.java:617)
	at java.lang.Thread.run(Thread.java:748)
	at sun.rmi.transport.StreamRemoteCall.exceptionReceivedFromServer(StreamRemoteCall.java:276)
	at sun.rmi.transport.StreamRemoteCall.executeCall(StreamRemoteCall.java:253)
	at sun.rmi.server.UnicastRef.invoke(UnicastRef.java:379)
	at sun.rmi.registry.RegistryImpl_Stub.lookup(Unknown Source)
	at org.ops4j.pax.exam.rbc.client.intern.RemoteBundleContextClientImpl.getRemoteBundleContext(RemoteBundleContextClientImpl.java:242)
	at org.ops4j.pax.exam.rbc.client.intern.RemoteBundleContextClientImpl.waitForState(RemoteBundleContextClientImpl.java:211)
	at org.ops4j.pax.exam.karaf.container.internal.KarafTestContainer.waitForState(KarafTestContainer.java:522)
	at org.ops4j.pax.exam.karaf.container.internal.KarafTestContainer.startKaraf(KarafTestContainer.java:204)
	at org.ops4j.pax.exam.karaf.container.internal.KarafTestContainer.start(KarafTestContainer.java:152)
	at org.ops4j.pax.exam.spi.reactors.AllConfinedStagedReactor.invoke(AllConfinedStagedReactor.java:79)
	at org.ops4j.pax.exam.junit.impl.ProbeRunner$2.evaluate(ProbeRunner.java:278)
	at org.junit.runners.ParentRunner.runLeaf(ParentRunner.java:271)
	at org.junit.runners.BlockJUnit4ClassRunner.runChild(BlockJUnit4ClassRunner.java:70)
	at org.junit.runners.BlockJUnit4ClassRunner.runChild(BlockJUnit4ClassRunner.java:50)
	at org.junit.runners.ParentRunner$3.run(ParentRunner.java:238)
	at org.junit.runners.ParentRunner$1.schedule(ParentRunner.java:63)
	at org.junit.runners.ParentRunner.runChildren(ParentRunner.java:236)
	at org.junit.runners.ParentRunner.access$000(ParentRunner.java:53)
	at org.junit.runners.ParentRunner$2.evaluate(ParentRunner.java:229)
	at org.junit.runners.ParentRunner.run(ParentRunner.java:309)
	at org.ops4j.pax.exam.junit.impl.ProbeRunner.run(ProbeRunner.java:112)
	at org.ops4j.pax.exam.junit.PaxExam.run(PaxExam.java:93)
	at org.apache.maven.surefire.junit4.JUnit4Provider.execute(JUnit4Provider.java:264)
	at org.apache.maven.surefire.junit4.JUnit4Provider.executeTestSet(JUnit4Provider.java:153)
	at org.apache.maven.surefire.junit4.JUnit4Provider.invoke(JUnit4Provider.java:124)
	at org.apache.maven.surefire.booter.ForkedBooter.invokeProviderInSameClassLoader(ForkedBooter.java:200)
	at org.apache.maven.surefire.booter.ForkedBooter.runSuitesInProcess(ForkedBooter.java:153)
	at org.apache.maven.surefire.booter.ForkedBooter.main(ForkedBooter.java:103)


Results :

Tests in error: 
  CarServiceTest.testServiceStarted ยป NotBound cd3570cb-3f7a-4190-ae13-f11f6ad9d...

Tests run: 2, Failures: 0, Errors: 1, Skipped: 0

[INFO] ------------------------------------------------------------------------
[INFO] Reactor Summary:
[INFO] 
[INFO] Olingo-OData ....................................... SUCCESS [ 17.981 s]
[INFO] odata-lib .......................................... SUCCESS [  4.885 s]
[INFO] odata-commons-api .................................. SUCCESS [ 14.991 s]
[INFO] odata-commons-core ................................. SUCCESS [ 16.180 s]
[INFO] odata-client-api ................................... SUCCESS [ 10.477 s]
[INFO] odata-client-core .................................. SUCCESS [ 18.149 s]
[INFO] odata-server-api ................................... SUCCESS [ 11.143 s]
[INFO] odata-server-core .................................. SUCCESS [ 18.220 s]
[INFO] odata-server-core-ext .............................. SUCCESS [ 18.119 s]
[INFO] odata-server-tecsvc ................................ SUCCESS [  5.323 s]
[INFO] odata-server-test .................................. SUCCESS [ 12.017 s]
[INFO] odata-ext .......................................... SUCCESS [  4.885 s]
[INFO] odata-client-proxy ................................. SUCCESS [ 10.460 s]
[INFO] pojogen-maven-plugin ............................... SUCCESS [ 35.023 s]
[INFO] odata-client-android ............................... SUCCESS [ 13.502 s]
[INFO] odata-karaf ........................................ SUCCESS [  4.878 s]
[INFO] odata-karaf-features ............................... SUCCESS [  7.081 s]
[INFO] odata-samples ...................................... SUCCESS [  0.427 s]
[INFO] odata-server-osgi-sample ........................... SUCCESS [  3.375 s]
[INFO] odata-karaf-fit .................................... FAILURE [03:15 min]
[INFO] odata-fit .......................................... SKIPPED
[INFO] odata-dist ......................................... SKIPPED
[INFO] Olingo-OData-Client-for-Android .................... SKIPPED
[INFO] Olingo-OData-Client-for-Java ....................... SKIPPED
[INFO] Olingo-OData-Server-for-Java ....................... SKIPPED
[INFO] Olingo-OData-Server-Extension-for-Java ............. SKIPPED
[INFO] Olingo-OData-JavaDoc ............................... SKIPPED
[INFO] odata-server-sample ................................ SKIPPED
[INFO] ------------------------------------------------------------------------
[INFO] BUILD FAILURE
[INFO] ------------------------------------------------------------------------
[INFO] Total time: 07:06 min
[INFO] Finished at: 2017-07-05T08:52:34Z
[INFO] Final Memory: 204M/1621M
[INFO] ------------------------------------------------------------------------
[ERROR] Failed to execute goal org.apache.maven.plugins:maven-surefire-plugin:2.17:test (default-test)
on project odata-karaf-fit: There are test failures.
[ERROR] 
[ERROR] Please refer to <https://builds.apache.org/job/olingo-odata4/ws/ext/karaf/karaf-fit/target/surefire-reports>
for the individual test results.
[ERROR] -> [Help 1]
[ERROR] 
[ERROR] To see the full stack trace of the errors, re-run Maven with the -e switch.
[ERROR] Re-run Maven using the -X switch to enable full debug logging.
[ERROR] 
[ERROR] For more information about the errors and possible solutions, please read the following
articles:
[ERROR] [Help 1] http://cwiki.apache.org/confluence/display/MAVEN/MojoFailureException
[ERROR] 
[ERROR] After correcting the problems, you can resume the build with the command
[ERROR]   mvn <goals> -rf :odata-karaf-fit
Build step 'Invoke top-level Maven targets' marked build as failure
Not sending mail to unregistered user ramya.vasanth@sap.com

Mime
View raw message