olingo-commits mailing list archives

Site index · List index
Message view « Date » · « Thread »
Top « Date » · « Thread »
From Apache Jenkins Server <jenk...@builds.apache.org>
Subject Build failed in Jenkins: olingo-odata2-quality #772
Date Thu, 08 Jun 2017 10:19:17 GMT
See <https://builds.apache.org/job/olingo-odata2-quality/772/display/redirect?page=changes>

Changes:

[archana.rai] [OLINGO-1133]Support for Accept-Language value xx-xxx-xx format

------------------------------------------
Started by an SCM change
[EnvInject] - Loading node environment variables.
Building remotely on H21 (ubuntu xenial) in workspace <https://builds.apache.org/job/olingo-odata2-quality/ws/>
Cloning the remote Git repository
Cloning repository https://git-wip-us.apache.org/repos/asf/olingo-odata2.git
 > git init <https://builds.apache.org/job/olingo-odata2-quality/ws/> # timeout=10
Fetching upstream changes from https://git-wip-us.apache.org/repos/asf/olingo-odata2.git
 > git --version # timeout=10
 > git fetch --tags --progress https://git-wip-us.apache.org/repos/asf/olingo-odata2.git
+refs/heads/*:refs/remotes/origin/*
 > git config remote.origin.url https://git-wip-us.apache.org/repos/asf/olingo-odata2.git
# timeout=10
 > git config --add remote.origin.fetch +refs/heads/*:refs/remotes/origin/* # timeout=10
 > git config remote.origin.url https://git-wip-us.apache.org/repos/asf/olingo-odata2.git
# timeout=10
Fetching upstream changes from https://git-wip-us.apache.org/repos/asf/olingo-odata2.git
 > git fetch --tags --progress https://git-wip-us.apache.org/repos/asf/olingo-odata2.git
+refs/heads/master:refs/remotes/origin/master
 > git rev-parse origin/master^{commit} # timeout=10
Checking out Revision 10133c5343cda86f9517eedb5be78182099d725b (origin/master)
 > git config core.sparsecheckout # timeout=10
 > git checkout -f 10133c5343cda86f9517eedb5be78182099d725b
 > git rev-list e55daaa259ef2903c89d51c74cdea9fe33bf7f27 # timeout=10
[olingo-odata2-quality] $ /home/jenkins/tools/maven/latest3/bin/mvn clean install -Pbuild.quality
[INFO] Scanning for projects...
[INFO] ------------------------------------------------------------------------
[INFO] Reactor Build Order:
[INFO] 
[INFO] olingo-odata2-parent
[INFO] olingo-odata2-lib
[INFO] olingo-odata2-api
[INFO] olingo-odata2-api-annotation
[INFO] olingo-odata2-testutil
[INFO] olingo-odata2-core
[INFO] olingo-odata2-ref
[INFO] olingo-odata2-fit
[INFO] olingo-odata2-ref-web
[INFO] olingo-odata2-jpa-processor
[INFO] olingo-odata2-jpa-processor-api
[INFO] olingo-odata2-jpa-processor-core
[INFO] olingo-odata2-jpa-processor-ref
[INFO] olingo-odata2-jpa-processor-ref-web
[INFO] olingo-odata2-annotation-processor
[INFO] olingo-odata2-annotation-processor-api
[INFO] olingo-odata2-annotation-processor-core
[INFO] olingo-odata2-annotation-processor-ref
[INFO] olingo-odata2-annotation-processor-ref-web
[INFO] olingo-odata2-dist
[INFO] olingo-odata2-dist-lib
[INFO] olingo-odata2-dist-jpa
[INFO] olingo-odata2-dist-janos
[INFO] olingo-odata2-dist-ref
[INFO] olingo-odata2-dist-javadoc
[INFO] olingo-odata2-sample
[INFO] olingo-odata2-sample-cars-service-archetype
[INFO] olingo-odata2-sample-cars-annotation-archetype
[INFO] olingo-odata2-sample-cars-jpa-archetype
[INFO] 
[INFO] ------------------------------------------------------------------------
[INFO] Building olingo-odata2-parent 2.0.9-SNAPSHOT
[INFO] ------------------------------------------------------------------------
[INFO] 
[INFO] --- maven-clean-plugin:2.5:clean (default-clean) @ olingo-odata2-parent ---
[INFO] 
[INFO] --- buildnumber-maven-plugin:1.2:create (default) @ olingo-odata2-parent ---
[INFO] Checking for local modifications: skipped.
[INFO] Updating project files from SCM: skipped.
[INFO] Executing: /bin/sh -c cd <https://builds.apache.org/job/olingo-odata2-quality/ws/>
&& svn --non-interactive info
[INFO] Working directory: <https://builds.apache.org/job/olingo-odata2-quality/ws/>
[INFO] Storing buildNumber: ? at timestamp: 2017-06-08T10:19:08+0000
[INFO] Executing: /bin/sh -c cd <https://builds.apache.org/job/olingo-odata2-quality/ws/>
&& svn --non-interactive info
[INFO] Working directory: <https://builds.apache.org/job/olingo-odata2-quality/ws/>
[INFO] Storing buildScmBranch: UNKNOWN_BRANCH
[INFO] 
[INFO] --- maven-remote-resources-plugin:1.5:process (default) @ olingo-odata2-parent ---
[INFO] 
[INFO] --- apache-rat-plugin:0.9:rat (rat-check) @ olingo-odata2-parent ---
[INFO] 56 implicit excludes (use -debug for more details).
[INFO] Exclude: **/MANIFEST.MF
[INFO] Exclude: .gitignore
[INFO] Exclude: .git/**
[INFO] Exclude: bin/**
[INFO] Exclude: **/*.project
[INFO] Exclude: **/*.classpath
[INFO] Exclude: **/*.json
[INFO] Exclude: **/*.batch
[INFO] Exclude: **/NOTICE
[INFO] Exclude: **/DEPENDENCIES
[INFO] Exclude: **/goal.txt
[INFO] Exclude: **/target/**
[INFO] Exclude: **/*.iml
[INFO] Exclude: .repository/**
[INFO] 19 resources included (use -debug for more details)
Warning: org.apache.xerces.jaxp.SAXParserImpl$JAXPSAXParser: Property 'http://www.oracle.com/xml/jaxp/properties/entityExpansionLimit'
is not recognized.
Compiler warnings:
  WARNING:  'org.apache.xerces.jaxp.SAXParserImpl: Property 'http://javax.xml.XMLConstants/property/accessExternalDTD'
is not recognized.'
Warning: org.apache.xerces.parsers.SAXParser: Feature 'http://javax.xml.XMLConstants/feature/secure-processing'
is not recognized.
Warning: org.apache.xerces.parsers.SAXParser: Property 'http://javax.xml.XMLConstants/property/accessExternalDTD'
is not recognized.
Warning: org.apache.xerces.parsers.SAXParser: Property 'http://www.oracle.com/xml/jaxp/properties/entityExpansionLimit'
is not recognized.
[INFO] 
[INFO] --- apache-rat-plugin:0.9:check (rat-check) @ olingo-odata2-parent ---
[INFO] 56 implicit excludes (use -debug for more details).
[INFO] Exclude: **/MANIFEST.MF
[INFO] Exclude: .gitignore
[INFO] Exclude: .git/**
[INFO] Exclude: bin/**
[INFO] Exclude: **/*.project
[INFO] Exclude: **/*.classpath
[INFO] Exclude: **/*.json
[INFO] Exclude: **/*.batch
[INFO] Exclude: **/NOTICE
[INFO] Exclude: **/DEPENDENCIES
[INFO] Exclude: **/goal.txt
[INFO] Exclude: **/target/**
[INFO] Exclude: **/*.iml
[INFO] Exclude: .repository/**
[INFO] 19 resources included (use -debug for more details)
Compiler warnings:
  WARNING:  'org.apache.xerces.jaxp.SAXParserImpl: Property 'http://javax.xml.XMLConstants/property/accessExternalDTD'
is not recognized.'
[INFO] Rat check: Summary of files. Unapproved: 1 unknown: 1 generated: 0 approved: 16 licence.
[INFO] ------------------------------------------------------------------------
[INFO] Reactor Summary:
[INFO] 
[INFO] olingo-odata2-parent ............................... FAILURE [  5.928 s]
[INFO] olingo-odata2-lib .................................. SKIPPED
[INFO] olingo-odata2-api .................................. SKIPPED
[INFO] olingo-odata2-api-annotation ....................... SKIPPED
[INFO] olingo-odata2-testutil ............................. SKIPPED
[INFO] olingo-odata2-core ................................. SKIPPED
[INFO] olingo-odata2-ref .................................. SKIPPED
[INFO] olingo-odata2-fit .................................. SKIPPED
[INFO] olingo-odata2-ref-web .............................. SKIPPED
[INFO] olingo-odata2-jpa-processor ........................ SKIPPED
[INFO] olingo-odata2-jpa-processor-api .................... SKIPPED
[INFO] olingo-odata2-jpa-processor-core ................... SKIPPED
[INFO] olingo-odata2-jpa-processor-ref .................... SKIPPED
[INFO] olingo-odata2-jpa-processor-ref-web ................ SKIPPED
[INFO] olingo-odata2-annotation-processor ................. SKIPPED
[INFO] olingo-odata2-annotation-processor-api ............. SKIPPED
[INFO] olingo-odata2-annotation-processor-core ............ SKIPPED
[INFO] olingo-odata2-annotation-processor-ref ............. SKIPPED
[INFO] olingo-odata2-annotation-processor-ref-web ......... SKIPPED
[INFO] olingo-odata2-dist ................................. SKIPPED
[INFO] olingo-odata2-dist-lib ............................. SKIPPED
[INFO] olingo-odata2-dist-jpa ............................. SKIPPED
[INFO] olingo-odata2-dist-janos ........................... SKIPPED
[INFO] olingo-odata2-dist-ref ............................. SKIPPED
[INFO] olingo-odata2-dist-javadoc ......................... SKIPPED
[INFO] olingo-odata2-sample ............................... SKIPPED
[INFO] olingo-odata2-sample-cars-service-archetype ........ SKIPPED
[INFO] olingo-odata2-sample-cars-annotation-archetype ..... SKIPPED
[INFO] olingo-odata2-sample-cars-jpa-archetype ............ SKIPPED
[INFO] ------------------------------------------------------------------------
[INFO] BUILD FAILURE
[INFO] ------------------------------------------------------------------------
[INFO] Total time: 7.671 s
[INFO] Finished at: 2017-06-08T10:19:12Z
[INFO] Final Memory: 30M/1171M
[INFO] ------------------------------------------------------------------------
[ERROR] Failed to execute goal org.apache.rat:apache-rat-plugin:0.9:check (rat-check) on project
olingo-odata2-parent: Too many files with unapproved license: 1 See RAT report in: <https://builds.apache.org/job/olingo-odata2-quality/ws/target/rat.txt>
-> [Help 1]
[ERROR] 
[ERROR] To see the full stack trace of the errors, re-run Maven with the -e switch.
[ERROR] Re-run Maven using the -X switch to enable full debug logging.
[ERROR] 
[ERROR] For more information about the errors and possible solutions, please read the following
articles:
[ERROR] [Help 1] http://cwiki.apache.org/confluence/display/MAVEN/MojoFailureException
Build step 'Invoke top-level Maven targets' marked build as failure
Not sending mail to unregistered user archana.rai@sap.com

Mime
View raw message