olingo-commits mailing list archives

Site index · List index
Message view « Date » · « Thread »
Top « Date » · « Thread »
From Apache Jenkins Server <jenk...@builds.apache.org>
Subject Build failed in Jenkins: olingo-odata2 #1297
Date Wed, 24 Aug 2016 20:43:26 GMT
See <https://builds.apache.org/job/olingo-odata2/1297/changes>

Changes:

[mibo] [OLINGO-994] Fixed empty content tag

------------------------------------------
Started by an SCM change
[EnvInject] - Loading node environment variables.
Building remotely on ubuntu3 (ubuntu-12.04 legacy-ubuntu) in workspace <https://builds.apache.org/job/olingo-odata2/ws/>
 > git rev-parse --is-inside-work-tree # timeout=10
Fetching changes from the remote Git repository
 > git config remote.origin.url https://git-wip-us.apache.org/repos/asf/olingo-odata2.git
# timeout=10
Fetching upstream changes from https://git-wip-us.apache.org/repos/asf/olingo-odata2.git
 > git --version # timeout=10
 > git -c core.askpass=true fetch --tags --progress https://git-wip-us.apache.org/repos/asf/olingo-odata2.git
+refs/heads/master:refs/remotes/origin/master
 > git rev-parse origin/master^{commit} # timeout=10
Checking out Revision 6bc60b47f61d8c52d3430c15d5f4d4bc77a45b7a (origin/master)
 > git config core.sparsecheckout # timeout=10
 > git checkout -f 6bc60b47f61d8c52d3430c15d5f4d4bc77a45b7a
 > git rev-list 8d90a160634b6df41b011825bbbb9bc038d95bd7 # timeout=10
[olingo-odata2] $ /home/jenkins/tools/maven/latest3/bin/mvn clean deploy
[INFO] Scanning for projects...
[INFO] ------------------------------------------------------------------------
[INFO] Reactor Build Order:
[INFO] 
[INFO] olingo-odata2-parent
[INFO] olingo-odata2-lib
[INFO] olingo-odata2-api
[INFO] olingo-odata2-api-annotation
[INFO] olingo-odata2-testutil
[INFO] olingo-odata2-core
[INFO] olingo-odata2-ref
[INFO] olingo-odata2-fit
[INFO] olingo-odata2-ref-web
[INFO] olingo-odata2-jpa-processor
[INFO] olingo-odata2-jpa-processor-api
[INFO] olingo-odata2-jpa-processor-core
[INFO] olingo-odata2-jpa-processor-ref
[INFO] olingo-odata2-jpa-processor-ref-web
[INFO] olingo-odata2-annotation-processor
[INFO] olingo-odata2-annotation-processor-api
[INFO] olingo-odata2-annotation-processor-core
[INFO] olingo-odata2-annotation-processor-ref
[INFO] olingo-odata2-annotation-processor-ref-web
[INFO] olingo-odata2-dist
[INFO] olingo-odata2-dist-lib
[INFO] olingo-odata2-dist-jpa
[INFO] olingo-odata2-dist-janos
[INFO] olingo-odata2-dist-ref
[INFO] olingo-odata2-dist-javadoc
[INFO] olingo-odata2-sample
[INFO] olingo-odata2-sample-cars-service-archetype
[INFO] olingo-odata2-sample-cars-annotation-archetype
[INFO] olingo-odata2-sample-cars-jpa-archetype
[INFO] 
[INFO] Using the builder org.apache.maven.lifecycle.internal.builder.singlethreaded.SingleThreadedBuilder
with a thread count of 1
[INFO]                                                                         
[INFO] ------------------------------------------------------------------------
[INFO] Building olingo-odata2-parent 2.0.8-SNAPSHOT
[INFO] ------------------------------------------------------------------------
[INFO] 
[INFO] --- maven-clean-plugin:2.5:clean (default-clean) @ olingo-odata2-parent ---
[INFO] Deleting /x1/jenkins/jenkins-slave/workspace/olingo-odata2/target
[INFO] 
[INFO] --- buildnumber-maven-plugin:1.2:create (default) @ olingo-odata2-parent ---
[INFO] Checking for local modifications: skipped.
[INFO] Updating project files from SCM: skipped.
[INFO] Executing: /bin/sh -c cd /x1/jenkins/jenkins-slave/workspace/olingo-odata2 &&
svn --non-interactive info
[INFO] Working directory: /x1/jenkins/jenkins-slave/workspace/olingo-odata2
[INFO] Storing buildNumber: ? at timestamp: 2016-08-24T20:43:25+0000
[INFO] Executing: /bin/sh -c cd /x1/jenkins/jenkins-slave/workspace/olingo-odata2 &&
svn --non-interactive info
[INFO] Working directory: /x1/jenkins/jenkins-slave/workspace/olingo-odata2
[INFO] Storing buildScmBranch: UNKNOWN_BRANCH
[INFO] 
[INFO] --- maven-remote-resources-plugin:1.5:process (default) @ olingo-odata2-parent ---
[INFO] 
[INFO] --- maven-site-plugin:3.2:attach-descriptor (attach-descriptor) @ olingo-odata2-parent
---
[INFO] 
[INFO] --- maven-source-plugin:2.2.1:jar-no-fork (attach-sources) @ olingo-odata2-parent ---
[INFO] 
[INFO] --- maven-checkstyle-plugin:2.10:check (checkstyle) @ olingo-odata2-parent ---
[INFO] Starting audit...
Audit done.

[INFO] 
[INFO] --- maven-install-plugin:2.3.1:install (default-install) @ olingo-odata2-parent ---
[INFO] Installing /x1/jenkins/jenkins-slave/workspace/olingo-odata2/pom.xml to /home/jenkins/.m2/repository/org/apache/olingo/olingo-odata2-parent/2.0.8-SNAPSHOT/olingo-odata2-parent-2.0.8-SNAPSHOT.pom
[INFO] 
[INFO] --- maven-deploy-plugin:2.7:deploy (default-deploy) @ olingo-odata2-parent ---
Downloading: https://repository.apache.org/content/repositories/snapshots/org/apache/olingo/olingo-odata2-parent/2.0.8-SNAPSHOT/maven-metadata.xml

[WARNING] Could not transfer metadata org.apache.olingo:olingo-odata2-parent:2.0.8-SNAPSHOT/maven-metadata.xml
from/to apache.snapshots.https (https://repository.apache.org/content/repositories/snapshots):
java.lang.RuntimeException: Could not generate DH keypair
[INFO] ------------------------------------------------------------------------
[INFO] Reactor Summary:
[INFO] 
[INFO] olingo-odata2-parent .............................. FAILURE [  4.548 s]
[INFO] olingo-odata2-lib ................................. SKIPPED
[INFO] olingo-odata2-api ................................. SKIPPED
[INFO] olingo-odata2-api-annotation ...................... SKIPPED
[INFO] olingo-odata2-testutil ............................ SKIPPED
[INFO] olingo-odata2-core ................................ SKIPPED
[INFO] olingo-odata2-ref ................................. SKIPPED
[INFO] olingo-odata2-fit ................................. SKIPPED
[INFO] olingo-odata2-ref-web ............................. SKIPPED
[INFO] olingo-odata2-jpa-processor ....................... SKIPPED
[INFO] olingo-odata2-jpa-processor-api ................... SKIPPED
[INFO] olingo-odata2-jpa-processor-core .................. SKIPPED
[INFO] olingo-odata2-jpa-processor-ref ................... SKIPPED
[INFO] olingo-odata2-jpa-processor-ref-web ............... SKIPPED
[INFO] olingo-odata2-annotation-processor ................ SKIPPED
[INFO] olingo-odata2-annotation-processor-api ............ SKIPPED
[INFO] olingo-odata2-annotation-processor-core ........... SKIPPED
[INFO] olingo-odata2-annotation-processor-ref ............ SKIPPED
[INFO] olingo-odata2-annotation-processor-ref-web ........ SKIPPED
[INFO] olingo-odata2-dist ................................ SKIPPED
[INFO] olingo-odata2-dist-lib ............................ SKIPPED
[INFO] olingo-odata2-dist-jpa ............................ SKIPPED
[INFO] olingo-odata2-dist-janos .......................... SKIPPED
[INFO] olingo-odata2-dist-ref ............................ SKIPPED
[INFO] olingo-odata2-dist-javadoc ........................ SKIPPED
[INFO] olingo-odata2-sample .............................. SKIPPED
[INFO] olingo-odata2-sample-cars-service-archetype ....... SKIPPED
[INFO] olingo-odata2-sample-cars-annotation-archetype .... SKIPPED
[INFO] olingo-odata2-sample-cars-jpa-archetype ........... SKIPPED
[INFO] ------------------------------------------------------------------------
[INFO] BUILD FAILURE
[INFO] ------------------------------------------------------------------------
[INFO] Total time: 5.523 s
[INFO] Finished at: 2016-08-24T20:43:29+00:00
[INFO] Final Memory: 18M/153M
[INFO] ------------------------------------------------------------------------
[ERROR] Failed to execute goal org.apache.maven.plugins:maven-deploy-plugin:2.7:deploy (default-deploy)
on project olingo-odata2-parent: Failed to retrieve remote metadata org.apache.olingo:olingo-odata2-parent:2.0.8-SNAPSHOT/maven-metadata.xml:
Could not transfer metadata org.apache.olingo:olingo-odata2-parent:2.0.8-SNAPSHOT/maven-metadata.xml
from/to apache.snapshots.https (https://repository.apache.org/content/repositories/snapshots):
java.lang.RuntimeException: Could not generate DH keypair: Prime size must be multiple of
64, and can only range from 512 to 1024 (inclusive) -> [Help 1]
[ERROR] 
[ERROR] To see the full stack trace of the errors, re-run Maven with the -e switch.
[ERROR] Re-run Maven using the -X switch to enable full debug logging.
[ERROR] 
[ERROR] For more information about the errors and possible solutions, please read the following
articles:
[ERROR] [Help 1] http://cwiki.apache.org/confluence/display/MAVEN/MojoExecutionException
Build step 'Invoke top-level Maven targets' marked build as failure

Mime
View raw message