olingo-commits mailing list archives

Site index · List index
Message view « Date » · « Thread »
Top « Date » · « Thread »
From Apache Jenkins Server <jenk...@builds.apache.org>
Subject Build failed in Jenkins: olingo-odata4 #1361
Date Tue, 26 Jul 2016 09:15:18 GMT
See <https://builds.apache.org/job/olingo-odata4/1361/changes>

Changes:

[christian.amend] [OLINGO-988] Prevent duplicate ExpandItems in ExpandTreeBuilder

------------------------------------------
[...truncated 785 lines...]
1948/2319 KB   
1952/2319 KB   
1956/2319 KB   
1960/2319 KB   
1964/2319 KB   
1968/2319 KB   
1972/2319 KB   
1976/2319 KB   
1980/2319 KB   
1984/2319 KB   
1988/2319 KB   
1992/2319 KB   
1996/2319 KB   
2000/2319 KB   
2004/2319 KB   
2008/2319 KB   
2012/2319 KB   
2016/2319 KB   
2020/2319 KB   
2024/2319 KB   
2028/2319 KB   
2032/2319 KB   
2036/2319 KB   
2040/2319 KB   
2044/2319 KB   
2048/2319 KB   
2052/2319 KB   
2056/2319 KB   
2060/2319 KB   
2064/2319 KB   
2068/2319 KB   
2072/2319 KB   
2076/2319 KB   
2080/2319 KB   
2084/2319 KB   
2088/2319 KB   
2092/2319 KB   
2096/2319 KB   
2100/2319 KB   
2104/2319 KB   
2108/2319 KB   
2112/2319 KB   
2116/2319 KB   
2120/2319 KB   
2124/2319 KB   
2128/2319 KB   
2132/2319 KB   
2136/2319 KB   
2140/2319 KB   
2144/2319 KB   
2148/2319 KB   
2152/2319 KB   
2156/2319 KB   
2160/2319 KB   
2164/2319 KB   
2168/2319 KB   
2172/2319 KB   
2176/2319 KB   
2180/2319 KB   
2184/2319 KB   
2188/2319 KB   
2192/2319 KB   
2196/2319 KB   
2200/2319 KB   
2204/2319 KB   
2208/2319 KB   
2212/2319 KB   
2216/2319 KB   
2220/2319 KB   
2224/2319 KB   
2228/2319 KB   
2232/2319 KB   
2236/2319 KB   
2240/2319 KB   
2244/2319 KB   
2248/2319 KB   
2252/2319 KB   
2256/2319 KB   
2260/2319 KB   
2264/2319 KB   
2268/2319 KB   
2272/2319 KB   
2276/2319 KB   
2280/2319 KB   
2284/2319 KB   
2288/2319 KB   
2292/2319 KB   
2296/2319 KB   
2300/2319 KB   
2304/2319 KB   
2308/2319 KB   
2312/2319 KB   
2316/2319 KB   
2319/2319 KB   
               
Downloaded: https://repo.maven.apache.org/maven2/biz/aQute/bnd/biz.aQute.bndlib/3.2.0/biz.aQute.bndlib-3.2.0.jar
(2319 KB at 3275.1 KB/sec)
[WARNING] 
[WARNING] Some problems were encountered while building the effective model for org.apache.olingo:odata-server-osgi-sample:bundle:4.3.0-SNAPSHOT
[WARNING] 'build.plugins.plugin.version' for org.apache.felix:maven-bundle-plugin is missing.
@ org.apache.olingo:odata-server-osgi-sample:[unknown-version], <https://builds.apache.org/job/olingo-odata4/ws/samples/osgi/server/pom.xml,>
line 93, column 15
[WARNING] 
[WARNING] It is highly recommended to fix these problems because they threaten the stability
of your build.
[WARNING] 
[WARNING] For this reason, future Maven versions might no longer support building such malformed
projects.
[WARNING] 
[INFO] ------------------------------------------------------------------------
[INFO] Reactor Build Order:
[INFO] 
[INFO] Olingo-OData
[INFO] odata-lib
[INFO] odata-commons-api
[INFO] odata-commons-core
[INFO] odata-client-api
[INFO] odata-client-core
[INFO] odata-server-api
[INFO] odata-server-core
[INFO] odata-server-core-ext
[INFO] odata-server-tecsvc
[INFO] odata-server-test
[INFO] odata-ext
[INFO] odata-client-proxy
[INFO] pojogen-maven-plugin
[INFO] odata-client-android
[INFO] odata-karaf
[INFO] odata-karaf-features
[INFO] odata-samples
[INFO] odata-server-osgi-sample
[INFO] odata-karaf-fit
[INFO] odata-fit
[INFO] odata-dist
[INFO] Olingo-OData-Client-for-Android
[INFO] Olingo-OData-Client-for-Java
[INFO] Olingo-OData-Server-for-Java
[INFO] Olingo-OData-Server-Extension-for-Java
[INFO] Olingo-OData-JavaDoc
[INFO] odata-server-sample
[INFO]                                                                         
[INFO] ------------------------------------------------------------------------
[INFO] Building Olingo-OData 4.3.0-SNAPSHOT
[INFO] ------------------------------------------------------------------------
[INFO] 
[INFO] --- maven-clean-plugin:2.5:clean (default-clean) @ odata-parent ---
[INFO] 
[INFO] --- maven-remote-resources-plugin:1.5:process (default) @ odata-parent ---
[INFO] 
[INFO] --- maven-site-plugin:3.4:attach-descriptor (attach-descriptor) @ odata-parent ---
[INFO] 
[INFO] --- maven-failsafe-plugin:2.17:integration-test (integration-test) @ odata-parent ---
[INFO] No tests to run.
[INFO] 
[INFO] --- maven-source-plugin:2.2.1:jar-no-fork (attach-sources) @ odata-parent ---
[INFO] 
[INFO] --- maven-failsafe-plugin:2.17:verify (integration-test) @ odata-parent ---
[INFO] No tests to run.
[INFO] 
[INFO] --- maven-checkstyle-plugin:2.12.1:check (checkstyle) @ odata-parent ---
[INFO] Starting audit...
Audit done.

[INFO] 
[INFO] --- maven-install-plugin:2.5.2:install (default-install) @ odata-parent ---
[INFO] Installing <https://builds.apache.org/job/olingo-odata4/ws/pom.xml> to /home/jenkins/.m2/repository/org/apache/olingo/odata-parent/4.3.0-SNAPSHOT/odata-parent-4.3.0-SNAPSHOT.pom
[INFO] 
[INFO] --- apache-rat-plugin:0.11:check (rat-check) @ odata-parent ---
[INFO] 56 implicit excludes (use -debug for more details).
[INFO] Exclude: **/target/**
[INFO] Exclude: **/META-INF/**
[INFO] Exclude: **/*.txt
[INFO] Exclude: **/*.ini
[INFO] Exclude: **/*.bin
[INFO] Exclude: **/MANIFEST.MF
[INFO] Exclude: .gitignore
[INFO] Exclude: .git/**
[INFO] Exclude: bin/**
[INFO] Exclude: **/*.local
[INFO] Exclude: **/*.project
[INFO] Exclude: **/*.classpath
[INFO] Exclude: **/*.json
[INFO] Exclude: **/*.batch
[INFO] Exclude: **/NOTICE
[INFO] Exclude: **/DEPENDENCIES
[INFO] Exclude: **/nb-configuration.xml
[INFO] Exclude: **/.externalToolBuilders/**
[INFO] Exclude: **/maven-eclipse.xml
[INFO] Exclude: **/*.iml
[INFO] Exclude: **/ref/**
[INFO] Exclude: **/server-ref/**
[INFO] Exclude: **/dependency-reduced-pom.xml
[INFO] 7 resources included (use -debug for more details)
Warning:  org.apache.xerces.jaxp.SAXParserImpl$JAXPSAXParser: Property 'http://www.oracle.com/xml/jaxp/properties/entityExpansionLimit'
is not recognized.
Compiler warnings:
  WARNING:  'org.apache.xerces.jaxp.SAXParserImpl: Property 'http://javax.xml.XMLConstants/property/accessExternalDTD'
is not recognized.'
Warning:  org.apache.xerces.parsers.SAXParser: Feature 'http://javax.xml.XMLConstants/feature/secure-processing'
is not recognized.
Warning:  org.apache.xerces.parsers.SAXParser: Property 'http://javax.xml.XMLConstants/property/accessExternalDTD'
is not recognized.
Warning:  org.apache.xerces.parsers.SAXParser: Property 'http://www.oracle.com/xml/jaxp/properties/entityExpansionLimit'
is not recognized.
[INFO] Rat check: Summary of files. Unapproved: 0 unknown: 0 generated: 0 approved: 5 licence.
[INFO] 
[INFO] --- maven-deploy-plugin:2.8.2:deploy (default-deploy) @ odata-parent ---
Downloading: https://repository.apache.org/content/repositories/snapshots/org/apache/olingo/odata-parent/4.3.0-SNAPSHOT/maven-metadata.xml
608/608 B      
            
Downloaded: https://repository.apache.org/content/repositories/snapshots/org/apache/olingo/odata-parent/4.3.0-SNAPSHOT/maven-metadata.xml
(608 B at 0.0 KB/sec)
Uploading: https://repository.apache.org/content/repositories/snapshots/org/apache/olingo/odata-parent/4.3.0-SNAPSHOT/odata-parent-4.3.0-20160726.091309-20.pom
            
[INFO] ------------------------------------------------------------------------
[INFO] Reactor Summary:
[INFO] 
[INFO] Olingo-OData ....................................... FAILURE [02:40 min]
[INFO] odata-lib .......................................... SKIPPED
[INFO] odata-commons-api .................................. SKIPPED
[INFO] odata-commons-core ................................. SKIPPED
[INFO] odata-client-api ................................... SKIPPED
[INFO] odata-client-core .................................. SKIPPED
[INFO] odata-server-api ................................... SKIPPED
[INFO] odata-server-core .................................. SKIPPED
[INFO] odata-server-core-ext .............................. SKIPPED
[INFO] odata-server-tecsvc ................................ SKIPPED
[INFO] odata-server-test .................................. SKIPPED
[INFO] odata-ext .......................................... SKIPPED
[INFO] odata-client-proxy ................................. SKIPPED
[INFO] pojogen-maven-plugin ............................... SKIPPED
[INFO] odata-client-android ............................... SKIPPED
[INFO] odata-karaf ........................................ SKIPPED
[INFO] odata-karaf-features ............................... SKIPPED
[INFO] odata-samples ...................................... SKIPPED
[INFO] odata-server-osgi-sample ........................... SKIPPED
[INFO] odata-karaf-fit .................................... SKIPPED
[INFO] odata-fit .......................................... SKIPPED
[INFO] odata-dist ......................................... SKIPPED
[INFO] Olingo-OData-Client-for-Android .................... SKIPPED
[INFO] Olingo-OData-Client-for-Java ....................... SKIPPED
[INFO] Olingo-OData-Server-for-Java ....................... SKIPPED
[INFO] Olingo-OData-Server-Extension-for-Java ............. SKIPPED
[INFO] Olingo-OData-JavaDoc ............................... SKIPPED
[INFO] odata-server-sample ................................ SKIPPED
[INFO] ------------------------------------------------------------------------
[INFO] BUILD FAILURE
[INFO] ------------------------------------------------------------------------
[INFO] Total time: 02:45 min
[INFO] Finished at: 2016-07-26T09:15:16+00:00
[INFO] Final Memory: 37M/1035M
[INFO] ------------------------------------------------------------------------
[ERROR] Failed to execute goal org.apache.maven.plugins:maven-deploy-plugin:2.8.2:deploy (default-deploy)
on project odata-parent: Failed to deploy artifacts: Could not transfer artifact org.apache.olingo:odata-parent:pom:4.3.0-20160726.091309-20
from/to apache.snapshots.https (https://repository.apache.org/content/repositories/snapshots):
Connect to repository.apache.org:443 [repository.apache.org/207.244.88.143] failed: Connection
timed out -> [Help 1]
[ERROR] 
[ERROR] To see the full stack trace of the errors, re-run Maven with the -e switch.
[ERROR] Re-run Maven using the -X switch to enable full debug logging.
[ERROR] 
[ERROR] For more information about the errors and possible solutions, please read the following
articles:
[ERROR] [Help 1] http://cwiki.apache.org/confluence/display/MAVEN/MojoExecutionException
Build step 'Invoke top-level Maven targets' marked build as failure

Mime
View raw message